##TITLE=$$ Begin of the data block
##JCAMP-DX=5.00 $$ ACD/SpecManager v 10.08
##SPECTROMETER/DATA SYSTEM=Alpha
##DATE=13 Jun 2014 08:26:00
##DATA TYPE=INFRARED SPECTRUM
##DATA CLASS=XYDATA
##ORIGIN=
##OWNER=
##NPOINTS=1765
##FIRSTX=399.75695801
##LASTX=3997.56933594
##MAXX=3997.56933594
##MINX=399.75695801
##MAXY=0.72372735
##MINY=0.03797878
##XFACTOR=1.0000000000
##YFACTOR=1.000000000000000e-9
##FIRSTY=0.28892362
##DELTAX=2.03957629
##XUNITS=1/CM
##YUNITS=ARBITRARY UNITS
##XYDATA=(X++(Y..Y))
399.8B88923621R724885Q811206R214044J0276675J0096401R560734R955138R736180
$$ 288923621 298648506 307459712 316673756 326950431 337046832 346607566 356562704 366298884
416.1C66298884R603322R662658Q235186P178575P351041Q139848P518560N683780
$$ 366298884 375902206 385564864 393800050 400978625 408329666 416469514 423988074 429671854
432.4D29671854N921542O975592N762994M695237N624860N493224L921926M042625
$$ 429671854 435593396 442568988 448331982 453027219 458652079 464145303 468067229 472109854
448.7D72109854N017638M138887L038198L981888L969640K092779K171546L235429
$$ 472109854 477127492 481266379 484304577 488286465 492256105 494348884 496520430 499755859
465D99755859K566755J996815L249348L661275K163469K039135L174424K787292K049088
$$ 499755859 502322614 504319429 507568777 511230052 513393521 515432656 518607080 521394372 523443460
483.4E23443460K827943L037393J794398J669943K655149K154350J039922J637578
$$ 523443460 526271403 529308796 531103194 532773137 535428286 537582636 538622558 540260136
499.7E40260136K270520J143634P15077J562834J312017M16458Q38816J521170O40393
$$ 540260136 542530656 543674290 544389367 545952201 547264218 547680676 548519492 550040662 550681055
518.1E50681055j63675O87182J090288J57535K51174J360596J171171M26054J001418
$$ 550681055 550517380 551204562 552294850 552452385 552703559 554064155 555235326 555661380 556662798
536.4E56662798J616061Q97467M73082J123309J096487J41263J02043P27058K29776
$$ 556662798 558278859 559176326 559649408 560772717 561869204 562010467 562112510 562839568 563069344
554.8E63069344o03080j50383M11451m2975o5267O30617L04044o08385k81215M07994
$$ 563069344 562466264 562315881 562727332 562684357 562619090 563249707 563553751 562945366 562664151 563072145
575.2E63072145J2517k47240N67675R75251M13537M40001J108289Q15868M352K22444
$$ 563072145 563084662 562837422 563405097 564380348 564793885 565233886 566342175 567158043 567162395 567384839
595.6E67384839N88417j97708r29475p09534q64685j540958j177490q3149J45614q0347
$$ 567384839 567973256 567775548 566846073 566136539 565271854 563730896 562553406 562470257 562615871 562535524
616E62535524N43714J243532R25898P33197J199007J021981M58420R53078J759112
$$ 562535524 563079238 564322770 565248668 565981865 567180872 568202853 568661273 569614351 571373463
634.3E71373463J404822Q77857J337349J438618N09202J52648N29826J30057o72937
$$ 571373463 572778285 573656142 574993491 576432109 576941311 577093959 577623785 577753842 577080905
652.7E77080905m88817j36972p84993j123726l51370O616p79628q41916L98159K29478
$$ 577080905 576592088 576455116 575670123 574546397 574195027 574201643 573422015 572580099 572978258 573207736
673.1E73207736l29137J51456M56392m43756r92716o04808r59754k213597k739072
$$ 573207736 572878599 573030055 573486447 573042691 572049975 571445167 570485413 568271816 565532744
691.4E65532744l008902m502237o147742o509543o962299q869529j0595202j0775447
$$ 565532744 562523842 558021605 551873863 545364320 538402021 529532492 518937290 508161843
707.7E08161843j0153532q700431o306856m480452l406822m81844N201041J1047513
$$ 508161843 498008311 489307880 483001024 478520572 475113750 474631906 479832947 490880460
724D90880460J5119940J7741620J8931806J7756522J4830947J2136280R744645O823658
$$ 490880460 506000400 523742020 542673826 560430348 575261295 587397575 597142220 603965878
740.4F03965878M499674L707707K924919J512230J006543J369298R67622J40428K88964
$$ 603965878 608465552 612173259 615098178 616610408 617616951 618986249 619953871 620094299 620383263
758.7F20383263N99265n2691l46064M50551O54161N3525K84076R94861O91771J54973
$$ 620383263 620982528 620929837 620583773 621034324 621688485 621742010 622026086 623020947 623712718 623867691
779.1F23867691O54459R93311K38061j94490K87473J51754o37591m41313K41101p6831
$$ 623867691 624522150 625515461 625753522 625559032 625846505 625998259 625360668 624919355 625160456 625083625
799.5F25083625n56826p3850J54614o49571j006782m84169o61075j468718j426280
$$ 625083625 624526799 624452949 624607563 623957992 622951210 622467041 621805966 620337248 618910968
817.9F18910968j066327j589298k219439k060771k239883l281176l842115l868938
$$ 618910968 617844641 616255343 614035904 611975133 609735250 606454074 602611959 598743021
834.2E98743021m685878n939365o672263q060515j1594057j4460981j1171400m607797
$$ 598743021 594057143 588117778 581445515 573385000 561790943 547329962 536158562 531550765
850.5E31550765l807664q685708j3476491j7672688k2924930k9820799m0361911n6332767
$$ 531550765 527743101 519057393 505580902 487908214 464983284 435162485 394800574 338467807
866.8C38467807o9637329o2965616l6350996j0565817O395087K2491768L9856672N4288551
$$ 338467807 268830478 205864862 169513866 158948049 165343136 187834904 227691576 281980127
883.1B81980127O4008564O7575842O1761200M8098654L3811271K3470760J6454458
$$ 281980127 345988691 413564533 475325733 523424387 557235658 580706418 597160876
897.4E97160876J1896610R471119P569253N475461M267514L789842K643347J330793
$$ 597160876 609057486 618528605 626097858 631573319 635840833 639630675 642274022 643604815
913.7F43604815J125097J049161M3392n59628j98900l89576j153112r59754k62499
$$ 643604815 644729912 645779073 645822465 645262837 645063937 644674361 643521249 642561495 642298996
932.1F42298996n20050q78930k41399J23441m76837n94854r0480n27740j598358j736879
$$ 642298996 641778946 640900016 640658617 640782058 640305221 639710367 639619887 639092147 637493789 635756910
952.5F35756910j578510k378881l088891k812028k874196l782690m081428l692865
$$ 635756910 634178400 631799519 628710628 625898600 623024404 619241714 615160286 611467421
968.8F11467421m081726n037606n310118n529284o647826p600963p658720p868469
$$ 611467421 607385695 602348089 597037971 591508687 584860861 577259898 569601178 561732709
985.1E61732709q459627q311391p544279p246554p140100o394982n715132n923629
$$ 561732709 553273082 544961691 537417412 530170858 523030758 516635776 510920644 504997015
1001.4E04997015o228507o186097o634236p489860p612705p052273o645471o041765
$$ 504997015 498768508 492582411 485948175 478458315 470845610 463793337 457147866 451106101
1017.7D51106101m626810l161103k293795j369357j53840N17607N69105Q47280J143932
$$ 451106101 446479291 443318188 441024393 439655036 439501196 440018803 440587908 441435188 442579120
1036.1D42579120O30021k25692n45621p37608j244306j332462o30170J29371P41721
$$ 442579120 443209141 442983449 442437828 441700220 440455914 439123452 438493282 438622653 439364374
1054.5D39364374J758933K823412L084898K709717K198577J093983q91983k773732
$$ 439364374 441123307 443946719 447031617 449741334 451939911 453033894 452141911 449368179
1070.8D49368179l802598m295051m275262l351718j998127p73370O24657K362996L824949
$$ 449368179 445565581 441270530 436995268 433643550 431645423 430872053 431496710 433859706 437684655
1089.1D37684655M491836M598528M162669K770990J050711K96593M15116N08517O97673
$$ 437684655 442176491 446775019 450937688 453708678 454759389 455055982 455471098 455979615 456677288
1107.5D56677288J366496J834869J614154J333773J164079N57899j52409j73718M4912
$$ 456677288 458043784 459878653 461492807 462826580 463990659 464548558 464396149 464222431 464267343
1125.8D64267343j94519m04329l38524p31677j674563k353877k585321k878279l067761
$$ 464267343 464072824 463668495 463329971 462598294 460923731 458569854 455984533 453106254 450038493
1144.2D50038493k602786j899004j588494j277893n48691J18464N61685J357317K390563
$$ 450038493 447435707 445536703 443948209 442670316 442121625 442240089 442801774 444159091 446549654
1162.6D46549654K903223K898157K856791K626985K011806J581937J630038J472890
$$ 446549654 449452877 452351034 455207825 457834810 459846616 461428553 463058591 464531481
1178.9D64531481Q25584K88218j14649q69900j631349j895458k140880k691060k926707
$$ 464531481 465357065 465645283 465530634 464660734 463029385 461133927 458993047 456301987 453375280
1197.2D53375280k660692k505570k556056k335221k043456k209454k569020k691627
$$ 453375280 450714588 448209018 445652962 443317741 441274285 439064831 436495811 433804184
1213.5D33804184k842039l249228l501326l454297l517479l702998l613025l425986
$$ 433804184 430962145 427712917 424211591 420757294 417239815 413536817 409923792 406497806
1229.9D06497806l496498l514230l256678l114671l240913l246814l093332l105492
$$ 406497806 403001308 399487078 396230400 393115729 389874816 386628002 383534670 380429178
1246.2C80429178l226608l157824l088713l257840l379494l305227l314316l464252
$$ 380429178 377202570 374044746 370956033 367698193 364318699 361013472 357699156 354234904
1262.5C54234904l445357l324002l396034l610164l687620l714174l867299l964841
$$ 354234904 350789547 347465545 344069511 340459347 336771727 333057553 329190254 325225413
1278.8C25225413l946543l996104m141986m229933m317344m488438m659980m704178
$$ 325225413 321278870 317282766 313140780 308910847 304593503 300105065 295445085 290740907
1295.1B90740907m755497m911035m988879m956007m958659n033643m988104m894197
$$ 290740907 285985410 281074375 276085496 271129489 266170830 261137187 256149083 251254886
1311.4B51254886m884287m833371m757896m847333m974931n027801n109206n229279
$$ 251254886 246370599 241537228 236779332 231931999 226957068 221929267 216820061 211590782
1327.8B11590782n351812n298272n116909n086676n377203n623206n417183n182490
$$ 211590782 206238970 200940698 195823789 190737113 185359910 179736704 174319521 169137031
1344.1A69137031n213827n294770n335167n340234n313083n244732n067810n059392
$$ 169137031 163923204 158628434 153293267 147953033 142639950 137395218 132327408 127268016
1360.4A27268016n326695n234488m811398m708492m571296m456393m574091m327766
$$ 127268016 121941321 116706833 111895435 107186943 102615647 98159254 93585163 89257397
1376.7H9257397m003838l917389l755033l501691l469698l384396l008708k942931
$$ 89257397 85253559 81336170 77581137 74079446 70609748 67225352 64216644 61273713
1393F1273713l119011k991091k844665k605156k279881k165284j889292j534458j288966
$$ 61273713 58154702 55163611 52318946 49713790 47433909 45268625 43379333 41844875 40555909
1411.4D0555909j037586p56413n30928k52206J07575L69422N72030O99155Q04424Q67821
$$ 40555909 39518323 38761910 38230982 37978776 38086351 38455773 39027803 39726958 40531382 41399203
1431.8D1399203Q53516Q75574R26353P89985O65881O01731N54230N32657M88997M39297
$$ 41399203 42252719 43128293 44054646 44844631 45510512 46112243 46666473 47199130 47688127 48127424
1452.2D8127424L85717M15571N21373N53600N56495O81724Q07100P96198Q29704J074430
$$ 48127424 48513141 48928712 49450085 50003685 50560180 51241904 52049004 52845202 53674906 54749336
1472.6E4749336J302607J312625J342487J422126J548960J622275J773104K112471
$$ 54749336 56051943 57364568 58707055 60129181 61678141 63300416 65073520 67185991
1488.9F7185991K438910K389498K462327K977372L188617K986819K716273L061942
$$ 67185991 69624901 72014399 74476726 77454098 80642715 83629534 86345807 89407749
1505.2H9407749M150048L812358L196120L256582L441192L590107L601484L941842
$$ 89407749 93557797 97370155 100566275 103822857 107264049 110854156 114455640 118397482
1521.5A18397482L933377L594682L712833L529548L557817L981962L605411L329486
$$ 118397482 122330859 125925541 129638374 133167922 136725739 140707701 144313112 147642598
1537.8A47642598M445925M930153M336164M344016M449606M827336N119353N358189
$$ 147642598 152088523 157018676 161354840 165698856 170148462 174975798 180095151 185453340
1554.1A85453340N490274P124319Q537129O131396N658209O171197O491661O714403
$$ 185453340 190943614 198067933 206605062 212736458 218394667 224565864 231057525 237771928
1570.5B37771928N613059N171314N960390N285531M422695M417509M351615M056663
$$ 237771928 243384987 248556301 254516691 259802222 264224917 268642426 272994041 277050704
1586.8B77050704L751009L574819L387868L069937K747834K629340K509087K262175
$$ 277050704 280801713 284376532 287764400 290834337 293582171 296211511 298720598 300982773
1603.1C00982773K062917J964510J689314J339853J228333J178592Q29488N88447P08968
$$ 300982773 303045690 305010200 306699514 308039367 309267700 310446292 311275780 311864227 312573195
1621.4C12573195O10351L99649M00573M85420O08743Q19981R53853R09299R85622J270264
$$ 312573195 313183546 313583195 313983768 314469188 315077931 315897912 316851765 317761064 318746686 320016950
1641.8C20016950J699031K090990K030909J855851K514243L040194K369791K524764
$$ 320016950 321715981 323806971 325837880 327693731 330207974 333248168 335617959 338142723
1658.2C38142723L131002L532857L576427L541768M013449M305214L900379M149794
$$ 338142723 341273725 344806582 348383009 351924777 355938226 360243440 364143819 368293613
1674.5C68293613M380584L967643M004419M661083N361229M584789M183859M469722
$$ 368293613 372674197 376641840 380646259 385307342 390668571 395253360 399437219 403906941
1690.8D03906941M319787M874498N424261N165547N246014M547268M295170M272849
$$ 403906941 408226728 413101226 418525487 423691034 428937048 433484316 437779486 442052335
1707.1D42052335L791779L815263L889054L756017L822267L476173K837360K772241
$$ 442052335 445844114 449659377 453548431 457304448 461126715 464602888 467440248 470212489
1723.4D70212489L060133L168106L002852K874821L269673L011167K392083K682597
$$ 470212489 473272622 476440728 479443580 482318401 485588074 488599241 490991324 493673921
1739.7D93673921K930522K698928K598375K845526L001391K584517K280951K590358
$$ 493673921 496604443 499303371 501901746 504747272 507748663 510333180 512614131 515204489
1756.1E15204489K647162K299726K286315K265155K020657J841188J908898J787960
$$ 515204489 517851651 520151377 522437692 524702847 526723504 528564692 530473590 532261550
1772.4E32261550J048148O28889O11424J42634p09593j272023j515925j712859k151191
$$ 532261550 533309698 533938587 534550011 534692645 533983052 532711029 531195104 529482245 527331054
1790.7E27331054k506017k168000j644016j078546k35200M93885J087606J978516K969205
$$ 527331054 524825037 522657037 521013021 519934475 519699275 520193160 521280766 523259282 526228487
1809.1E26228487L492833L659784M072726M455030M330278M122018M200697M053653
$$ 526228487 529721320 533381104 537453830 541908860 546239138 550361156 554561853 558615506
1825.4E58615506L455817L276527L234327K750158K399028K426803K392411K112210
$$ 558615506 562071323 565347850 568582177 571332335 573731363 576158166 578550577 580662787
1841.7E80662787K035558K116144J886666J574933J612962J778960J619279J402021
$$ 580662787 582698345 584814489 586701155 588276088 589889050 591668010 593287289 594689310
1858E94689310J564622J705527J482069J371503J536429J398802J068771J213133J474619
$$ 594689310 596253932 597959459 599441528 600813031 602349460 603748262 604817033 606030166 607504785
1876.4F07504785J330376J115024J272678J396358J156390J057148J256645J259267
$$ 607504785 608835161 609950185 611222863 612619221 613775611 614832759 616089404 617348671
1892.7F17348671J009285J013458J209319J089811Q47340J026988J259386J002670
$$ 617348671 618357956 619371414 620580733 621670544 622517884 623544872 624804258 625806928
1909F25806928P77185R87887J119614R01758Q34108J042664R92417P03216P46667R40800
$$ 625806928 626584113 627572000 628691614 629593372 630427480 631470144 632462561 633165777 633912444 634853244
1929.4F34853244Q10206O83605Q91805J011193P92980P27475Q55207P45654N71311
$$ 634853244 635663450 636347055 637238860 638250053 639043033 639770508 640625715 641371369 641942680
1947.8F41942680P15613Q95202P06077M91917N90980O61135M95076N56409Q39949P94649
$$ 641942680 642658293 643553495 644259572 644751489 645342469 646003604 646498680 647055089 647895038 648689687
1968.2F48689687N46634O45340Q53658O84738N18560P24018Q22484N54502M69327O83904
$$ 648689687 649236321 649881661 650735319 651420057 651938617 652662635 653485119 654039621 654508948 655192852
1988.6F55192852O72042M27902M76420O92487N69641L69490N07235O32763M32313L64005
$$ 655192852 655864894 656292796 656769216 657461703 658031344 658400834 658908069 659540832 659973145 660337150
2009F60337150N78582N82040L56078L82841N80966M76778L07381M63187N76139L47972
$$ 660337150 660915732 661497772 661853850 662236691 662817657 663294435 663601816 664065003 664641142 664989114
2029.4F64989114K76685N30242N66185L18289L28302N47171M54604K77997M28020N48482
$$ 664989114 665265799 665796041 666362226 666680515 667008817 667555988 668010592 668288589 668716609 669265091
2049.8F69265091L53516K95519N31555N52415L09647L45647N86748M72248K44677M11153
$$ 669265091 669618607 669914126 670445681 670998096 671307743 671653390 672240138 672712386 672957063 673368216
2070.2F73368216N98251L87013K46346M59195N13136K71737K71738N12302M47273K46763
$$ 673368216 673966467 674353480 674599826 675059021 675572157 675843894 676115632 676627934 677075207 677321970
2090.5F77321970L62277M84407K80083J92463M53174N14090K31207J76847L93748L33428
$$ 677321970 677684247 678168654 678448737 678641200 679094374 679608464 679839671 680016518 680410266 680743694
2110.9F80743694J27554K58386M47035K68102J07586K91765L62992J67132J92821M15921
$$ 680743694 680871248 681129634 681576669 681844771 681952357 682244122 682607114 682774246 682967067 683382988
2131.3F83382988L12567O9380K00867M19021K62320J24693L53932M55260K33293K07961
$$ 683382988 683695555 683764935 683965802 684384823 684647143 684771836 685125768 685581028 685814321 686022282
2151.7F86022282M40478M12226K38120L89457N84364M19795K92778N01931N73337L67403
$$ 686022282 686462760 686874986 687113106 687502563 688086927 688506722 688799500 689301431 689874768 690242171
2172.1F90242171L79086O14405N57780L43263M32491N75483M40240L36587N15104N81205
$$ 690242171 690621257 691235662 691793442 692136705 692569196 693144679 693584919 693921506 694436610 695017815
2192.5F95017815L37898K72096M80949M41015K36631L40283N03718L42608K12908M01139
$$ 695017815 695355713 695627809 696108758 696549773 696786404 697126687 697630405 697973013 698185921 698587060
2212.9F98587060M70161K55049K27511M29868M00842K17378K72393M00066K79248J77980
$$ 698587060 699057221 699312270 699539781 699969649 700370491 700587869 700860262 701260328 701539576 701717556
2233.3G01717556L82542M73797K40505J98245M30107M01676J85371K71260M65214L19660
$$ 701717556 702100098 702573895 702814400 703012645 703442752 703844428 704029799 704301059 704766273 705085933
2253.7G05085933J35541L20614M62532K70843K03550M22835M34220K27690K78830M30286
$$ 705085933 705221474 705542088 706004620 706275463 706479013 706901848 707336068 707563758 707842588 708272874
2274.1G08272874L05593J89722L34084L65198J92225J90198L38495K68459R0301J74642
$$ 708272874 708578467 708768189 709102273 709467471 709659696 709849894 710188389 710456848 710547149 710721791
2294.5G10721791L03089J67191L9697J60873K01702N543l6776J33813J24812l7551
$$ 710721791 711024880 711192071 711231768 711392641 711594343 711599886 711563110 711696923 711821735 711784184
2314.9G11784184k0504O0081n7995j45733Q0883K30313M9054J0908K06232K25008J37150
$$ 711784184 711763680 711823761 711765766 711620033 711700916 711931229 711980283 711991191 712197423 712422431 712559581
2337.3G12559581J93119K86996L78251O03259O70195K89618k51710m66049k40624r3460
$$ 712559581 712752700 713039696 713417947 714021206 714691401 714981019 714729309 714263260 714022636 713929176
2357.7G13929176j14560J58549N86330P02620P07686Q55148Q77440P13408P00056Q11398
$$ 713929176 713814616 713973165 714559495 715262115 715969801 716824949 717702389 718415797 719115853 719927251
2378.1G19927251P44880N76257N27501M79818K69413R4652J33693J69516O7830L7968
$$ 719927251 720672131 721248388 721775889 722255707 722525120 722619772 722753465 722922981 722990811 723028779
2398.5G23028779J43230J44839L2842N9605J37389N8293j9848N2333Q9883j9550p6353
$$ 723028779 723172009 723316848 723349690 723409295 723546684 723604977 723585129 723637462 723727345 723707795 723631442
2421G23631442j4484k8313j15692j00911o7651j65463k63452k15531j72436k74598
$$ 723631442 723616958 723588645 723472953 723372042 723304391 723138928 722875476 722659945 722487509 722212911
2441.3G22212911l47376l31044l91901n08368n56648n93364p03752q14974q70407r69350
$$ 722212911 721865535 721534491 721142590 720634222 720077574 719484210 718780458 717965484 717095077 716125727
2461.7G16125727j136124j250983j344561j527965j726151j832425j944304k178550
$$ 716125727 714989603 713738620 712394059 710866094 709139943 707307518 705363214 703184664
2478.1G03184664k432227k573192k669990k793193k845824k784073k704561k659976
$$ 703184664 700752437 698179245 695509255 692716062 689870238 687086165 684381604 681721628
2494.4F81721628k552450k363980k202391k067030j911819j800835j785576j756132
$$ 681721628 679169178 676805198 674602807 672535777 670623958 668823123 667037547 665281415
2510.7F65281415j671553j591444j487374j296997j007319o95765m08530r5486K48074
$$ 665281415 663609862 662018418 660531044 659234047 658226728 657530963 657122433 657026947 657275021
2529F57275021N81861R00805J207232J485825J710474J877308K025127K116561K080262
$$ 657275021 657856882 658757687 659964919 661450744 663161218 665038526 667063653 669180214 671260476
2547.4F71260476K010167J978814J869560J658320J502335J444876J317919J096964
$$ 671260476 673270643 675249457 677119017 678777337 680279672 681724548 683042467 684139431
2563.7F84139431R48905Q61526P32362N94855N19156M70936L91961L32057L11673K49386
$$ 684139431 685088336 685949862 686682224 687277079 687796235 688267171 688659132 688991189 689302862 689552248
2584.1F89552248J60157J39892J67728J36792Q3685J20402J63078J40667J65641K51651
$$ 689552248 689712405 689852297 690020025 690156817 690240502 690360904 690523982 690664649 690830290 691081941
2604.5F91081941K85745K76446L33905M46439N05448N19096N99146P07448P12096O78421
$$ 691081941 691367686 691644132 691978037 692424476 692929924 693449020 694048166 694755614 695467710 696146131
2624.9F96146131P44819Q25703P84099P26700P57873P53224O69897O53386O67036N90503
$$ 696146131 696890950 697716653 698500752 699227452 699985325 700738549 701408446 702061832 702728868 703319371
2645.3G03319371N15103N08785M51148K72155J72734K19285J43290n0426j12414q8036
$$ 703319371 703834474 704343259 704794407 705066562 705239296 705458581 705601871 705551445 705439031 705350995
2665.7G05350995j33514j88887j62185j60396k93791l59118k21729j65105k87831l09348
$$ 705350995 705217481 705028594 704866409 704706013 704412222 704053104 703831375 703666270 703378439 703069091
2686.1G03069091k20895k56360l35812l03090k97308l82662l81410k88427l23712m57704
$$ 703069091 702848196 702591836 702256024 701952934 701655626 701272964 700891554 700603127 700279415 699821711
2706.5F99821711m25816l18706l85940m70042l89815l69131n33879n92113m40061l47674
$$ 699821711 699395895 699077189 698691249 698221207 697831392 697462261 696928382 696336269 695896208 695548534
2726.9F95548534m03046m33088m01437m48644m99010l89159l35574m87447n65052m68612
$$ 695548534 695145488 694712400 694310963 693862319 693363309 692974150 692638576 692151129 691586077 691117465
2747.3F91117465m21822m80949m62831l95834m93050o25968n61535m80533n70714o20365
$$ 691117465 690695643 690214694 689751863 689356029 688862979 688237011 687675476 687194943 686624229 686003864
2767.7F86003864n36323n89549p67827p07507n44787o61910q27133p54953p35879r19878
$$ 686003864 685467541 684877992 684110165 683402658 682857871 682195961 681368828 680613875 679877996 678958118
2788.1F78958118r23097p31766p94888j049340j041174q68082r51588j132548j092791
$$ 678958118 678035021 677303255 676508367 675459027 674417853 673549771 672598183 671465635 670372844
2806.4F70372844j070261j215875j244605j165628j258970j438260j432001j342118
$$ 670372844 669302583 668086708 666842103 665676475 664417505 662979245 661547244 660205126
2822.7F60205126j448870j626372j630843j683116j943409k115429k159595k340555
$$ 660205126 658756256 657129884 655499041 653815925 651872516 649757087 647597492 645256937
2839.1F45256937k701045l124475l604531l986597l621996k430856j384497j054287
$$ 645256937 642555892 639431417 635826886 631840289 628218293 625787437 624402940 623348653
2855.4F23348653j064956j043439j166582j515984j753748j828313j992464k105295
$$ 623348653 622283697 621240258 620073676 618557692 616803944 614975631 612983167 610877872
2871.7F10877872j804352j343727j225472j243412j135290j147568j276017j210331
$$ 610877872 609073520 607729793 606504321 605260909 604125619 602978051 601702034 600491703
2888F00491703j025379j035750j126885r95934q29697q97467r74000r36091j078069
$$ 600491703 599466324 598430574 597303689 596307755 595478058 594580591 593606591 592670500 591592431
2906.4E91592431j466155j876235k239048k488196k323628j646757r02235m77732j90615
$$ 591592431 590126276 588250041 586010993 583522797 581199169 579552412 578650177 578172445 577981830
2924.7E77981830J14321K85328M03225O37412Q20816Q02159P90060R09924R05693O80744
$$ 577981830 578096151 578381479 578784704 579422116 580242932 581045091 581835151 582745075 583650768 584331512
2945.1E84331512N42701N04255K55346n0306n5134J00493Q8215Q5831L88741O87659
$$ 584331512 584874213 585378468 585633814 585583508 585528374 585628867 585717082 585802913 586191654 586879313
2965.5E86879313P19011P85708R81808J012981Q81016Q09074P75277O61075N71251
$$ 586879313 587598324 588384032 589365840 590378821 591259837 592068911 592844188 593505263 594076514
2983.9E94076514N81205M84646K20060J35243L12984K60055J6868P2360J93596O7234
$$ 594076514 594657719 595142365 595362425 595497668 595810652 596070707 596087575 596159935 596353531 596420765
3004.3E96420765k4200L0280m7148k16901j46151Q0765O9380j61171k95103l27706
$$ 596420765 596396565 596426845 596379697 596162796 596016645 596097410 596166790 596005619 595710516 595382810
3024.7E95382810m78924o74009o71566o63220p94948q20279q05616r66013j102030
$$ 595382810 594903886 594229877 593558311 592895091 592100143 591279864 590474248 589508235 588406205
3043E88406205r57489q25345j049936j238048j070261r67682j117289j160979j043558
$$ 588406205 587448716 586623371 585573435 584335387 583265126 582297444 581180155 580019176 578975618
3061.4E78975618j065612j215696j136184r09507r82583j175284j125634j062632j134455
$$ 578975618 577910006 576694310 575558126 574648619 573666036 572490752 571365118 570302486 569168031
3079.7E69168031j105606r76503r82881j103699j087308r45032r77218j136422j150429
$$ 569168031 568062425 567085922 566103041 564999342 563912034 562967002 561989784 560853362 559702933
3098.1E59702933j140118j229763j238406j174688j215815j301945j300215j282752
$$ 559702933 558562815 557333052 556094646 554919958 553704143 552402198 551101983 549819231
3114.4E49819231j388252j472831j321554j204014j372218j532733j491428j464784
$$ 549819231 548430979 546958148 545636594 544432580 543060362 541527629 540036201 538571417
3130.7E38571417j565277j585782j534223j637638j701534j584351j610517j799584
$$ 538571417 537006140 535420358 533886135 532248497 530546963 528962612 527352095 525552511
3147E25552511j843691j754582j719176j758159j786172j810431j906634j969933j886905
$$ 525552511 523708820 521954238 520235062 518476903 516690731 514880300 512973666 511003733 509116828
3165.4E09116828j831233j911938j938164j854361j878738k016366k011567j907796
$$ 509116828 507285595 505373657 503435493 501581132 499702394 497686028 495674461 493766665
3181.7D93766665j960456k066612j978427j866430j948327j999498j913547j914531
$$ 493766665 491806209 489739597 487761170 485894740 483946413 481946915 480033368 478118837
3198D78118837j990259j947820j870781j923770j969457j872688j833618j931906j936674
$$ 478118837 476128578 474180758 472309977 470386207 468416750 466544062 464710444 462778538 460841864
3216.4D60841864j836359j806975j816392j763999j733124j816124j880616j796067
$$ 460841864 459005505 457198530 455382138 453618139 451885015 450068891 448188275 446392208
3232.7D46392208j724034j807302j857490j759767j700431j740963j715660j655787
$$ 446392208 444668174 442860872 441003382 439243615 437543184 435802221 434086561 432430774
3249D32430774j697034j754582j741260j745433j796454j796633j747757j727283j703888
$$ 432430774 430733740 428979158 427237898 425492465 423696011 421899378 420151621 418424338 416720450
3267.4D16720450j607269j539827j598268j605809j480758j419574j452804j438528
$$ 416720450 415113181 413573354 411975086 410369277 408888519 407468945 406016141 404577613
3283.7D04577613j387984j381367j377732j305192j260430j333892j349956j246691
$$ 404577613 403189629 401808262 400430530 399125338 397864908 396531016 395181060 393934369
3300C93934369j197457j210392j232117j249135j274675j341253j353145j314580j352102
$$ 393934369 392736912 391526520 390294403 389045268 387770593 386429340 385076195 383761615 382409513
3318.4C82409513j423657j445413j478940j563787j601786j561135j538306j536429
$$ 382409513 380985856 379540443 378061503 376497716 374895930 373334795 371796489 370260060
3334.7C70260060j525432j563281j598179j509428j369387j335651j379251j352638
$$ 370260060 368734628 367171347 365573168 364063740 362694353 361358702 359979451 358626813
3351C58626813j276166j294106j304358j168758j069128j102507j117170j073778j077175
$$ 358626813 357350647 356056541 354752183 353583425 352514297 351411790 350294620 349220842 348143667
3369.3C48143667j146585j134217r87350q83014q68827q28743p60614p33495o79106
$$ 348143667 346997082 345862865 344875515 343992501 343123674 342294931 341534317 340800822 340121716
3387.7C40121716n35845n01365o41286o74874n25892l91096m00692m97967m39316k55883
$$ 340121716 339585871 339084506 338443220 337768346 337242454 336851358 336450666 335952699 335513383 335257500
3408.1C35257500j82807j65552j48505j73271j05947M321J4335O6758K05040L12238
$$ 335257500 335074693 334909141 334760636 334587365 334481418 334485739 334500074 334566832 334771872 335084110
3428.5C35084110L43413M04805M90635M41581L35157L69102N11944O42449P20441P46489
$$ 335084110 335427523 335832328 336322963 336764544 337099701 337468803 337980747 338623196 339343637 340090126
3448.9C40090126Q09163Q74221R21160J036465J134962J085281J074732J242518J348913
$$ 340090126 340899289 341773510 342694670 343731135 344866097 345951378 347026110 348268628 349617541
3467.2C49617541J253784J131206J195342J338571J455933J530796J493007J464129
$$ 349617541 350871325 352002531 353197873 354536444 355992377 357523173 359016180 360480309
3483.6C60480309J584112J699358J660645J648158J746178J791745J772344J885295
$$ 360480309 362064421 363763779 365424424 367072582 368818760 370610505 372382849 374268144
3499.9C74268144K005488J884490J771331J916200K071351K104759K151847K189249
$$ 374268144 376273632 378158122 379929453 381845653 383917004 386021763 388173610 390362859
3516.2C90362859K159655K151161K278418K357095K324075K333521K416283K494991
$$ 390362859 392522514 394673675 396952093 399309188 401633263 403966784 406383067 408878058
3532.5D08878058K535194K553493K557963K694249K875686K914131K776205K668590
$$ 408878058 411413252 413966745 416524708 419218957 422094643 425008774 427784979 430453569
3548.8D30453569K787590K936214K941251K984106L137112L188789L167629L351927
$$ 430453569 433241159 436177373 439118624 442102730 445239842 448428631 451596260 454948187
3565.1D54948187L591567L393799L173948L295540L492952L614276L646911L599613
$$ 454948187 458539754 461933553 465107501 468403041 471895993 475510269 479157180 482756793
3581.5D82756793L656537L960967M092514L730894L565639L834426L930629L873884
$$ 482756793 486413330 490374297 494466811 498197705 501763344 505597770 509528399 513402283
3597.8E13402283L951490L927291L868520M074752M318059M160583L999829L926933
$$ 513402283 517353773 521281064 525149584 529224336 533542395 537702978 541702807 545629740
3614.1E45629740L822386M105330M165649L568649L361821M048706N020141M453719
$$ 545629740 549452126 553557456 557723105 561291754 564653575 568702281 573722422 578176141
3630.4E78176141L410041L532469L713370L639936L537536L339589L350973L983676
$$ 578176141 581586182 585118651 588832021 592471957 596009493 599349082 602700055 606683731
3646.7F06683731M576206L567159K390802K695203L155232K803325K520204K405107
$$ 606683731 611259937 614827096 617217898 619913101 623068333 625871658 628391862 630796969
3663F30796969K304077K592623K968073K423287K144515K666831J975775J205742J266122
$$ 630796969 633101046 635693669 638661742 641085029 643229544 645896375 647872150 649077892 650344014
3681.4F50344014J315117J597941K263844K097726Q79824M85718Q04544J051724J286268
$$ 650344014 651659131 653257072 655520916 657618642 658498466 658984184 659788728 660840452 662126720
3699.8F62126720J398921J073182R50276J388252J825989J338243L74019K95341O96480
$$ 662126720 663525641 664598823 665549099 666937351 668763340 670101583 670475602 670770943 671467423
3718.1F71467423Q43168O78181N45860L78251K70426O34193J130999J098990M90427
$$ 671467423 672310591 672988772 673534632 673912883 674183309 674817502 675948501 677047491 677537918
3736.5F77537918j02162k2054P02024Q61883K42173N63920Q07702o8366l15666K24292
$$ 677537918 677435756 677413702 678115726 678977609 679219782 679783702 680591404 680523038 680207372 680431664
3756.9F80431664M58539J69634R5487K14815K91109M84228K61486k01464p9036M88639
$$ 680431664 680890203 681059837 681155324 681370139 681661248 682145476 682406962 682205498 682126462 682615101
3777.3F82615101N81205L8207r8705P4028R5428J54256J46628J00076J09911J29521
$$ 682615101 683196306 683234513 683135808 683209836 683305264 683459520 683606148 683706224 683816135 683945656
3797.7F83945656M78208M02987k07245j7822Q4281k72692j33574M03047M49836L9339
$$ 683945656 684423864 684826851 684619606 684601784 684686065 684413373 684279799 684682846 685132682 685172021
3818F85172021J35541l8564l03924k0862J18077P5102L1412J03950L37422K52903j07944
$$ 685172021 685307562 685268998 684965074 684944212 685062289 685137391 685168803 685272753 685610175 685863078 685755134
3840.5F85755134k06113k31683l70563k98142L27289R16720J5854p85827m00126J08003
$$ 685755134 685549021 685317338 684946775 684648633 684975922 685892642 685908496 685122669 684722543 684830546
3860.9F84830546L01719L6240j04666J13666k7001k37405k36154r9182J78039Q702
$$ 684830546 685132265 685168505 685063839 685177505 685150504 684913099 684676945 684577763 684755802 684764504
3881.3F84764504j85966j55151k81393q941J79887k28882l15011K6644J72197Q5891
$$ 684764504 684578538 684423387 684141994 684133053 684312940 684084058 683769047 683795691 683967888 684053779
3901.7F84053779k5690k67804l74913j59204l2723r6738o7890j8298j03474j54495
$$ 684053779 684028089 683760285 683385372 683226168 683193445 683096707 683028817 683010519 682907045 682752550
3922.1F82752550j13964j19269q4937K0325k1279j90317k45035j93238r9361o4135
$$ 682752550 682638586 682519317 682434380 682454705 682433426 682243109 681998074 681804836 681705475 681641340
3942.5F81641340j63376j19388K6941k2769j43587j56105r3997m4822m2618n4717o7710
$$ 681641340 681477964 681358576 681385517 681362748 681219161 681063056 680969059 680924237 680881619 680826902 680759192
3964.9F80759192j09017r4831Q34L2365k5749r0837p6831m7087r8884j37568r9182
$$ 680759192 680650175 680555344 680556178 680588543 680562794 680471957 680395126 680348039 680249155 680111587 680012405
3987.3F80012405R656R1851O3598m0353j21951
$$ 680012405 680022061 680113912 680177510 680137157 680015206
3997.5F80015206
$$ 680015206
##END=$$ End of the data block
