##TITLE=$$ Begin of the data block
##JCAMP-DX=5.00 $$ ACD/SpecManager v 10.08
##SPECTROMETER/DATA SYSTEM=Alpha
##DATE=13 Jun 2014 08:26:00
##DATA TYPE=INFRARED SPECTRUM
##DATA CLASS=XYDATA
##ORIGIN=
##OWNER=
##NPOINTS=1765
##FIRSTX=399.75695801
##LASTX=3997.56933594
##MAXX=3997.56933594
##MINX=399.75695801
##MAXY=0.73069984
##MINY=0.03801569
##XFACTOR=1.0000000000
##YFACTOR=1.000000000000000e-9
##FIRSTY=0.28478193
##DELTAX=2.03957629
##XUNITS=1/CM
##YUNITS=ARBITRARY UNITS
##XYDATA=(X++(Y..Y))
399.8B84781933Q983493Q769303J0037095J0693788R547681Q915722R696126R501219
416.1C60926360R516030J0110796Q811891P439405P000983P509291P278084N983413
432.4D24576253O242364O930381N582750M536987N439907N454034M185795M230976
448.7D67179447M807055M060179L316254L890812L534645K079904K445132L388583
465D94702011K554447J851469K977222L456176K306342K345979L288686K717734J929164
483.4E18129230K681851L011703J916588J652479K494931K198577J328230J812100
499.7E35225689K301872J337350R98675J760900J414896K98798M33683J195133P04825
518.1E45671821J3709O68585J061797L82245M11331J139224R01759L61561R85802J605808
$$ plain form
399.8 284781933 293765426 302534729 312571824 323265612 332813293 341729015 351425141 360926360
416.1 360926360 370442390 380553186 389365077 396804482 403805465 411314756 418592840 424576253
432.4 424576253 430818617 437748998 443331748 447868735 453308642 458762676 462948471 467179447
448.7 467179447 471986502 476046681 479362935 483253747 486788392 488868296 491313428 494702011
465 494702011 497256458 499107927 502085149 505541325 507847667 510193646 513482332 516200066 518129230
483.4 518129230 520811081 523822784 525739372 527391851 529886782 532085359 533413589 535225689
499.7 535225689 537527561 538864911 539863586 541624486 543039382 543338180 543771863 544966996 545671821
518.1 545671821 545685530 546354115 547415912 547798157 548209488 549348712 550250471 550612032 551597834 553203642
538.4E53203642R05276M38988J190722J271307J99974R5963P28548J98603o10531j20818
558.8E57501674M59432l3617j75714M83393L10481m20690r8049M53770p8917l97980
579.2E58003783N23567J054883M79162M38452J068294P88331Q523L18110P63715o3658
599.6E63383162q52764o90758r15706j560450j034915J48535K83003j0014N85973J214803
620E60550869R48846Q36193J254440J048922M67360R01759J755893J543463J030087
638.4E70337832J381040J461565N73516K58327P07030K50578p53582o78301j74641
656.7E73363364o08266r47117k27690J44422p27594j009226L09169L36826k13980J47640
677.1E70567548M14372m25637r30250n46932r83357k288103k757669k932787m380345
$$ plain form
538.4 553203642 554108918 554547906 555738628 557009935 557209909 557305872 558034420 558233023 557622492 557501674
558.8 557501674 557961106 557927489 557751775 558235168 558545649 558124959 558026910 558480680 558401763 558003783
579.2 558003783 558527350 559582233 560061395 560499847 561568141 562356472 562364995 562683105 563446820 563383162
599.6 563383162 562530398 561839640 560923934 559363484 558328569 558477104 558760107 558750093 559336066 560550869
620 560550869 561499715 562335908 563590348 564639270 565106630 566008389 567764282 569307745 570337832
638.4 570337832 571718872 573180437 573753953 574012280 574719310 574969888 574216306 573538005 573363364
656.7 573363364 572755098 571807981 571580291 571724713 570997119 569987893 570297062 570633888 570419908 570567548
677.1 570567548 570981920 570556283 569626033 569079101 568095744 565807641 563049972 560117185 555736840
695.5E55736840o067217o514907p034003q850575j0463655j0677814j0060817q594841
711.8D87473011o292403m510343l362149l94314N269289J1064470J5087902J7746866
728.1E22082329J8971443J7734587J4753997J2082279R770692O915629M564762L706753
744.4F10582471K857447J386463R92537J530111J045525M4763K31087O71327L8326
762.8F19380057l68238L43740O10471M9472K37286R73523P05898J64628O93440J034796
783.2F23825073J99914k66492L04520K40266n79834m40001K11716n9605m52936O259
803.6F22988880J38223p07746j049637n06044o88016j472354j364351j014649j617611
821.9F14706695k253771k061367k263129l324210l899932l934443m694283n922437
$$ plain form
695.5 555736840 549669623 543154716 536120713 527270138 516806483 506128669 496067852 487473011
711.8 487473011 481180608 476670265 473308116 472913802 478183091 489247561 504335463 522082329
728.1 522082329 541053772 558788359 573542356 585624635 595395327 602310956 606875718 610582471
744.4 610582471 613439918 614826381 615818918 617349029 618394554 618439317 618670404 619341731 619380057
762.8 619380057 619011819 619355559 619966030 620015502 620252788 621226311 621932209 622096837 622790277 623825073
783.2 623825073 624024987 623758495 624063015 624303281 623723447 623283446 623495162 623435557 622982621 622988880
803.6 622988880 623127103 622419357 621369720 620863676 620175660 618703306 617338955 616324306 614706695
821.9 614706695 612452924 610391557 608128428 604804218 600904286 596969843 592275560 586353123
838.3E86353123o719768q160591j1679530j4501631j1165142m588068l843904q771359
854.6E16923130j3550759j7729461k2937596k9743939m0216178n6112081o9257855
868.9B67375261o2427894l5858705j0252893O627515K2659540L9919406N4301009O3958823
885.2C46302062O7474127O1688125M8051507L3777654K3451686J6429245J1882782
899.4F09057188R478033P548213N379736M145801L703416K584159J323759J183629
915.8F44403934J103700n901p19428l21865l75629j063287r14037k99096n54741q60333
936.2F40393317k04623J50204m98534p10547k34723o11066j672566j851201j664818
954.5F33095443k400040l119111k905965k958894l779233m031896l704131m174173
$$ plain form
838.3 586353123 579633355 571472764 559793234 545291603 534126461 529538393 525694489 516923130
854.6 516923130 503372371 485642910 462705314 432961375 392745197 336633116 267375261
868.9 267375261 204947367 169088662 158835769 165463284 188122824 228042230 282343239 346302062
885.2 346302062 413776189 475464314 523515821 557293475 580745161 597174406 609057188
899.4 609057188 618535221 626083434 631463170 635608971 639312387 641896546 643220305 644403934
915.8 644403934 645507634 645501733 644782305 644460440 644084811 643021524 642107487 641808391 641253650 640393317
936.2 640393317 640188694 640338898 639840364 639129817 638895094 638284028 636611462 634760261 633095443
954.5 633095443 630695403 627576292 624670327 621711433 617932200 613900304 610196173 606022000
970.8F06022000n107402n320728n537212o657899p614076p687807p870555q418679
987.1E51807642q254766p466376p162512p076740o333828n616367n779028o088316
1003.5D98029709o056518o479024p311106p436454o895125o504745n939126m569143
1019.8D46838468l106743k255320j451999l74288K94507M00066O86497J008779N54382
1038.1D42594349k85387n96255p42137j234234j339733o31184J49876P49022J736492
1056.5D40400809K784193L017395K597124K101928J095414q20190k652496l650248
1072.8D44873929m210383m312485l504366k219140r77546M74095K276897L819019M537702
1091.2D40757722M638314M182994K841234J177818M01169M83811N73844P91013J465946
$$ plain form
970.8 606022000 600914598 595593870 590056658 583398759 575784683 568096876 560226321 551807642
987.1 551807642 543552876 536086500 528923988 521847248 515513420 509897053 504118025 498029709
1003.5 498029709 491973191 485494167 478183061 470746607 463851482 457346737 451407611 446838468
1019.8 446838468 443731725 441476405 440024406 439650118 439944625 440344691 441031188 442039967 442594349
1038.1 442594349 442308962 441712707 440970570 439736336 438396603 437765419 437915295 438664317 440400809
1056.5 440400809 443185002 446202397 448799521 450901449 451996863 451176673 448524177 444873929
1072.8 444873929 440663546 436351061 432846695 430627555 429650009 430124104 432401001 436220020 440757722
1091.2 440757722 445396036 449579030 452420264 453598082 453999251 454483062 455056906 455847919 457313865
1109.5D57313865J880497J612097J295686J076013M73290j64777j39117O3598k25424
1127.9D63185728m74841l75360p12395j644552k304911k503216k774239k946347k477527
1146.2D46972340j804024j545190j277715n71698J06901N38796J278490K295374K795995
1164.6D48789269K746731K715856K534628J963466J579344J626790J443714Q09163
1180.9D64208961L00109q9943q38966j643866j979709k197921k652645k858013k633184
1199.3D49614823k513468k559454k337783k054364k204179k566398k713352k867252
1215.6D29798573l237307l422737l372878l501594l717333l606647l396928l450692
1231.9D02092457l480166l259063l107429l204763l222584l095746l138334l289372
$$ plain form
1109.5 457313865 459194362 460806459 462102145 463178158 463651448 463486671 463347554 463411152 463185728
1127.9 463185728 462710887 462335527 461623132 459978580 457673669 455170453 452396214 449449867 446972340
1146.2 446972340 445168316 443623126 442345411 441773713 441880614 442419410 443697900 445993274 448789269
1164.6 448789269 451536000 454251856 456786484 458749950 460329294 461956084 463399798 464208961
1180.9 464208961 464509070 464419127 463580161 461936295 459956586 457758665 455106020 452248007 449614823
1199.3 449614823 447101355 444541901 442204118 440149754 437945575 435379177 432665825 429798573
1215.6 429798573 426561266 423138529 419765651 416264057 412546724 408940077 405543149 402092457
1231.9 402092457 398612291 395353228 392245799 389041036 385818452 382722706 379584372 376295000
1248.2C76295000l205955l082514l235399l388137l319293l298938l436268l424376
1264.5C49904120l323853l427804l649205l688544l675162l844113l983467l975422
1280.8C20336550m012584m156977m237622m301608m470020m660607m714250m759282
1297.2B85023600m917860m992396m932552m926622n019576m986912m895925m883737
1313.5B45468020m841283m787400m864901m960135n012244n118146n246282n345419
1329.8B05292210n284086n110085n068988n344137n598947n419210n182311n206138
1346.1A63078308n298793n331859n320430n287930n222574n059377n041048n268573
1362.4A21247724n172417m791424m706986m561595m439369m553117m310981l977119
$$ plain form
1248.2 376295000 373089045 370006531 366771132 363382995 360063702 356764764 353328496 349904120
1264.5 349904120 346580267 343152463 339503258 335814714 332139552 328295439 324311972 320336550
1280.8 320336550 316323966 312166989 307929367 303627759 299157739 294497132 289782882 285023600
1297.2 285023600 280105740 275113344 270180792 265254170 260234594 255247682 250351757 245468020
1313.5 245468020 240626737 235839337 230974436 226014301 221002057 215883911 210637629 205292210
1329.8 205292210 200008124 194898039 189829051 184484914 178885967 173466757 168284446 163078308
1346.1 163078308 157779515 152447656 147127226 141839296 136616722 131557345 126516297 121247724
1362.4 121247724 116075307 111283883 106576897 102015302 97575933 93022816 88711835 84734716
1378.7H4734716l876128l711253l473781l462926l360651k956189k897766l117129
1395.1E7878893k991445k803252k571329k259821k120975j853250j531795j273986
1411.4D0473040r94526p22464n13162k27198J34393L72689N37389O72746Q38548R21644
1431.8D1493099Q78632Q82577R24677P74816O48137O00912N78250N57781M87856M37830
1452.2D8264567L88883L96862N15376N98669O04778O89052P93856Q10325Q63455J097866
1472.6E5023689J308609J307223J334872J428589J563638J640715J800761K139389
1488.9F7547485K444022K395086K493038L012889L206335K996385K731114L086768
1505.2H9913122M203223L889352L243812L239795L391847L578834L635571M009053
$$ plain form
1378.7 84734716 80858588 77147335 73673554 70210628 66849977 63893788 60996022 57878893
1395.1 57878893 54887448 52084196 49512867 47253046 45132071 43278821 41747026 40473040
1411.4 40473040 39478514 38756050 38242888 38015690 38150083 38522772 39060161 39732907 40571455 41493099
1431.8 41493099 42371731 43254308 44178985 44953801 45601938 46202850 46781100 47338881 47826737 48264567
1452.2 48264567 48653450 49050312 49565688 50164357 50769135 51458187 52252043 53062368 53925823 55023689
1472.6 55023689 56332298 57639521 58974393 60402982 61966620 63607335 65408096 67547485
1488.9 67547485 69991507 72386593 74879631 77892520 81098855 84095240 86826354 89913122
1505.2 89913122 94116345 98005697 101249509 104489304 107881151 111459985 115095556 119104609
1521.5A19104609M010714L623032L693670L516927L570214M007682L656715L404618
1537.8A48588181M498571M940957M345223M345417M447728M830733N122945N346268
1554.1A86466023N452559P064223Q515537O160632N674660O163180O475016O706298
1570.5B38678128N623579N178347N936429N255043M390598M365086M296869M010350
1586.8B77734429L681063L460199L270358K976328K660423K533764K395302K118319
1603.1C00830185J892657J797020J535386J191884J082301J008421O46174M80861O69956
1621.4C11134845N79387L40641L20792M50223O57291R01669J031518R96888J112759
1639.8C17526013J448214J898944K325207K314031K072990K691716L318727K623022
$$ plain form
1521.5 119104609 123115323 126738355 130432025 133948952 137519166 141526848 145183563 148588181
1537.8 148588181 153086752 158027709 162372932 166718349 171166077 175996810 181119755 186466023
1554.1 186466023 191918582 198982805 207498342 213658974 219333634 225496814 231971830 238678128
1570.5 238678128 244301707 249480054 255416483 260671526 265062124 269427210 273724079 277734429
1586.8 277734429 281415492 284875691 288146049 291122377 293782800 296316564 298711866 300830185
1603.1 300830185 302722842 304519862 306055248 307247132 308329433 309337854 309984028 310464889 311134845
1621.4 311134845 311714232 312054873 312375665 312825888 313483179 314384848 315416366 316413254 317526013
1639.8 317526013 318974227 320873171 323198378 325512409 327585399 330277115 333595842 336218864
1656.1C36218864K715975L317088L699630L708929L644913M102380M396557L993392
1672.4C65797728M233986M444540M035294M111320M772156N358070M522145M207999
1688.8D01483238M546910M388720M933804N496711N249649N301982M573375M322708
1705.1D40297097M329264L878296L892481L961116L850728L916085L541529K897889
1721.4D70564485K824783L078282L180295L040165K905726L285438L042400K420336
1737.7D94341910K714544K995760K750396K606988K860308L047347K621949K304852
1754E16244054K623916K662956K297044K273679K244472K029658J885414J945972J791716
1772.4E35998881J064122O55233O15597J39714p12336j277685j520157j730501k201915
$$ plain form
1656.1 336218864 338934839 342251927 345951557 349660486 353305399 357407779 361804336 365797728
1672.4 365797728 370031714 374476254 378511548 382622868 387395024 392753094 397275239 401483238
1688.8 401483238 406030148 410418868 415352672 420849383 426099032 431401014 435974389 440297097
1705.1 440297097 444626361 448504657 452397138 456358254 460208982 464125067 467666596 470564485
1721.4 470564485 473389268 476467550 479647845 482688010 485593736 488879174 491921574 494341910
1737.7 494341910 497056454 500052214 502802610 505409598 508269906 511317253 513939202 516244054
1754 516244054 518867970 521530926 523827970 526101649 528346121 530375779 532261193 534207165 535998881
1772.4 535998881 537063003 537718236 538333833 538473547 537761211 536483526 534963369 533232868 531030953
1790.7E31030953k541423k151728j634597j085818k15948N20051J095473J991570K967537
1809.1E29976070L474712L673494M127205M525244M373252M126907M200160M066110
1825.4E62543154L489733L332436L291964K789497K428234K463937K422512K120792
1841.7E84882259K033294K132117J925052J576840J582146J777530J634359J400471
1858E98944068J571655J728416J496851J381636J536012J385331J054406J206398J500368
1876.4F11805141J367867J127958J273155J405359J181781J069248J232564J242042
1892.7F21705115J004994R81331J184046J119733Q85725J029372J257777J020611P90536
1911.1F30979240R91821J139164R18389Q23557J038253R90451O87420P52747R58145
$$ plain form
1790.7 531030953 528489530 526337802 524703205 523617387 523401439 523921490 525016963 527008533 529976070
1809.1 529976070 533450782 537124276 541251481 545776725 550149977 554276884 558477044 562543154
1825.4 562543154 566032887 569365323 572657287 575446784 577875018 580338955 582761467 584882259
1841.7 584882259 586915553 589047670 590972722 592549562 594131708 595909238 597543597 598944068
1858 598944068 600515723 602244139 603740990 605122626 606658638 608043969 609098375 610304773 611805141
1876.4 611805141 613173008 614300966 615574121 616979480 618161261 619230509 620463073 621705115
1892.7 621705115 622710109 623691440 624875486 625995219 626880944 627910316 629168093 630188704 630979240
1911.1 630979240 631971061 633110225 634028614 634852171 635890424 636880875 637568295 638321042 639279187
1929.4F39279187Q13603P01010R18150R98497P55549P20799Q74698P54952N57781O92963
1949.8F47067189Q74043O78062M83394O29783P16686N23805N45562Q14795P82013N45025
1970.2F53660357O43551Q59559P05421N26726P05779Q02517N51521M88461P19964O95109
1990.6F60358965M01616M22180O69599N82099L94940N35786O43313M11987L40641O00874
2011F65362000O19352L62337L93927O02543M75347K85984M65631O29544L96312K63214
2031.4F69856191M99487N78403L45528L30925N49078M72486K89679M34398N78344L79205
2051.8F74313724K69055M98474N72383L50416L59714N80371M66466K45273M23550O36101
2072.2F78715527M30703K52724M46498N25952L09050L12745N34833M55260K68161L90172
$$ plain form
1929.4 639279187 640092790 640793800 641711950 642710447 643465996 644186795 645061493 645816445 646374226 647067189
1949.8 647067189 647941232 648619294 649102688 649732471 650449157 650972962 651518524 652333319 653115332 653660357
1970.2 653660357 654303908 655163467 655868888 656395614 657101393 657903910 658455431 658943892 659663856 660358965
1990.6 660358965 660760581 661182761 661852360 662434459 662829399 663365185 664008498 664420485 664761126 665362000
2011 665362000 665981352 666343689 666737616 667340159 667815506 668101490 668567121 669196665 669592977 669856191
2031.4 669856191 670355678 670934081 671279609 671610534 672159612 672632098 672921777 673356175 673934519 674313724
2051.8 674313724 674582779 675081253 675653636 676004052 676363766 676944137 677410603 677655876 678079426 678715527
2072.2 678715527 679146230 679398954 679845452 680371404 680680454 680993199 681528032 681983292 682251453 682641625
2092.6F82641625N05329K96413K00689M61936N29349K36929J83880M28200L66330J32382
2113F85983062K65896M68433K83241J16289L14951L94583J80006J96695M44710L59178
2133.4F89007044J10030K31147M28736K57313J29521L73185M59015K21312K24591M78088
2153.8F91919982M29631K32517L99292O38187M85778L22759N01871N77629L68774L73959
2174.2F96250379O31511N73516L16382M22239O37352M99368L40164N11050N93841L64781
2194.6G01140583K99334M88401M43160K34842L36409N21898L66211K09987M01497M99010
2215G04941332K78533K35855M53175M18663J84178K48074M51267L41773J97351L92318
2235.4G08142519M90010K51293K04682M31359M04060J90854K67327M60088L42012J84178
$$ plain form
2092.6 682641625 683146954 683443367 683644056 684105992 684635341 684872270 685056150 685484350 685850680 685983062
2113 685983062 686248958 686717391 687000632 687116921 687431872 687826455 688006461 688203156 688647866 689007044
2133.4 689007044 689117074 689348221 689776957 690034270 690163791 690536976 690995991 691217303 691441894 691919982
2153.8 691919982 692349613 692582130 692981422 693619609 694105387 694428146 694930017 695507646 695876420 696250379
2174.2 696250379 696881890 697455406 697771788 698194027 698831379 699330747 699670911 700181961 700775802 701140583
2194.6 701140583 701439917 701928318 702371478 702606320 702942729 703464627 703830838 704040825 704442322 704941332
2215 704941332 705219865 705455720 705908895 706327558 706511736 706759810 707211077 707552850 707750201 708142519
2235.4 708142519 708632529 708883822 709088504 709519863 709923923 710114777 710382104 710842192 711184204 711368382
2255.8G11368382L64304M83036K81095K26796M45723M34816K26259K98083M45664L06964
2276.1G14881122J76311L08513L96729K67625K07960L10123K64883J14322J97411L46362
2296.5G17471361K46585J12772J98721K17259K4796J0252K19285K10643M411%J04010
2319G18820095Q047p7963J30594K42292Q4460Q9646K51650K47717J63854K10165L19779
2341.4G20490336M33386N81383N51343K11955k17140l49641j09732J0013l7252J68025
2361.8G21732676N18978O36696O46711P70509Q02934O48022N99146O88195O42657M95553
2382.2G28182077M58956M33088K50875R9063J46807J65164O5506P8559J89423J68085
2402.6G30237603L6657K5094J09672Q3804K4438Q6188R6381m9412j09732j1921J1742
$$ plain form
2255.8 711368382 711732686 712215722 712496817 712723613 713169336 713604152 713830411 714128494 714574158 714881122
2276.1 714881122 715057433 715365946 715762675 716030300 716238260 716548383 716813266 716927588 717124999 717471361
2296.5 717471361 717717946 717830718 718029439 718246698 718271494 718281746 718501031 718711674 718716085 718716085 718820095
2319 718820095 718828142 718750179 718880773 719123065 719207525 719297171 719548821 719796538 719960392 720170557 720490336
2341.4 720490336 720923722 721505105 722056448 722268403 722051263 721701622 721591890 721601903 721564651 721732676
2361.8 721732676 722251654 722888350 723535061 724305570 725108504 725756526 726355672 727043867 727686524 728182077
2382.2 728182077 728641033 729074121 729324996 729424059 729570866 729736030 729801536 729880095 730069518 730237603
2402.6 730237603 730274260 730299354 730409026 730492830 730517268 730603456 730699837 730650425 730540693 730528772 730540514
2425G30540514q3387j01924p5936j59979k38299j92702j83523k88725l35336l14354
2445.4G28566349l89219n25057n78106o01112p04170q14378q56340r47594j139462
2463.8G22010911j285732j382828j536369j716018j841128j985550k228558k434671
2480.1G07600057k548277k679169k816856k856493k813459k772152k718985k560556
2496.4F85834110k322674k154827k060294j930595j825928j827538j804591j685977
2512.7F70221686j556038j435876j260460j001894p23124m48644j25170K45512O12199
2531.1F64528191R45330J240909J515210J739919J886308K009034K122164K143562
2547.4F78130627K084851K027750J915932J715302J534283J425743J297772J117885
$$ plain form
2425 730540514 730457127 730355203 730279267 730119288 729880989 729688287 729504764 729216039 728880703 728566349
2445.4 728566349 728177130 727652073 727073967 726472855 725768685 724954307 724097967 723150373 722010911
2463.8 722010911 720725179 719342351 717805982 716089964 714248836 712263286 710034728 707600057
2480.1 707600057 705051780 702372611 699555755 696699262 693885803 691113651 688394666 685834110
2496.4 685834110 683511436 681356609 679296315 677365720 675539792 673712254 671907663 670221686
2512.7 670221686 668665648 667229772 665969312 664967418 664244294 663795650 663670480 663915992 664528191
2531.1 664528191 665473521 666714430 668229640 669969559 671855867 673864901 675987065 678130627
2547.4 678130627 680215478 682243228 684159160 685874462 687408745 688834488 690132260 691250145
2563.7F91250145R86278Q94070P60257O05882N05983M70639M21822L52323L08156K50637
2584.1F96806192J95682J99855J97887J24812P3433J26779J76430J53363J65462K67864
2604.5F98487759L27706K90573L44038N02109N39184N13732O14882P19130P03692O79195
2624.9G03722000P57992Q47638P99477P41184P88450P66456O68586O84857P10070N96702
2645.3G11083412M94659M93586M49479K84195J69515J97411J61052l040q4639o8009
2665.7G13177621j13666j93774k04802k00510k68400l14593k19166j54376k66314l17275
2686.1G10924745k37525k81155l71337k98321k50042l55839l86775k93434l12268m39763
2706.5G07698286m34459l43322l77477m38273l72409l57867n15043n73874m19795l55363
$$ plain form
2563.7 691250145 692236423 693130493 693890750 694496632 695002615 695473254 695895076 696247399 696555555 696806192
2584.1 696806192 697001874 697201729 697399616 697524428 697597861 697724640 697901070 698054433 698219895 698487759
2604.5 698487759 698815465 699106038 699450076 699952185 700491369 701005101 701619983 702339113 703042805 703722000
2624.9 703722000 704479992 705327630 706127107 706868291 707656741 708423197 709091783 709776640 710486710 711083412
2645.3 711083412 711578071 712071657 712521136 712805331 712974846 713172257 713333309 713330269 713245630 713177621
2665.7 713177621 713063955 712870181 712665379 712464869 712196469 711881876 711662710 711508334 711242020 710924745
2686.1 710924745 710687220 710406065 710034728 709736407 709486365 709130526 708743751 708450317 708138049 707698286
2706.5 707698286 707263827 706920505 706543028 706104755 705732346 705374479 704859436 704285562 703865767 703510404
2726.9G03510404m42207m28498l66509m53055n22911l94285l28541m74453n35607m29988
2747.3F99134350m02630m98890m85838l91781m73201o00160n49674m99010o01828o59764
2767.7F93971574n80072o09100p42376o74009n53548o76930q01027p08997o97375r21786
2788.1F87006354r77158p73072p95961j050293j042128q63135r61304j143813j093268
2806.4F78306222j069307j238943j299679j193881j247883j437843j429975j342535
2822.7F68046176j494526j692236j678526j686275j932025k160073k206981k341330
2839.1F52854204k695799l132164l632009m026473l658771k463222j448452j162291
2855.4F30635023j132965j042187j155257j512886j752734j844763k033592k133429
$$ plain form
2726.9 703510404 703068197 702639699 702273190 701820135 701297224 700902939 700574398 700099945 699564338 699134350
2747.3 699134350 698731720 698232830 697746992 697355211 696882010 696281850 695732176 695233166 694631338 693971574
2767.7 693971574 693391502 692782402 692040026 691366017 690812469 690135539 689334512 688625515 687928140 687006354
2788.1 687006354 686029196 685256124 684460163 683409870 682367742 681504607 680543303 679399490 678306222
2806.4 678306222 677236915 675997972 674698293 673504412 672256529 670818686 669388711 668046176
2822.7 668046176 666551650 664859414 663180888 661494613 659562588 657402515 655195534 652854204
2839.1 652854204 650158405 647026241 643394232 639367759 635708988 633245766 631797314 630635023
2855.4 630635023 629502058 628459871 627304614 625791728 624038994 622194231 620160639 618027210
2871.7F18027210j800239j349807j255750j269877j146496j149118j270473j214921
2888F07570529j043081j037419j105666r63331q11278r06825r90928r23514j024783
2906.4E98763704j434683j865805k202213k476871k344787j640021q89183n23090k75612
2924.7E85111439O6400K85148M15743O56366Q68797Q79288Q35180R00507R12846P40528
2945.1E91672242O00278N08905K35557l8087j6392J28746J19746J47820M46081P11620
2965.5E94516516P10070P59840J010120J086175R11534Q00908P68959O68645N98550
2983.9F01831317O34909N59330K74121J47045L15368K97606N9128N2512J64866P6413
3004.3F04412615l4392J0312k9564j90079j46508P0989Q4281j34230k87175l24905
$$ plain form
2871.7 618027210 616226971 614877164 613621414 612351537 611205041 610055923 608785450 607570529
2888 607570529 606527448 605490029 604384363 603421032 602609754 601702929 600712001 599788487 598763704
2906.4 598763704 597329021 595463216 593261003 590784132 588439345 586799324 585910141 585387051 585111439
2924.7 585111439 585177839 585462987 585878730 586535096 587403893 588283181 589118361 590018868 590931714 591672242
2945.1 591672242 592272520 592781425 593016982 592978895 592962503 593091249 593210995 593358815 593804896 594516516
2965.5 594516516 595226586 595986426 596996546 598082721 598994255 599795163 600564122 601232767 601831317
2983.9 601831317 602466226 603025556 603299677 603446722 603762090 604059696 604118824 604171336 604336202 604412615
3004.3 604412615 604378223 604388535 604358971 604168892 604022384 604093373 604177654 604043424 603756249 603431344
3024.7F03431344m57227o39677o65963o72340p72834q15928q36969r84847j102507
3043E96483052r49502q08299j030981j224220j059592r69231j143873j186967j040339
3061.4E87070048j062215j229941j164258r49323r97067j172900j134217j058638j137674
3079.7E77163815j135289r92716r95516j144648j126587r66490r94384j160741j193166
3098.1E67454278j158535j209617j238584j198828j261056j355469j297414j269222
3114.4E57465553j425445j497447j310945j201570j416862j608431j523018j461804
3130.7E46020031j593530j643658j563787j621366j713931j655579j656473j794755
3147E32776952j859009j788855j746953j807928j835584j802028j866817j966953j920045
$$ plain form
3024.7 603431344 602974117 602334440 601668477 600996137 600223303 599407375 598570406 597585559 596483052
3043 596483052 595533550 594725251 593694270 592470050 591410458 590441227 589297354 588110387 587070048
3061.4 587070048 586007833 584777892 583613634 582664311 581667244 580494344 579360127 578301489 577163815
3079.7 577163815 576028526 575035810 574040294 572895646 571769059 570802569 569808185 568647444 567454278
3098.1 567454278 566295743 565086126 563847542 562648714 561387658 560032189 558734775 557465553
3114.4 557465553 556040108 554542661 553231716 552030146 550613284 549004853 547481835 546020031
3130.7 546020031 544426501 542782843 541219056 539597690 537883759 536228180 534571707 532776952
3147 532776952 530917943 529129088 527382135 525574207 523738623 521936595 520069778 518102825 516182780
3165.4E16182780j878381j993000k038896j939237j967609k113104k081573j939714
3181.7E00231266j985013k105296k030343j943737k011925k025753j947135j975626
3198D84206438k071977k054512j977831j958341j980185j951665j915395j974285j976400
3216.4D66345847j879633j888186j949876j879186j797437j884937j991928j911253
3232.7D51163411j798123j837760j865924j766026j707911j782119j826644j774967
3249D36803937j751989j793593j812727j794219j806080j813114j772970j760512j744569
3267.4D20754164j652836j611144j653820j633584j542688j479059j486421j506567
3283.7D08188045j468658j446575j454145j402587j368552j399160j383930j336932
$$ plain form
3165.4 516182780 514304399 512311399 510272503 508333266 506365657 504252553 502170980 500231266
3181.7 500231266 498246253 496140957 494110614 492166877 490154952 488129199 486182064 484206438
3198 484206438 482134461 480079949 478102118 476143777 474163592 472211927 470296532 468322247 466345847
3216.4 466345847 464466214 462578028 460628152 458748966 456951529 455066592 453074664 451163411
3232.7 451163411 449365288 447527528 445661604 443895578 442187667 440405548 438578904 436803937
3249 436803937 435051948 433258355 431445628 429651409 427845329 426032215 424259245 422498733 420754164
3267.4 420754164 419101328 417490184 415836364 414202780 412660092 411181033 409694612 408188045
3283.7 408188045 406719387 405272812 403818667 402416080 401047528 399648368 398264438 396927506
3300C96927506j344502j363993j362026j365512j392395j453429j492173j498788j546949
3318.4C84107739j597792j587570j604378j727462j822889j781374j739234j750946
3334.7C70496094j715034j675814j739264j775324j679600j587241j543642j524657
3351C57255518j534640j543582j501083j409531j400798j462579j411736j280815j245737
3369.3C44465017j329302j334489j151293j027227j068175j050770r61661r58771r05603
3387.7C34677726p05808o64562q11905p72774n56737m68433n50568o30320n56200l97742
3408.1C28562677l01182k52575k16723k25096j79679o6578n1171l4988J20223K71052
3428.5C27625960K75195L10689M53442M62890L76105M29809N81950P06911P56950P46935
$$ plain form
3300 396927506 395583004 394219011 392856985 391491473 390099078 388645649 387153476 385654688 384107739
3318.4 384107739 382509947 380922377 379317999 377590537 375767648 373986274 372247040 370496094
3334.7 370496094 368781060 367105246 365365982 363590658 361911058 360323817 358780175 357255518
3351 357255518 355720878 354177296 352676213 351266682 349865884 348403305 346991569 345710754 344465017
3369.3 344465017 343135715 341801226 340649933 339622706 338554531 337503761 336542100 335583329 334677726
3387.7 334677726 333971918 333307356 332495451 331722677 331165940 330697507 330146939 329516619 328960419 328562677
3408.1 328562677 328261495 328008920 327792197 327567101 327387422 327320844 327269673 327234685 327354908 327625960
3428.5 327625960 327901155 328211844 328665286 329128176 329504281 329934090 330516040 331222951 331979901 332726836
3448.9C32726836Q25823R43124R99659J100421J218706J171917J113773J251280J409441
3467.2C42760980J407623J327038J354844J432210J541018J656950J623422J559972
3483.6C54664057J669020J800388J786232J771152J851201J944125J944691J997113
3499.9C69427979K106965K024293J925736K066493K235651K295971K293885K255827
3516.2C86632800K285332K400875K522379K492428K448767K548575K646000K711653
3532.5D06688809K783984K752990K678364K835572L096402L184169L042281K933800
3548.8D29996371L003359L103763L151268L218978L376455L455191L451586L640086
3565.1D56397057L854930L653109L499538L652006L822565L888160L918261L986507
$$ plain form
3448.9 332726836 333552659 334495783 335495442 336595863 337814569 338986486 340100259 341351539 342760980
3467.2 342760980 344168603 345495641 346850485 348282695 349823713 351480663 353104085 354664057
3483.6 354664057 356333077 358133465 359919697 361690849 363542050 365486175 367430866 369427979
3499.9 369427979 371534944 373559237 375484973 377551466 379787117 382083088 384376973 386632800
3516.2 386632800 388918132 391319007 393841386 396333814 398782581 401331156 403977156 406688809
3532.5 406688809 409472793 412225783 414904147 417739719 420836121 424020290 427062571 429996371
3548.8 429996371 432999730 436103493 439254761 442473739 445850194 449305385 452756971 456397057
3565.1 456397057 460251987 463905096 467404634 471056640 474879205 478767365 482685626 486672133
3581.5D86672133M102528M381150M505426M088610L868163M186332M334033M272282
3597.8E20410657M393279M394114M269302M445911M720569M552364M350066M267216
3614.1E55803478M185915M473984M526198L947258L728926M379690N331397M756927
3630.4E91133773L701806L793717L954828L888845L763199L556967L632843M283846
3646.7F21709824M811167L708899K466023K777815L275097K970635K715827K568960
3663F47004247K417564K675057L006279K473891K265155K725899J927019J193702J346290
3681.4F67035103J448572J688182K231181K053916R95278O37710R08554J168490J406490
3699.8F79573476J454771J107931J033962J439214J795470J311064L74079L29196P35998
$$ plain form
3581.5 486672133 490774661 495155811 499661237 503749847 507618010 511804342 516138375 520410657
3597.8 520410657 524803936 529198050 533467352 537913263 542633832 547186196 551536262 555803478
3614.1 555803478 559989393 564463377 568989575 572936833 576665759 581045449 586376846 591133773
3630.4 591133773 594835579 598629296 602584124 606472969 610236168 613793135 617425978 621709824
3646.7 621709824 626520991 630229890 632695913 635473728 638748825 641719460 644435287 647004247
3663 647004247 649421811 652096868 655103147 657577038 659842193 662568092 664495111 665688813 667035103
3681.4 667035103 668483675 670171857 672403038 674456954 675452232 676089942 676998496 678166986 679573476
3699.8 679573476 681028247 682136178 683170140 684609354 686404824 687715888 688089967 688419163 689155161
3718.1F89155161Q49426P33018O61135M62711L02851O57976J135945J049399M78566
3736.5F95486188n1439L338O35207P47800K35498N90860P89881k4915k07543K96712
3756.9F98501587M62115J86383J54198K28345K45452M33683K45572j56343l577M94778
3777.3G00792193M90666K7776K6166J39356N662O4433J85907J69992J15037K06173
3797.7G02223361O20842L86834k74957l0994M1187k66314o4850M55738M73797O9380
3818G03634024J35302o5863k37226M8637Q4817N3347P7843J54257L21388J38521j35779
3840.5G04209268j07348k06411l63469j67787M85361Q54492k63333q66354l00229J82391
3860.9G03456581L09050L0160j19508O4731m1723j99855k05040o0379J88768J2874
$$ plain form
3718.1 689155161 690004587 690737605 691398740 691861451 692164302 692822278 693958223 695007622 695486188
3736.5 695486188 695434749 695438087 696073294 696821094 697056592 697647452 698437333 698412418 698204875 698501587
3756.9 698501587 698963702 699150085 699304283 699532628 699778080 700211763 700457335 700300992 700297415 700792193
3777.3 700792193 701282859 701310635 701336801 701476157 701481819 701546252 701732159 701902151 702017188 702223361
3797.7 702223361 702844203 703231037 702956080 702925086 702966273 702699959 702635109 703090847 703564644 703634024
3818 703634024 703769326 703703463 703466237 703514874 703599691 703653038 703730881 703885138 704206526 704345047 704209268
3840.5 704209268 704101920 703895509 703532040 703364253 703849614 704704106 704440773 703574419 703274190 703456581
3860.9 703456581 703765631 703795791 703676283 703741014 703699291 703499436 703294396 703234017 703422785 703435659
3881.3G03435659j49965j78397k99334P0989K69294k16782l28660O2227K06232P7903
3901.7G02949166k7120k99215m53115k16424K7656N9784O080l5584o7950j00732j02877
3924.1G01739669j03474p5400j1384q7261k24054j85549j41740j32442j28269j82569
3944.5G00467527o7592J07885N9902j02222j85370j19984J5080L8087l4392n0545m4822
3966.9G00083554o5148o9559o4134q4699n3107M7981N6565o139l5405p3195p9512k7359
3991.4F99629843q34l5227r3281
3997.5F99500501
$$ plain form
3881.3 703435659 703285694 703107297 702807963 702878952 703148246 702931464 702602804 702665031 702871263 702949166
3901.7 702949166 702922046 702622831 702169716 701953292 701980948 702040732 702046812 702011228 701943278 701842546 701739669
3924.1 701739669 701636195 701560795 701549411 701462150 701238096 701052547 700910807 700778365 700650096 700467527
3944.5 700467527 700399935 700507820 700567722 700465500 700280130 700160146 700175226 700213313 700178921 700128376 700083554
3966.9 700083554 700018406 699948847 699884713 699800014 699746907 699794888 699851453 699845314 699809909 699736714 699657202 699629843
3991.4 699629843 699629009 699593782 699500501
3997.5 699500501
##END=$$ End of the data block
