##TITLE=T5PT $$ Begin of the data block
##JCAMP-DX=5.00 $$ ACD/SpecManager v 10.08
##SPECTROMETER/DATA SYSTEM=Alpha
##DATE=12 Mar 2014 10:59:36
##DATA TYPE=INFRARED SPECTRUM
##DATA CLASS=XYDATA
##ORIGIN=
##OWNER=
##NPOINTS=1765
##FIRSTX=399.75695801
##LASTX=3997.56933594
##MAXX=3997.56933594
##MINX=399.75695801
##MAXY=0.80551457
##MINY=0.37009087
##XFACTOR=1.0000000000
##YFACTOR=1.000000000000000e-9
##FIRSTY=0.61300325
##DELTAX=2.03957629
##XUNITS=1/CM
##YUNITS=ARBITRARY UNITS
##XYDATA=(X++(Y..Y))
$$ plain form
399.8 613003254 616786063 621069670 625062406 627627254 630041599 632974744 634953201 635781169 636684835
418.1 636684835 638144970 639812171 641426206 642429113 642654955 642697990 642610133 642468214 643464446
436.5 643464446 645552814 646893919 647548914 648732305 649592221 649841964 650758445 652057767 652438700
454.8 652438700 652313292 652872503 653724074 654577017 655610323 655922174 655328512 655180275 655709386 655866683
475.2 655866683 656067014 656842709 657170057 657042742 657558739 658210874 658350229 658845782 659752190 660123110
495.6 660123110 660371542 661002934 661163986 660827696 660980046 661168277 660592794 659945548 659440041 658252776
516 658252776 656979740 656803131 657067776 657061338 657353938 657701373 657390833 657257020 657825232 658166409
536.4 658166409 658154011 658343852 658186018 657365084 656707883 656198800 655063033 653716147 652760029 651759863
$$ packed form
399.8F13003254L782809M283607L992736K564848K414345K933145J978457Q27968R03666
418.1F36684835J460135J667201J614035J002907K25842M3035q7857j41919R96232
436.5F43464446K088368J341105O54995J183391Q59916K49743R16481J299322L80933
454.8F52438700j25408N59211Q51571Q52943J033306L11851n93662j48237N29111J57297
475.2F55866683K00331P75695L27348j27315N15997O52135J39355M95553R06408L70920
495.6F60123110K48432O31392J61052l36290J52350J88231n75483o47246n05507j187265
516F58252776j273036j76609K64645o438K92600L47435l10540j33813N68212L41177
536.4F58166409j2398J89841j57834q20934o57201n09083j135767j346886r56118j000166
$$ plain form
556.8 651759863 650879562 650997162 651633143 651730597 651695013 651957273 651733339 650979042 650520444 650291741
577.2 650291741 650123298 650630176 651580215 652065396 652531207 653526068 654211342 654349744 654734075 655058563
597.6 655058563 654696167 654340625 654181778 653350890 652119219 651397765 650881886 650185466 650045693 650730312
618 650730312 651655316 653053761 655142903 656890512 658047080 659673333 661729395 663552999 665559232
636.3 665559232 667676866 668952763 669775486 671077192 672198057 672648847 673254728 673754275 673191965
654.7 673191965 672207594 671558499 670617342 669491470 669130564 669015646 668897390 670210361 672129035
673.1 672129035 673431873 674479246 676137447 677701414 678560436 679529309 680609584 680934668 680897117
691.4 680897117 680798769 679491997 676822066 674948156 674565136 673579216 671183705 667686880 662587941
$$ packed form
556.8F51759863q80301J17600O35981R7454l5584K62260k23934p54297m58598k28703
577.2F50291741j68443N06878R50039M85181M65811R94861O85274J38402L84331L24488
597.6F55058563l62396l55542j58847q30888j231671p21454n15879o96420j39773O84619
618F50730312R25004J398445K089142J747609J156568J626253K056062J823604K006233
636.3F65559232K117634J275897Q22723J301706J120865M50790O05881M99547n62310
654.7F73191965r84371o49095r41157j125872l60906j14918j18256J312971J918674
673.1F72129035J302838J047373J658201J563967Q59022R68873J080275L25084l7551
691.4F80897117r8348j306772k669931j873910l83020r85920k395511l496825n098939
$$ plain form
709.8 662587941 657808661 656984985 659570158 662843883 667133272 673007011 679371893 686126828 693097234
728.1 693097234 698651135 702270746 705001175 706880569 707582355 708229065 709394932 710144579 710601449
746.5 710601449 711617827 712517023 712785304 713343024 714161515 714287281 714182973 714555442 714726508 714707553
766.9 714707553 715573847 716990590 718068361 719487488 721515000 722944498 723801911 725043833 726168036
785.2 726168036 726654470 727369606 728451610 729028761 729462147 730504990 731421053 731808007 732437551
803.6 732437551 733041584 732886314 732604027 732631922 732199728 731446207 731286824 731256783 730697334 730276287
824 730276287 730151117 729467571 728457212 727748871 726670921 724893093 723175049 721233189 718436420
842.3 718436420 715473175 712249279 707918465 702311575 695026755 687281728 682606041 682404041 683839262
$$ packed form
709.8F62587941m779280q23676K585173L273725M289389N873739O364882O754935O970406
728.1F93097234N553901L619611K730429J879394P01786O46710J165867P49647M56870
746.5G10601449J016378Q99196K68281N57720Q18491J25766j04308L72469J71066j8955
766.9G14707553Q66294J416743J077771J419127K027512J429498Q57413J241922J124203
785.2G26168036M86434P15136J082004N77151M33386J042843R16063L86954O29544
803.6G32437551O04033j55270k82287K7895m32194p53521j59383l0041n59449m21047
824G30276287j25170o83546j010359p08341j077950j777828j718044j941860k796769
842.3G18436420k963245l223896m330814n606890p284820p745027m675687k02000J435221
$$ plain form
860.7 683839262 682975471 677784503 666318178 645582497 617389321 590415597 572835445 570356250
877 570356250 587781191 620948553 655804634 682971001 702547610 716116548 724482656 729798794
893.3 729798794 733958423 737160444 739718854 742353261 744675577 746105134 747148693 747925580 747683525
911.7 747683525 746582568 745210409 743163407 740384817 737745106 735359848 732872963 730822027
928 730822027 729700565 729083776 728849411 729373753 730228603 730780125 731259942 731631160 731184363 729954839
948.4 729954839 728452384 726451457 723742306 720787883 717673481 714081526 710352182 706920683
964.7 706920683 703515887 700004160 696708560 693382680 689424157 684853494 679767668 673869133
981 673869133 667444408 661417544 655990601 650732756 645632029 640773892 636033237 631720781 628245652
$$ packed form
860.7F83839262q63791n190968j1466325k0735681k8193176k6973724j7580152k479195
877E70356250J7424941L3167362L4856081K7166367J9576609J3568938Q366108N316138
893.3G29798794M159629L202021K558410K634407K322316J429557J043559P76887k42055
911.7G47683525j100957j372159k047002k778590k639711k385258k486885k050936
928G30822027j121462o16789k34365N24342Q54850N51522M79817L71218m46797j229524
948.4G29954839j502455k000927k709151k954423l114402l591955l729344l431499
964.7G06920683l404796l511727l295600l325880l958523m570663n085826n898535
981F73869133o424725o026864n426943n257845n100727m858137m740655m312456l475129
$$ plain form
999.4 628245652 625289917 622342527 619311392 615961254 611851275 607281864 603091061 599559128
1015.7 599559128 596495330 593854129 591525257 589324832 587382615 585749209 584144354 582631886
1032 582631886 581710339 581564009 582083642 583176911 584363043 584923625 584707856 583992600 582915008
1050.4 582915008 581756949 581085503 581125736 581788063 583274424 585617065 588136435 590094328 591111481
1068.7 591111481 590873599 589453042 587625265 586114168 584983289 584517598 585933149 589440048 593609750
1087.1 593609750 597765088 602007329 605908096 609034121 611350596 612837195 613491476 613530815 613147497
1105.4 613147497 612446427 611836195 611902297 612859190 614535630 616585374 618531108 620086193 621494353
1123.8 621494353 623221517 625418544 627867401 630194187 632068634 633320689 633808613 633323491 631793618
$$ packed form
999.4F28245652k955735k947390l031135l350138m109979m569411m190803l531933
1015.7E99559128l063798k641201k328872k200425j942217j633406j604855j512468
1032E82631886r21547j46330N19633J093269J186132N60582k15769p15256j077592
1050.4E82915008j158059o71446M0233O62327J486361K342641K519370J957893J017153
1068.7E91111481k37882j420557j827777j511097j130879m65691J415551L506899M169702
1087.1E93609750M155338M242241L900767L126025K316475J486599O54281L9339l83318
1105.4F13147497p01070o10232O6102R56893J676440K049744J945734J555085J408160
1123.8F21494353J727164K197027K448857K326786J874447J252055M87924m85122j529873
$$ plain form
1142.2 631793618 629522502 627020657 624588668 622300923 620305777 618767917 617608428 616763830
1158.5 616763830 616555393 617480576 619880319 623815775 628920317 634560466 640285254 645824850 650857389
1176.8 650857389 655174732 658768117 661585689 663522184 664615929 664998412 664734244 663931549 662749290
1195.2 662749290 661247015 659502506 657687068 655902743 654262960 653077364 652486980 652143478 651648045
1213.5 651648045 650897264 649910390 648767292 647578835 646381676 645151019 643883407 642560244 641185224
1231.9 641185224 639959157 639091849 638510346 637996435 637423635 636717081 635924339 635243893 634828985
1250.3 634828985 634668708 634635866 634584129 634418726 634239137 634161353 634136438 634114385 634143114 634196818 634180307
1272.7 634180307 634057105 633771300 633280933 632924616 633294940 634321213 635386646 636116862 636474371
$$ packed form
1142.2F31793618k271116k501845k431989k287745j995146j537860j159489q44598
1158.5F16763830k08437R25183K399743L935456N104542N640149N724788N539596N032539
1176.8F50857389M317343L593385K817572J936495J093745L82483k64168q02695j182259
1195.2F62749290j502275j744509j815438j784325j639783j185596n90384l43502m95433
1213.5F51648045p50781r86874j143098j188457j197159j230657j267612j323163j375020
1231.9F41185224j226067q67308n81503n13911n72800p06554p92742o80446m14908
1250.3F34828985j60277l2842n1737j65403j79589p7784k4915k2053K8729N3704j6511
1272.7F34180307j23202k85805m90367l56317L70324J026273J065433P30216L57509
$$ plain form
1291 636474371 636568487 636628926 636690915 636480153 635883331 634985447 633778095 632158518 630214334 628005087
1311.4 628005087 625541925 623144805 621272683 620008469 619035065 618084013 616906881 615148783 612602651
1329.8 612602651 609501660 606242657 603246629 600899041 599474967 598854601 598436117 597634494 595991254
1348.1 595991254 593391716 590034306 586307406 582667708 579315245 575972676 572599888 569578767
1364.5 569578767 566471756 562584937 558282793 554156482 550374269 547104061 543910086 540246725
1380.8 540246725 536048114 531559229 526790440 521679819 516196489 509417295 500956178 491757661
1397.1 491757661 481926501 471733838 461252183 449780852 438406408 427659601 417022496
1411.4 417022496 406778038 397298485 388129145 379642904 374145299 371318609 370090872 370174408
$$ packed form
1291F36474371R4116O0439O1989k10762n96822q97884j207352j619577j944184k209247
1311.4F28005087k463162k397120j872122j264214r73404r51052j177132j758098k546132
1329.8F12602651l100991l259003k996028k347588j424074o20366m18484q01623j643240
1348.1E95991254k599538l357410l726900l639698l352463l342569l372788l021121
1364.5E69578767l107011l886819m302144m126311l782213l270208l193975l663361
1380.8E40246725m198611m488885m768789n110621n483330o779194q461117r198517
1397.1D91757661r831160j0192663j0481655j1471331j1374444j0746807j0637105
1411.4D17022496j0244458r479553r169340q486241n497605k826690j227737Q3536
$$ plain form
1427.7 370174408 371325463 373353481 375706434 378212094 381009251 383346796 384950370 386036426
1444 386036426 386730969 387251973 387807578 388316303 388531864 388654202 389727265 391533017 392927617
1462.4 392927617 393886626 394834489 395759732 396490425 397484422 399215877 401273340 403322756 405375332
1480.7 405375332 407659024 410182655 413004488 416603386 421260178 425974876 430558890 436026752
1497 436026752 442245632 448165268 453110814 457957894 464930654 472222835 478177011 483626366 489068270
1515.4 489068270 494954348 501022577 507703364 514507711 520498395 526354253 531631768 536287606
1531.7 536287606 541285336 545940161 549481690 553664684 559325337 564869702 570036292 574690104
1548 574690104 579186618 583602011 587712765 591118097 594834626 600502729 605180562 608453155 611168563
$$ packed form
1427.7C70174408J151055K028018K352953K505660K797157K337545J603574J086056
1444C86036426O94543N21004N55605N08725K15561J22338J073063J805752J394600
1462.4C92927617R59009R47863R25243P30693R93997J731455K057463K049416K052576
1480.7D05375332K283692K523631K821833L598898M656792M714698M584014N467862
1497D36026752O218880N919636M945546M847080O972760P292181N954176N449355N441904
1515.4D89068270N886078O068229O680787O804347N990684N855858N277515M655838
1531.7E36287606M997730M654825L541529M182994N660653N544365N166590M653812
1548E74690104M496514M415393M110754L405332L716529N668103M677833L272593K715408
$$ plain form
1566.4 611168563 613445640 615832567 617958784 619190514 620336473 621908724 623210669 623975575
1582.7 623975575 624341488 624327958 623955429 623255849 622273207 621071458 619761825 618340790 616631925
1601.1 616631925 614669800 612541676 610193431 607555866 604820907 601984918 598494887 594721735
1617.4 594721735 592101097 589665532 586575508 583723068 581257761 579102218 577344596 575345099
1633.7 575345099 573155105 572414458 572774887 573294342 573722601 574209929 575740814 577623427 579071522
1652 579071522 581908345 585794747 589064419 591998219 595265150 599142849 602714479 606005490 609997869
1670.4 609997869 614115417 618142962 622634351 626896262 630388975 633626819 638327897 643724680
1686.7 643724680 648281634 652715445 656700492 660509765 664771378 669218838 674717247 679879546
$$ packed form
1566.4F11168563K277077K386927K126217J231730J145959J572251J301945P64906
1582.7F23975575L65913j3530l72529o99580r82642j201749j309633j421035j708865
1601.1F16631925j962125k128124k348245k637565k734959k835989l490031l773152
1617.4E94721735k620638k435565l090024k852440k465307k155543j757622j999497
1633.7E75345099k189994p40647L60429N19455M28259M87328J530885J882613J448095
1652E79071522K836823L886402L269672K933800L266931L877699L571630L291011L992379
1670.4F09997869M117548M027545M491389M261911L492713L237844M701078N396783
1686.7F43724680M556954M433811L985047L809273M261613M447460N498409N162299
$$ plain form
1703 679879546 684146762 688573301 692624331 695902407 698500812 700651586 703328550 706796110 709739208
1721.4 709739208 711982608 714029908 715830982 717303693 718396068 719791830 722139060 724194705
1737.7 724194705 725915849 727859497 729808271 731620908 733385444 735488474 738163114 740584254
1754 740584254 742468297 744205534 745782733 747445107 749144971 750371814 751221478 751884818 752756298
1772.4 752756298 754041612 754943490 755160928 755116343 755073845 754912376 754699707 754411399 753944933 753839970
1792.8 753839970 754248261 754567266 754748344 755290151 756377876 757612050 758778632 760011375 761493683
1811.1 761493683 763170540 764813423 766340017 767745674 768919468 769838154 770714343 771518469 772329330
1829.5 772329330 773460448 774548531 775319159 776001453 776579201 776828766 777074337 777853370 778799057
$$ packed form
1703F79879546M267216M426539M051030L278076K598405K150774K676964L467560K943098
1721.4G09739208K243400K047300J801074J472711J092375J395762K347230K055645
1737.7G24194705J721144J943648J948774J812637J764536K103030K674640K421140
1754G40584254J884043J737237J577199J662374J699864J226843Q49664O63340Q71480
1772.4G52756298J285314R01878K17438m4585m2498j61469k12669k88308m66466j04963
1792.8G53839970M08291L19005J81078N41807J087725J234174J166582J232743J482308
1811.1G61493683J676857J642883J526594J405657J173794R18686Q76189Q04126Q10861
1829.5G72329330J131118J088083P70628O82294N77748K49565K45571P79033R45687
$$ plain form
1847.8 778799057 779567540 780182064 780683279 781181097 781662226 782101989 782537818 782874227 782933295 783027530
1868.2 783027530 783673525 784502029 785066128 785460591 785805285 786106110 786413312 786744833 786977112 787134051
1888.6 787134051 787466168 787868381 788168311 788504720 788861752 789152920 789405882 789626598 789770365 789924920
1909 789924920 790206850 790478408 790552318 790547550 790716171 790942132 791187644 791527510 791783929 791947842
1929.4 791947842 792113602 792257607 792388499 792513788 792502940 792396963 792521298 792847633 793072283 793177307
1949.8 793177307 793272257 793361604 793440402 793546677 793676019 793767869 793791115 793798685 793906033 794121027 794343412
1972.3 794343412 794493735 794568896 794654846 794761539 794819772 794832945 794846475 794820905 794744611 794762909 794874966
1994.7 794874966 794936419 794981956 795041263 795046747 795022130 794999778 794957876 794918954 794898391 794815361 794686913
$$ packed form
1847.8G78799057P68483O14524N01215M97818M81129M39763M35829L36409N9068R4235
1868.2G83027530O45995Q28504N64099L94463L44694L00825L07202L31521K32279J56939
1888.6G87134051L32117M02213K99930L36409L57032K91168K52962K20716J43767J54555
1909G89924920K81930K71558P3910m768J68621K25961K45512L39866K56419J63913
1929.4G91947842J65760J44005J30892J25289j0848j05977J24335L26335K24650J05024
1949.8G93177307R4950Q9347P8798J06275J29342R1850K3246P570J07348K14994K22385
1972.3G94343412J50323P5161Q5950J06693N8233J3173J3530k5570p6294J8298J12057
1994.7G94874966O1453M5537N9307N484k4617k2352m1902l8922k0563q3030j28448
$$ plain form
2017.1 794686913 794632614 794609189 794520259 794413507 794351757 794266820 794132233 794027209 793953955 793856084 793774843
2039.6 793774843 793756723 793738723 793708920 793704867 793712854 793717623 793743432 793787599 793811142 793833494 793878138 793899775
2064 793899775 793906152 793962419 794032574 794068217 794113576 794191957 794252634 794304132 794413090 794529021 794593215 794649720
2088.5 794649720 794701099 794698477 794703662 794797301 794907808 794956625 794980645 795010507 795018852 795025408 795058191 795069814
2113 795069814 795043886 795044422 795078635 795106173 795123518 795129657 795117915 795108497 795137107 795177996 795208693 795279086 795393288
2139.5 795393288 795497715 795611620 795766294 795915127 796038151 796161652 796314299 796486497 796670616 796881557
2159.9 796881557 797073901 797237575 797443211 797691822 797932744 798171699 798430026 798681617 798904479 799140692
2180.3 799140692 799398899 799620688 799818277 800056577 800288856 800456703 800621033 800804853 800970495 801127791
$$ packed form
2017.1G94686913n4299k3425q8930j06752o1750q4937j34587j05024p3254r7871q1241
2039.6G93774843j8120j8000k9803m053P987M769K5809M4167K3543K2352M4644K1637
2064G93899775O377N6267P0155L5643M5359P8381O0677N1498J08958J15931O4194N6505
2088.5G94649720N1379k622N185R3639J10507M8817K4020K9862Q345O556L2783J1623
2113G95069814k5928N36L4213K7538J7345O139j1742r418K8610M0889L0697P0393J14202
2139.5G95393288J04427J13905J54674J48833J23024J23501J52647J72198J84119K10941
2159.9G96881557J92344J63674K05636K48611K40922K38955K58327K51591K22862K36213
2180.3G99140692K58207K21789J97589K38300K32279J67847J64330J83820J65642J57296
$$ plain form
2200.7 801127791 801284790 801405728 801506102 801630259 801751912 801842332 801921248 801995754 802045465 802083731
2221.1 802083731 802144885 802220047 802280664 802347004 802431405 802501202 802583992 802704155 802794874 802848756 802938402
2243.5 802938402 803033531 803088009 803158522 803280890 803408027 803510070 803613126 803716063 803821921 803967297
2263.9 803967297 804142892 804299355 804448307 804618299 804749489 804821372 804900885 804998577 805083215 805144489
2284.3 805144489 805179417 805190682 805185497 805202127 805246949 805278361 805320263 805355668 805314541 805234671 805184007 805138886
2308.8 805138886 805057347 804948866 804827094 804694116 804542720 804358184 804199159 804118991 804019868 803873837
2329.2 803873837 803823590 803867459 803796828 803574145 803433716 803458571 803586185 803944230 804278851 804148376
2349.6 804148376 803655028 803186893 802907944 802735746 802565455 802466452 802631497 803019702 803449154 803787172
$$ packed form
2200.7H01127791J56999J20938J00374J24157J21653R0420P8916P4506M9711L8266
2221.1H02083731O1154P5162O0617O6340Q4401O9797Q2790J20163R0719N3882Q9646
2243.5H02938402R5129N4478P0513J22368J27137J02043J03056J02937J05858J45376
2263.9H03967297J75595J56463J48952J69992J31190P1883P9513R7692Q4638O1274
2284.3H05144489L4928J1265n185J6630M4822L1412M1902L5405m1127p9870n0664m5121
2308.8H05138886q1539j08481j21772j32978j51396j84536j59025q0168r9123j46031
2329.2H03873837n0247M3869p0631k22683j40429K4855J27614L58045L34621j30475
2349.6H04148376m93348m68135k78949j72198j70291r9003J65045L88205M29452L38018
$$ plain form
2370 803787172 804032743 804322302 804683030 804998457 805234909 805414498 805506527 805514574 805500209 805453360 805346429
2392.4 805346429 805245221 805184960 805097699 804980159 804909825 804840624 804695010 804539859 804418325 804258645
2412.8 804258645 804078758 803949356 803813457 803636432 803472102 803302169 803076327 802844226 802643538 802411258
2433.2 802411258 802132726 801875651 801638544 801363945 801085234 800849319 800604701 800317824 800016940 799683809
2453.6 799683809 799308836 798959792 798633873 798246801 797811866 797385097 796918690 796369433 795783043 795144558
2474 795144558 794371188 793511033 792653918 791771472 790837467 789880872 788892806 787862718 786870539 785967529
2494.4 785967529 785110414 784309268 783597827 782907128 782209694 781560659 780912340 780167699 779371142 778626502
2514.8 778626502 777913570 777254343 776778936 776494324 776305318 776228428 776330590 776546121 776844323 777253091
$$ packed form
2370H03787172K45571K89559L60728L15427K36452J79589R2029Q047j4365m6849j06931
2392.4H05346429j01208o0261q7261j17540p0334o9201j45614j55151j21534j59680
2412.8H04258645j79887j29402j35899j77025j64330j69933k25842k32101k00688k32280
2433.2H02411258k78532k57075k37107k74599k78711k35915k44618k86877l00884l33131
2453.6G99683809l74973l49044l25919l87072m34935m26769m66407n49257n86390o38485
2474G95144558p73370q60155q57115q82446r34005r56595r88066j030088r92179r03010
2494.4G85967529q57115q01146p11441o90699o97434o49035o48319p44641p96557p44640
2514.8G78626502p12932o59227m75407k84612j89006p6890J02162K15531K98202M08768
$$ plain form
2535.2 777253091 777664721 777989149 778293610 778634429 778977931 779341996 779762566 780171275 780512154 780804813
2555.6 780804813 781046152 781215131 781335354 781450689 781537473 781568468 781601250 781626880 781574309 781487286 781423151
2578 781423151 781310976 781138718 781012475 780898154 780688941 780442595 780243754 780046046 779820740 779620826
2598.4 779620826 779418409 779154658 778893352 778691709 778493404 778291047 778151989 778038323 777893662 777761519
2618.8 777761519 777643681 777501702 777367830 777271450 777161539 777018487 776894450 776774645 776613712 776442528
2639.2 776442528 776285946 776096642 775865495 775650501 775435805 775150537 774843454 774584889 774309576 773991406
2659.6 773991406 773689508 773404837 773091912 772766411 772467256 772158086 771806180 771462977 771154583 770813167
2680 770813167 770431340 770055830 769646525 769187689 768762529 768364310 767912805 767456770 767047584 766614795
$$ packed form
2535.2G77253091M11630L24428L04461L40819L43502L64065M20570M08709L40879K92659
2555.6G80804813K41339J68979J20223J15335Q6784L0995L2782K5630n2571q7023o4135
2578G81423151j12175j72258j26243j14321k09213k46346j98841j97708k25306j99914
2598.4G79620826k02417k63751k61306k01643j98305k02357j39058j13666j44661j32143
2618.8G77761519j17838j41979j33872r6380j09911j43052j24037j19805j60933j71184
2639.2G76442528j56582j89304k31147k14994k14696k85268l07083k58565k75313l18170
2659.6G73991406l01898k84671l12925l25501k99155l09170l51906l43203l08394l41416
2680G70813167l81827l75510m09305m58836m25160l98219m51505m56035m09186m32789
$$ plain form
2700.4 766614795 766145825 765705109 765257061 764760435 764280796 763856232 763453841 763050556 762649834 762244463
2720.8 762244463 761831164 761448383 761101365 760729611 760357499 760049045 759767115 759473026 759196818 758946538
2741.2 758946538 758672893 758398354 758163571 757902086 757595837 757315159 757032752 756676078 756284356 755902886
2761.6 755902886 755495310 755069256 754700601 754355609 753953159 753534913 753130615 752685726 752220154 751789987
2782 751789987 751342773 750826001 750284970 749747157 749165356 748529136 747864366 747152269 746414125 745683789
2802.3 745683789 744896173 744017482 743116438 742209733 741223574 740169525 739119411 738029599 736854792
2820.7 736854792 735624433 734346867 733000875 731582880 730084598 728441775 726614058 724590838
2837 724590838 722310305 719706893 716741860 713348866 709682703 706362724 703955650 702459216 701556146
$$ packed form
2700.4G66614795m68970m40716m48048m96626m79639m24564m02391m03285m00722m05371
2720.8G62244463m13299l82781l47018l71754l72112l08454k81930k94089k76208k50280
2741.2G58946538k73645k74539k34783k61485l06249k80678k82407l56674l91722l81470
2761.6G55902886m07576m26054l68655l44992m02450m18246m04298m44889m65572m30167
2782G51789987m47214n16772n41031n37813n81801o36220o64770p12097p38144p30336
2802.3G45683789p87616q78691r01044r06705r86159j054049j050114j089812j174807
2820.7G36854792j230359j277566j345992j417995j498282j642823j827717k023220
2837G24590838k280533k603412k965033l392994l666163l319979k407074j496434r03070
$$ plain form
2855.4 701556146 700980783 700542152 700066447 699409425 698502004 697386980 696192682 695072770 694120288
2873.7 694120288 693292022 692471504 691560805 690497637 689244509 687758684 686061561 684294760 682633638
2892.1 682633638 681240797 680208623 679513335 679065168 678728580 678341210 677742779 676764846 675317764
2910.4 675317764 673517406 671627223 669909954 668555021 667647541 667201519 667216539 667605460 668237388
2928.8 668237388 669098258 670189798 671416461 672652900 673789620 674798012 675769627 676817238 677973032
2947.2 677973032 679116249 680045307 680712700 681214213 681653380 682113707 682606101 683087766 683567703
2965.5 683567703 684177697 685143769 686598599 688406408 690281928 692075074 693821192 695523977 697079241
2983.9 697079241 698441923 699654639 700715065 701602638 702350438 702952325 703359365 703593254 703697324
$$ packed form
2855.4G01556146n75363m38631m75705o57022r07421j115024j194298j119912r52482
2873.7F94120288q28266q20518r10699j063168j253128j485825j697123j766801j661122
2892.1F82633638j392841j032174o95288m48167l36588l87370n98431r77933j447082
2910.4F75317764j800358j890183j717269j354933r07480m46022J5020L88921O31928
2928.8F68237388Q60870J091540J226663J236439J136720J008392R71615J047611J155794
2947.2F77973032J143217R29058O67393N01513M39167M60327M92394M81665M79937
2965.5F83567703O09994R66072J454830J807809J875520J793146J746118J702785J555264
2983.9F97079241J362682J212716J060426Q87573P47800O01887M07040K33889J04070
$$ plain form
3002.2 703697324 703695595 703626394 703473985 703229845 702984452 702806473 702673495 702526391 702322543 702010989
3022.6 702010989 701558471 701005518 700370908 699657500 698949695 698277354 697547078 696721137 695847154 694982231
3043 694982231 694109380 693163157 692185223 691214681 690210223 689216197 688292861 687369049 686370730 685360193
3063.4 685360193 684404850 683458567 682494700 681546152 680624425 679728985 678838193 677904665 676924050 675947309
3083.8 675947309 674982131 674003959 673027873 672035336 670990944 669933319 668919563 667939901 666910112
3102.2 666910112 665789247 664664805 663562894 662424505 661316216 660280466 659179568 657932758
3118.5 657932758 656581044 655200541 653875172 652590632 651266932 649856627 648404479 646990955
3134.8 646990955 645623744 644237220 642757058 641195893 639582932 637950182 636390686 634900510
$$ packed form
3002.2G03697324j729o9201j52409k44140k45393j77979j32978j47104k03848l11554
3022.6G02010989m52518n52953o34610p13408p07805o72341p30276q25941q73983q64923
3043F94982231q72851r46223r77934r70542j004458r94026r23336r23812r98319j010537
3063.4F85360193r55343r46283r63867r48548r21727q95440q90792r33528r80615r76741
3083.8F75947309r65178r78172r76086r92537j044392j057625j013756r79662j029789
3102.2F66910112j120865j124442j101911j138389j108289j035750j100898j246810
3118.5F57932758j351714j380503j325369j284540j323700j410305j452148j413524
3134.8F46990955j367211j386524j480162j561165j612961j632750j559496j490176
$$ plain form
3151.1 634900510 633346200 631690562 629994571 628277659 626569450 624862850 623118877 621361494
3167.4 621361494 619603395 617823362 615999699 614161372 612362266 610561550 608699203 606819868
3183.7 606819868 604970694 603134692 601285636 599384308 597416341 595448494 593522429 591581106
3200.1 591581106 589609385 587657869 585720420 583732784 581699073 579675734 577647150 575590551
3216.4 575590551 573509336 571402788 569304287 567247987 565224230 563263059 561457515 559796214
3232.7 559796214 558113873 556400597 554841280 553446949 552106857 550805807 549510121 548129380
3249 548129380 546690226 545305312 543950379 542502522 540968955 539434493 537923694 536489666 535212994
3267.4 535212994 534043312 532803178 531482756 530225217 529020965 527804792 526602805 525407791
$$ packed form
3151.1F34900510j554310j655638j695991j716912j708209j706600j743973j757383
3167.4F21361494j758099j780033j823663j838327j799106j800716j862347j879335
3183.7F06819868j849174j836002j849056j901328j967967j967847j926065j941323
3200.1E91581106j971721j951516j937449j987636k033711k023339k028584k056599
3216.4E75590551k081215k106548k098501k056300k023757j961171j805544j661301
3232.7E59796214j682341j713276j559317j394331j340092j301050j295686j380741
3249E48129380j439154j384914j354933j447857j533567j534462j510799j434028j276672
3267.4E35212994j169682j240134j320422j257539j204252j216173j201987j195014
$$ plain form
3283.7 525407791 524177134 522956371 521779954 520568132 519253314 517846465 516386807 514956236
3300 514956236 513666689 512525380 511338711 509920537 508342266 506763637 505228877 503711343 502153158
3318.4 502153158 500510633 498824716 497116655 495272964 493274629 491256922 489246458 487264723
3334.7 487264723 485400200 483557642 481632948 479710549 477846712 476086587 474482268 472905755
3351 472905755 471213013 469465166 467788160 466202945 464622200 463020146 461521655 460107774 458531380
3369.3 458531380 456714183 454912663 453354120 451988965 450708628 449452162 448236406 447140872
3385.7 447140872 446202397 445390731 444479346 443273664 442017436 441060215 440299869 439323992 438123882
3404 438123882 437124521 436438948 435860664 435273528 434666455 434089363 433627218 433279604 432980418 432779610
$$ packed form
3283.7E25407791j230657j220763j176417j211822j314818j406849j459658j430571
3300E14956236j289547j141309j186669j418174j578271j578629j534760j517534j558185
3318.4E02153158j642525j685917j708061j843691j998335k017707k010464j981735
3334.7D87264723j864523j842558j924694j922399j863837j760125j604319j576513
3351D72905755j692742j747847j677006j585215j580745j602054j498491j413881j576394
3369.3D58531380j817197j801520j558543j365155j280337j256466j215756j095534
3385.7D47140872r38475q11666r11385j205682j256228r57221p60346r75877j200110
3404D38123882r99361o85573n78284n87136o07073n77092m62145l47614k99186k00808
$$ plain form
3424.4 432779610 432783663 432954371 433102101 433219582 433415711 433528453 433441937 433420390 433676779 434096903
3444.8 434096903 434544712 435019791 435561270 436161667 436843634 437693805 438658655 439527124 440385699 441530794
3465.2 441530794 442836851 443913281 444720954 445566803 446641147 447946131 449284017 450462490 451638848
3483.6 451638848 452974856 454339236 455665916 457070559 458552510 460067511 461601108 463145852
3499.9 463145852 464712441 466249526 467707247 469193488 470883638 472780466 474631697 476308018
3516.2 476308018 477981538 479759812 481667578 483590066 485384315 487219006 489264697 491410822
3532.5 491410822 493590385 495797575 497960478 500141442 502381086 504615128 506848335 509122729
3548.8 509122729 511425793 513838768 516370356 518905282 521473408 524056554 526374817 528475583
$$ packed form
3424.4D32779610M053J70708J47730J17481J96129J12742q6516k1547K56389M20124
3444.8D34096903M47809M75079N41479O00397O81967Q50171R64850Q68469Q58575J145095
3465.2D41530794J306057J076430Q07673Q45849J074344J304984J337886J178473J176358
3483.6D51638848J336008J364380J326680J404643J481951J515001J533597J544744
3499.9D63145852J566589J537085J457721J486241J690150J896828J851231J676321
3516.2D76308018J673520J778274J907766J922488J794249J834691K045691K146125
3532.5D91410822K179563K207190K162903K180964K239644K234042K233207K274394
3548.8E09122729K303064K412975K531588K534926K568126K583146K318263K100766
$$ plain form
3565.1 528475583 531224012 534687042 537846446 540626168 543516278 546607852 549801826 552980065
3581.5 552980065 555903137 558599472 561730921 565406144 568773389 571918249 575350940 578928709
3597.8 578928709 582490981 586117327 589501262 592462301 595648170 599287808 602943361 606530547
3614.1 606530547 609815300 613227665 617517233 621601284 624508500 626712143 630032837 634935200
3630.4 634935200 639026105 642369032 645720541 648953795 652103245 654976666 657133222 659030139
3646.7 659030139 662351668 667034626 670525491 673004806 676178098 679500937 682070076 684279263
3663 684279263 686113715 687373281 689046443 691424310 692938507 694813550 697911680 700254977 701910138
3681.4 701910138 703246176 704043508 704947829 706781566 708847046 710389376 711546302 712360024 712966859
$$ packed form
3565.1E28475583K748429L463030L159404K779722K890110L091574L193974L178239
3581.5E52980065K923072K696335L131449L675223L367245L144860L432691L577769
3597.8E78928709L562272L626346L383935K961039L185869L639638L655553L587186
3614.1F06530547L284753L412365M289568M084051K907216K203643L320694M902363
3630.4F34935200M090905L342927L351509L233254L149450K873421K156556J896917
3646.7F59030139L321529M682958L490865K479315L173292L322839K569139K209187
3663F84279263J834452J259566J673162K377867J514197J875043L098130K343297J655161
3681.4G01910138J336038P97332R04321J833737K065480J542330J156926Q13722O06835
$$ plain form
3699.8 712966859 713938057 715097189 715568244 715427876 715529203 716748118 718324840 719079137 719255507
3718.1 719255507 719351709 719563425 719936132 720553815 720982194 720713317 720215678 720437407 721724153 722847283
3738.5 722847283 722462773 721341372 721684277 722642899 722382486 722706735 724226236 725002289 724932611
3756.9 724932611 725156367 725808263 726012349 725891650 725876212 726141810 726829946 727311313 727220714 726995885
3777.3 726995885 727163911 727507174 727578223 727701306 727991641 728181362 728119373 727722585 727350175 727008939
3797.7 727008939 726519406 726823926 727385044 727438629 727991700 728509545 728085577 727221906 726943135 726869464
3818 726869464 726677775 727422953 728058398 727997422 727882385 727689743 727484703 727165937 726797521 726937890
3838.4 726937890 727372646 727803171 728316784 728372037 727385283 725564241 724862695 726718605 728002608
$$ packed form
3699.8G12966859R71198J159132M71055j40368J01327J218915J576722P54297J76370
3718.1G19255507R6202K11716L72707O17683M28379k68877m97639K21729J286746J123130
3738.5G22847283l84510j121401L42905R58622k60413L24249J519501P76053o9678
3756.9G24932611K23756O51896K04086j20699j5438K65598O88136M81367r0599k24829
3777.3G26995885J68026L43263P1049J23083K90335J89721o1989l96788l72410l41236
3797.7G27008939m89533L04520N61118N3585N53071N17845m23968q63671k78771p3671
3818G26869464j91689P45178O35445o0976j15037j92642k05040l18766l68416J40369
3838.4G26937890M34756M30525N13613N5253r86754j821042p01546J855910J284003
$$ plain form
3856.8 728002608 727736831 726989567 726508975 726563156 726370752 726057231 726451278 726977587 727278948 727037013
3877.2 727037013 726497471 726502657 726510882 726568282 726748705 726378262 726246834 726626873 726444006 725677788
3897.6 725677788 725039244 724865973 725294828 726073921 726474941 726436496 726200700 725691199 725175917 725111246
3918 725111246 725251555 725115359 724929631 724945426 724767506 724436581 724510610 724844694 724879384 724557042
3938.4 724557042 724127412 723918021 723906696 723761320 723608673 723629296 723650932 723596811 723521769 723407507
3958.8 723407507 723300636 723283947 723235786 723058581 722880840 722787559 722736418 722712755 722655118 722535431 722470582
3981.2 722470582 722486258 722443640 722294807 722145021 722042918 721929669 721827090 721799791
3997.5 721799791
$$ packed form
3856.8G28002608k65777p47264m80592N4181j92404l13521L94047N26309L01361k41935
3877.2G27037013n39542N186Q225N7400J80423l70443j31428L80039j82867p66218
3897.6G25677788o38544j73271M28855P79093M01020l8445k35796n09501n15282o4671
3918G25111246J40309j36196j85728J5795j77920l30925P4029L34084L4690l22342
3938.4G24557042m29630k09391j1325j45376j52647K0623K1636n4121p5042j14262
3958.8G23407507j06871j6689m8161j77205j77741r3281n1141k3663n7637j19687o4849
3981.2G22470582J5676m2618j48833j49786j02103j13249j02579k7299
3997.5G21799791
##END=$$ End of the data block
