##TITLE=T5PR $$ Begin of the data block
##JCAMP-DX=5.00 $$ ACD/SpecManager v 10.08
##SPECTROMETER/DATA SYSTEM=Alpha
##DATE=12 Mar 2014 10:59:36
##DATA TYPE=INFRARED SPECTRUM
##DATA CLASS=XYDATA
##ORIGIN=
##OWNER=
##NPOINTS=1765
##FIRSTX=399.75695801
##LASTX=3997.56933594
##MAXX=3997.56933594
##MINX=399.75695801
##MAXY=0.77807939
##MINY=0.31973302
##XFACTOR=1.0000000000
##YFACTOR=1.000000000000000e-9
##FIRSTY=0.55679691
##DELTAX=2.03957629
##XUNITS=1/CM
##YUNITS=ARBITRARY UNITS
##XYDATA=(X++(Y..Y))
399.8E56796908L535390K469302K284109L258288K669156J335203J844824K303063
416.1E76496243J054705J042187K549231J621485l15309L07560J513243N21004J25766
434.4E84916115J621663J693309N69582J221478J964211O52492K13981J590967J455069
452.8E95898867l8088M40538J649320P18892M5776J100600J112342k59697R8288J404941
473.2F02171779O71863j39653R08255J262546N9426J53839J446486J111626J91748
491.5F07837915J014650J554549L37780R7870J298011R88364k33591K13385P82967
509.9F13891900k41220p33614L03208M07696o79791j81675J100183N88238l16918L35515
530.3F14473522P16448k94030n13554M95196K96831p30992l11553M17530m64320j250505
$$ plain form
399.8 556796908 560332298 562801600 565085709 568343997 571013153 572348356 574193180 576496243
416.1 576496243 577550948 578593135 581142366 582763851 582448542 582756102 584269345 584790349 584916115
434.4 584916115 586537778 588231087 588800669 590022147 591986358 592638850 592852831 594443798 595898867
452.8 595898867 595860779 596301317 597950637 598669529 598715305 599815905 600928247 600668550 600766838 602171779
473.2 602171779 602843642 602703989 603612244 604874790 604934216 605088055 606534541 607646167 607837915
491.5 607837915 608852565 610407114 610744894 610842764 612140775 613129139 612895548 613108933 613891900
509.9 613891900 613650680 612917066 613220274 613627970 612948179 612766504 613866687 614454925 614138007 614473522
530.3 614473522 615189970 614895940 614382386 614877582 615174413 614443421 614131868 614549398 614085078 612834573
550.7F12834573n68748l97205j181781p68006M70221K33829n79536N2571N79655l81171
571.1F10294402p44164N7041J6809m82798K68936J074732M91082N6625P71343J008571
591.5F12812579J94847N9724O41763J83463p27534m95851k22802j056552j358807l87728
611.9F09643102O139m50015J62363J477897J570583J141786J463711J709760J185357
630.2F17910683J158595J996577K053142J214742J153171J568318R78291K96831P56204
648.6F29086554R50635K3484l14296J60516k97189j268625r52959q4520l16441m39107
669F26548052R26077J279950O07372N26130J232862J007736R3162J13666K90156p37489
689.4F31887674j730203j971007l646075o474793m259885K158642K729833k621889
$$ plain form
550.7 612834573 612265825 611868620 610686839 609918833 610389054 610622883 610043347 610095918 610675573 610294402
571.1 610294402 609550238 609607279 609624088 609141290 609410226 610484958 610976040 611032665 611804008 612812579
591.5 612812579 613007426 613067150 613708913 613892376 613164842 612668991 612446189 611389637 610030830 609643102
611.9 609643102 609649241 609199226 609361589 610839486 612410069 613551855 615015566 616725326 617910683
630.2 617910683 619069278 621065855 623118997 624333739 625486910 627055228 628033519 628330350 629086554
648.6 629086554 630037189 630060673 629746377 629906893 629609704 628341079 627388120 627303600 626987159 626548052
669 626548052 627474129 628754079 629361451 629887581 631120443 632128179 632221341 632335007 632625163 631887674
689.4 631887674 630157471 628186464 624540389 618065596 613805711 615964353 618694186 616072297
705.7F16072297p044375j0284543r797156o67393R154558J0299981P708907P534683
722F22976959Q635938Q457184P057667N941927M603922K190769N16176O45757O76274
740.4F61702573N5135M42981J382292R99927J73807N13256P47621k39730p80284j74284
760.8F64823294l41535j358628j061082J24872K35915J63913J201272J712739P50482
779.1F66251242K70605Q83997O89983k36750K6882P80165L07858j53958O22451Q31663
799.5F70274138k21729m68612J63198l32952j418292j167119n71549j208245j663387
817.9F63385451r02474p19726j663566j842916j362622k014875l110647l118932l227950
836.2F45421743m704952o241321n838335m675686o347001r803533j3294280j7386496
$$ plain form
705.7 616072297 609027922 598743379 588946223 588278830 597433388 607733369 615442276 622976959
722 622976959 631612897 640070081 647127748 653069675 657673597 659864366 660380542 661026299 661702573
740.4 661702573 661757708 662200689 663582981 664582908 664756715 665269971 666017592 665777862 664997578 664823294
760.8 664823294 664481759 663123131 662062049 662186921 662422836 662586749 663788021 665500760 666251242
779.1 666251242 666521847 667405844 668095827 667859077 667885959 668666124 668973982 668820024 669442475 670274138
799.5 670274138 670052409 669583797 669746995 669414043 667995751 666828632 666257083 665048838 663385451
817.9 663385451 662482977 661763251 660099685 658256769 656894147 654879272 651768625 648649693 645421743
836.2 645421743 640716791 634475470 628637135 623961449 617614448 607810915 594516635 577130139
852.5E77130139j6278625n936920N361020R310425P179081K515376m627407j3323724
868.9E61329365j8324197j5996813q466244K859592J7502368K8164208K8284192K2831201
885.2F18183672J8404901J4554084J0483205P977605P025063N920529M860521M718840
901.5F92128420M425347L044009J990318K008558J274585o12378j893580k520561l596246
919.8F96248472m507721m315257l738344l410398k569497j033962J22309O08027J141369
938.2F78544998J564264J097739J50204m03404r14753j945257k827346l101886l507554
956.6F68657005m258394m506052m162610m046380m059434l562033l007412l172159
972.9F37882531l666103l932715m456639n423367n791962n198956m705011m642964
$$ plain form
852.5 577130139 560851514 554914594 560275614 569586039 576765120 579280496 574653089 561329365
868.9 561329365 543005168 527008355 518542111 521401703 538904071 567068279 595352471 618183672
885.2 618183672 636588573 651142657 661625862 669603467 676628530 682549059 687409580 692128420
901.5 692128420 696553767 699597776 701588094 703596652 704871237 704258859 702365279 699844718 696248472
919.8 696248472 691740751 687425494 683687150 680276752 677707255 676673293 676795602 677403629 678544998
938.2 678544998 680109262 681207001 681357205 680953801 680039048 678093791 675266445 672164559 668657005
956.6 668657005 664398611 659892559 655729949 651683569 647624135 644062102 641054690 637882531
972.9 637882531 634216428 630283713 625827074 620403707 614611745 609412789 604707778 600064814
989.2F00064814m321396l862679l875017l865421l270924k841354l125429l399551
1005.5E71503043l410339l918946m634500m399895l567338l372908l533840l210783
1021.8E41454494k877414l060401l155827k871156k729595k444625j232683K38418
1038.1E23321211O07729J11938l59416j003087j946985k413333k202690k082586k070248
1056.5E11962533j314640M947P86543J011074J128554P06255l57747j046538j003265
1074.8E11877716j218081k272427k124429J977086O461382O510675M776418L994584
1091.2E29982924L296078K719402K492011J915335J045645O11484K95639m44234q68618
1109.5E41045666k61486P03991J289963J692713J929521J598120J144290J402140J949906
$$ plain form
989.2 600064814 595743418 591880739 588005722 584140301 580869377 578028023 574902594 571503043
1005.5 571503043 568092704 564173758 559539258 555139363 551572025 548199117 544665277 541454494
1021.8 541454494 538577080 535516679 532360852 529489696 526760101 524315476 523082793 523321211
1038.1 523321211 523928940 524040878 523681462 522678375 520731390 518318057 516115367 514032781 511962533
1056.5 511962533 510647893 510652840 511439383 512450457 513579011 514285266 513927519 512880981 511877716
1074.8 511877716 510659635 508387208 506262779 508239865 514701247 521211922 525988340 529982924
1091.2 529982924 533279002 535998404 538490415 540405750 541451395 542062879 542358518 541914284 541045666
1109.5 541045666 540784180 541488171 542778134 544470847 546400368 547998488 549142778 550544918 552494824
1127.9E52494824J964331J718640J660347J352072N41329j99139p29442j436054j998783
1146.2E55368125j943886j752853j867891j804173j318037j005888q38578P6473J741886
1164.6E46655178L169835L961265M447102M581571M178107L695488L441572K912938
1180.9E77043056J965285J241863Q40306K32756m35173o23763o39498r97424j372397
1199.3E77255011j397551j445770j634121j413047q94070q24034j126468j212239j178444
1217.6E66129267j341164j454413j295566j248718j444220j450718j254260j197398
1233.9E55442810j156986q75175o82056q50796j007915q60691o97553o28471l88325
1252.3E48294842j05679j36673l07560j98186K2114M5180M9770K07126K55108J06931
$$ plain form
1127.9 552494824 554459155 556177795 557838142 559190214 559731543 559532404 558802962 557366908 555368125
1146.2 555368125 553424239 551671386 549803495 547999322 546681285 545675397 544836819 544913292 546655178
1164.6 546655178 549825013 553786278 558233380 562814951 566993058 570688546 574130118 577043056
1180.9 577043056 579008341 580250204 581090510 581323266 580888093 580264330 579624832 578627408 577255011
1199.3 577255011 575857460 574411690 572777569 571364522 570470452 569646418 568519950 567307711 566129267
1217.6 566129267 564788103 563333690 562038124 560789406 559345186 557894468 556640208 555442810
1233.9 555442810 554285824 553410649 552728593 551877797 550869882 550009191 549311638 548683167 548294842
1252.3 548294842 548189163 548052490 547744930 547546744 547568858 547614038 547663808 547870934 548126042 548232973
1272.7E48232973N8949J03354q881k8968M30942Q83937P70032L69966J54138K3424
1293.1E50989866j83522l40820m85241p69079j095831j241923j354456j610696j881063
1311.4E42027235j923621j783311j559079j183271q22604q32617j223505j630246k054394
1329.8E29014587k555728k800822k535403k137124j831889j424432j154602j375258
1346.1E13199329j987040k519726k870083l154874l239960l016114k929121l139645
1362.4D90342766l147155l098875l442765l698051l498345l182084k926945k939254
1378.7D64409292l088862l223330l333717l476680l601789l832132m770785n894751
1395.1D33187246o404131p041127p493228p635980q332312q594066q385957q285224
$$ plain form
1272.7 548232973 548291922 548395276 548386395 548357427 548788369 549672306 550442338 550812304 550966442 550989866
1293.1 550989866 550806344 550465524 549980283 549211204 548115373 546873450 545518994 543908298 542027235
1311.4 542027235 540103614 538320303 536761224 535577953 534755349 533922732 532699227 531068981 529014587
1329.8 529014587 526458859 523658037 521122634 518985510 517153621 515729189 514574587 513199329
1346.1 513199329 511212289 508692563 505822480 502667606 499427646 496411532 493482411 490342766
1362.4 490342766 487195611 484096736 480653971 476955920 473457575 470275491 467348546 464409292
1378.7 464409292 461320430 458097100 454763383 451286703 447684914 443852782 439081997 433187246
1395.1 433187246 426783115 419741988 412248760 404612780 396280468 387686402 379300445 371015221
1411.4C71015221q040965p627874p520974p326871n508125l729582k508402j334607
1427.7C27417821n01126J79082O55293P66218O65724L84599K6882l76493p00086p51525
1448.1C27766389o78331p10636p54655o03378j19090J96547m8519o20067j180917j307368
1468.5C21939975j180083q55535j71333M84764R92567J415431J869679K342343K912462
1486.8C29750270L695160M364282M262358M322141N109340N379707M930913M246891
1503.2C66061062M343181N767882N377978M172087L885955M149347M735083M964858
1519.5D03457433N539566N803317N379588N448192N213410N302816O037861N471736
1535.8D47653919M748613O292611P193417O146014N756288N345762N080849M905343
$$ plain form
1411.4 371015221 362974256 355346382 347825408 340498537 334990412 331260830 328752428 327417821
1427.7 327417821 326916695 327095777 327751070 328517288 329183012 329567611 329594493 329218000 328517914 327766389
1448.1 327766389 327088058 326377422 325622767 325019389 324900299 325096846 325048327 324428260 323247343 321939975
1468.5 321939975 320759892 319904357 319733024 320217788 321210355 322625786 324495465 326837808 329750270
1486.8 329750270 333445430 337809712 342072070 346394211 351503551 356883258 361814171 366061062
1503.2 366061062 370404243 376172125 381550103 385722190 389608145 393757492 398492575 403457433
1519.5 403457433 408996999 414800316 420179904 425628096 430841506 436144322 442182183 447653919
1535.8 447653919 452402532 458695143 465888560 472034574 477790862 483136624 488217473 493122816
1552.1D93122816M816681M345685M676641N736827M158795L039897K872824K881647
1568.4E25651813K932071K252996J681268J958907J842797J299143J067340Q63075
1584.7E39549410L05295j72197l43323n91040j013577j145542j040101j267254j627743
1603.1E32653928j733542j832425k242446k444566k319753k666533l157913k441168
1619.4E13815582k087593k623201k670586k314210j968682j659512j646549j571893
1635.7D97273356p32482j30594J91689N47349Q71301J437456J619041J800656K817869
1654.1E05695641K979398K772152K963662L289223L658176L582358L667951M159629
1670.4E32768190M086375M241049M616797M289210L976822M219830N300701N303860
$$ plain form
1552.1 493122816 497939497 502285182 506961823 512698650 516857445 519897342 522770166 525651813
1568.4 525651813 528583884 530836880 532518148 534477055 536319852 537618995 538686335 539549410
1584.7 539549410 539854705 539682508 539339185 538748145 537734568 536589026 535548925 534281671 532653928
1603.1 532653928 530920386 529087961 526845515 524400949 522081196 519414663 516256750 513815582
1619.4 513815582 511727989 509104788 506434202 504119992 502151310 500491798 498845249 497273356
1635.7 497273356 496540874 496410280 496601969 497149318 498020619 499458075 501077116 502877772 505695641
1654.1 505695641 508675039 511447191 514410853 517700076 521358252 524940610 528608561 532768190
1670.4 532768190 536854565 541095614 545712411 550001621 553978443 558198273 563498974 568802834
1686.7E68802834M714667M869461M566431M857600N599678N539596O134271N597055
1703F10681593M878521M917860M467607M032135L619134L189743L362656L491640K826333
1721.4F45467222K376973K446652K419114K173066J884043K173603K590299K123594
1737.7F63654566K032697K385378K361715K180576K263963K572477K662659K353072
1754F82467103K267122K256334J904547J879156J991808J671434J340210J249075J250029
1772.4F98276818P52508k04265q12471r42111r38236r52542p29919k71082K16842Q23796
1792.8F95219338J031280P37786P33077J298070J728356J620233J522839J700819J901984
1811.1G07493782J888871J839698J867830J763046J495481J358747J400590J203597
$$ plain form
1686.7 568802834 573517501 578386962 582953393 587810993 593410671 598950267 605084538 610681593
1703 610681593 615560114 620477974 624945581 628977716 632596850 635786593 639149249 642640889 645467222
1721.4 645467222 647844195 650290847 652709961 654883027 656767070 658940673 661530972 663654566
1737.7 663654566 665687263 668072641 670434356 672614932 674878895 677451372 680114031 682467103
1754 682467103 684734225 686990559 688895106 690774262 692766070 694437504 695777714 697026789 698276818
1772.4 698276818 699029326 698825061 698012590 697070479 696132243 695179701 694449782 694178700 694395542 695219338
1792.8 695219338 696250618 696988404 697721481 699019551 700747907 702368140 703890979 705591798 707493782
1811.1 707493782 709382653 711222351 713090181 714853227 716348708 717707455 719108045 720311642
1827.4G20311642J036465J261115J244962R13978Q32379R41038P89702O20722Q66712
1845.8G28818715J030922Q59618O82711P19667P97331O62685N98907P30276O70850
1864.2G35571682L71218L93808P86483P83384N46515N99504O71625M64260L86954N99324
1884.6G41174757N73814L06070M02093O29425M89831L46601M86374N73218L64780K53737
1904.9G45600700M30346M58658K85327L17931M12345K70784K20418L84629M42147K89261
1925.3G49112546K22803L55899L20852J54376K49028M19795K41876N1916K64942M05074
1945.7G51799107K15828J66357L30567L14474J50263J92285L10838J93060Q9287K35439
1966.1G53997505L55363K49564J95742K91705K58386J50263K01405K69174J54674N0426
$$ plain form
1827.4 720311642 721348107 722609222 723854184 724768162 725600541 726541579 727331281 727952003 728818715
1845.8 728818715 729849637 730709255 731391966 732111633 732908964 733571649 734170556 734900832 735571682
1864.2 735571682 735942900 736336708 737123191 737906575 738453090 739052594 739724219 740188479 740575433 741174757
1884.6 741174757 741748571 742054641 742456734 743086159 743575990 743922591 744408965 744982183 745346963 745600700
1904.9 745600700 746031046 746489704 746775031 747092962 747505307 747776091 747996509 748381138 748823285 749112546
1925.3 749112546 749335349 749691248 750012100 750166476 750415504 750835299 751077175 751129091 751394033 751799107
1945.7 751799107 752014935 752181292 752511859 752826333 752976596 753168881 753479719 753672779 753762066 753997505
1966.1 753997505 754352868 754602432 754798174 755089879 755348265 755498528 755699933 755969107 756123781 756174207
1986.5G56174207J06692J50263J08838R7335J43170J60337J07944Q0287J18375Q8155
2006.9G57335603P570K6882P8857J0550o6102j4484K6167k6167n0783J7524N0485k2054
2031.4G57374048n6505Q822K2351l9696O854J08063P4208O259O5267J13487M0650L1770
2055.9G57755578J50322J69456L6240K5094J76012J84715Q0943J35660K03073J02520
2076.3G59019613N5850J73569J93893O3718O2346J78993J45495K7001P7546J63614
2096.7G60161638Q8573L0160J10745J39356K8372j1444P4267P1227j0371N8949J66536
2119.1G60908008O6697m2200O1929J33396K0444N186J44720J53720M6730J10865K34127
2141.5G61843622J45137N1379J60933K24232J21832J32919L01361L19779K06411K70247
$$ plain form
1986.5 756174207 756280899 756431162 756540000 756637335 756780505 756940842 757048786 757129073 757247448 757335603
2006.9 757335603 757343173 757370055 757448912 757459462 757393360 757378876 757405043 757378876 757328093 757345617 757396102 757374048
2031.4 757374048 757317543 757326365 757348716 757309020 757315874 757423937 757498145 757504404 757569671 757683158 757723808 757755578
2055.9 757755578 757905900 758075356 758111596 758136690 758312702 758497417 758578360 758714020 758917093 759019613
2076.3 759019613 759075463 759249032 759442925 759506643 759568989 759747982 759893477 759920478 759998024 760161638
2096.7 760161638 760250211 760280371 760391116 760530472 760558844 760547400 760621667 760692894 760682523 760741472 760908008
2119.1 760908008 760974705 760932505 760994434 761127830 761148274 761153460 761298180 761451900 761498630 761609495 761843622
2141.5 761843622 761988759 762040138 762201071 762425303 762547135 762680054 762981415 763301194 763507605 763777852
2161.9G63777852L99590L08215K01166L23594M14252K97367K61426L77238L45171J98662
2182.3G66904533K60591L95179K96235J77563K77698L39329J99735J67429K95103K54452
2202.7G69567847J14382J86502K94209J76728P3612J77681K24590Q8632O9082J99437
2223.1G71172702J77682O1214J15156K05636J20342P2539K04265K30014P8321Q1002
2243.5G72518873K13921J64449P0692J77681K59459J32263Q5890K33710K39551Q7440
2263.9G74183929J38283K90036K32816J26302J80364K24113J23978R3162J86264J53721
2284.3G75932968K3842N2988J41740Q0526J8835O6042O0916k1100l1948P510k8730
2306.7G76303589r8884o6459J1623j3590j02758j53482j69158j36018l2544J1563j7702
$$ plain form
2161.9 763777852 764177442 764485657 764686823 765010417 765424669 765722036 765983462 766360700 766705871 766904533
2182.3 766904533 767165124 767560303 767856538 768034101 768311799 768651128 768850863 769018292 769313395 769567847
2202.7 769567847 769682229 769868731 770162940 770339668 770413280 770590961 770815551 770904183 770973265 771172702
2223.1 771172702 771350384 771411598 771526754 771732390 771852732 771925271 772129536 772359550 772437871 772518873
2243.5 772518873 772732794 772897243 772967935 773145616 773405075 773537338 773623228 773856938 774096489 774183929
2263.9 774183929 774322212 774612248 774845064 774971366 775151730 775375843 775499821 775592983 775779247 775932968
2284.3 775932968 775956810 776009798 776151538 776232064 776250899 776316941 776377857 776356757 776324809 776332319 776303589
2306.7 776303589 776204705 776138246 776149869 776136279 776033521 775880039 775710881 775574863 775542319 775553882 775536180
2329.2G75536180k7061p9751j39773r6381k7418J908J16407L94464M03523n3286m86732
2351.6G75542080n07414k71499q0586O8188J08183J12235K47538L87073L96371L82602
2372G76384771M08172L56555K63751K63512K49744J24514R238O557J2577o6221j00494
2394.4G77912676m7445p0095j43349r9480l0816q7798j55687j17421r8288j67310j69993
2416.9G76724994j06990j56343k36035j94907j70707k44916k70188k05934k18808l20673
2437.3G74599493l31462k67684k89917l39210k86699k71439l98755m73619m40895m95196
2457.7G71004617n97060n98967o04987p21335q26061q59201r74595j200200j370549
2476G63251662j437962j538276j653553j645684j602292j624882j610994j500190j397848
$$ plain form
2329.2 775536180 775509119 775429368 775289595 775193214 775165796 775167704 775284111 775678575 776082098 776028812 775542080
2351.6 775542080 775034666 774763167 774682581 774750769 774858952 774971187 775218725 775605798 776002169 776384771
2372 776384771 776792943 777149498 777413249 777676761 777926505 778051019 778060257 778066814 778079391 778013170 777912676
2394.4 777912676 777865231 777795136 777651787 777552307 777521491 777433693 777278006 777160585 777062297 776894987 776724994
2416.9 776724994 776618004 776461661 776225626 776030719 775860012 775615096 775344908 775138974 774920166 774599493
2437.3 774599493 774268031 774000347 773710430 773371220 773084521 772813082 772414327 771940708 771499813 771004617
2457.7 771004617 770407557 769808590 769203603 768482268 767656207 766797006 765822411 764622211 763251662
2476 763251662 761813700 760275424 758621871 756976187 755373895 753749013 752138019 750637829 749239981
2494.4G49239981j283288j033544p64013o39021o00994n87880o88732r47237j229584
2512.7G41465688j374543j343429j139939p73013l54528l8922J87755M51386P25865
2531.1G37806320Q98004R65655R37223P40886M21881K11597K81036N34594P70569Q96096
2551.5G44463861Q98302P51912N39959M30584M02629L61919L29137L10302K50936J52051
2571.9G48891592R3937P5698K8372k4855l8088m0054q7559j59264j60396j51634k00332
2594.3G48227417j86800j30892j78159k65955k46466j81615j74224j63615j17839r5427
2614.7G46486425j04367q3745m5597o6877j03891n9962J132k7239o1750j6451K1875
2637.1G45939553M470N841K8134k0206j09494j31309j21713j62065j92225j61469j68562
$$ plain form
2494.4 749239981 747956693 746923149 746159136 745520115 744919121 744331241 743642509 742695272 741465688
2512.7 741465688 740091145 738747716 737607777 736834764 736480236 736441314 736629069 737080455 737806320
2531.1 737806320 738704324 739669979 740607202 741348088 741769969 741981566 742262602 742797196 743567765 744463861
2551.5 744463861 745362163 746114075 746654034 747084618 747487247 747849166 748178303 748488605 748739541 748891592
2571.9 748891592 748985529 749061227 749089599 749064744 749026656 748986602 748899043 748739779 748579383 748427749 748227417
2594.3 748227417 748040617 747909725 747731566 747465611 747219145 747037530 746863306 746699691 746581852 746486425
2614.7 746486425 746382058 746298313 746252716 746185839 746081948 746021986 746023118 745995879 745934129 745917678 745939553
2637.1 745939553 745944023 745949864 745977998 745957792 745848298 745716989 745595276 745433211 745240986 745079517 744910955
2659.6G44910955k47538k84910k61247k93791l75033l62634k87891l02911l80158l78609
2680G41736233l40879l84867m17828l80040l81946m48585m76062m34160m25756m56572
2700.4G37589538m37260l87489m09603m90845m99844m51505m49777m44830l98457m13179
2720.8G33206749m80235m72366l95298l74973l95596l50595l12865l49938l46184k92480
2741.2G29436219l24905l88265l29137k60770l28422m06622l87311l79026m58539m91977
2761.6G25681245m23073m10557m73023m61459m22656m91143n53488n12124n00202n83827
2782G20849693o24538n80549o13928p01189o83188o57320p70927q75652q22901p94471
2802.3G13725030r17673j008928r80556j015484j155615j200735j149476j206994j324594
$$ plain form
2659.6 744910955 744663417 744378507 744117260 743823469 743448436 743085802 742797911 742495000 742114842 741736233
2680 741736233 741395354 741010487 740592659 740212619 739830673 739382088 738906026 738471866 738046110 737589538
2700.4 737589538 737152278 736764789 736355186 735864341 735364497 734912992 734463215 734018385 733619928 733206749
2720.8 733206749 732726514 732254148 731858850 731483877 731088281 730737686 730424821 730074883 729728699 729436219
2741.2 729436219 729111314 728723049 728393912 728133142 727804720 727398098 727010787 726631761 726173222 725681245
2761.6 725681245 725258172 724847615 724374592 723913133 723490477 722999334 722445846 721933722 721433520 720849693
2782 720849693 720225155 719644606 719030678 718329489 717646301 716988981 716218054 715342402 714519501 713725030
2802.3 713725030 712807357 711798429 710817873 709802389 708646774 707446039 706296563 705089569 703764975
2820.7G03764975j342058j377106j530468j645983j690208j824022k058327k263784
2837F90033019k456069k844632l441989l961266m151523l731548k627194j378119o01054
2855.4F64839625l91066m23312m96328p37726j099170j312971j374900j414299j318932
2873.7F56270921j068711r63211j083017j194238j254022j416385j623273j643181
2890.1F46024883j505316j392483j215756q80242o45279o60837p41422q62360j238466
2908.4F36882722j818001k222001k305091k133369j615584q47519k21550J69635N66125
2926.8F26455367R60528J158536J221538J340389J432359J311183J126766J101613
2943.1F36108279J121938J027167Q78394O87897M06087J90854K38835M18783M84824
$$ plain form
2820.7 703764975 702422917 701045811 699515343 697869360 696179152 694355130 692296803 690033019
2837 690033019 687576950 684732318 681290329 677329063 673177540 669445992 666818798 665440679 664839625
2855.4 664839625 664448559 664025247 663528919 662791193 661692023 660379052 659004152 657589853 656270921
2873.7 656270921 655202210 654238999 653155982 651961744 650707722 649291337 647668064 646024883
2890.1 646024883 644519567 643127084 641911328 641031086 640385807 639724970 638983548 638121188 636882722
2908.4 636882722 635064721 632842720 630537629 628404260 626788676 625941157 625719607 625889242 626455367
2926.8 626455367 627415895 628574431 629795969 631136358 632568717 633879900 635006666 636108279
2943.1 636108279 637230217 638257384 639135778 639823675 640229762 640420616 640659451 641078234 641563058
2961.4F41563058N58197P94411R89378J071751J271844J556217J644492J548052J544178
2979.8F52541578J616835J534462J394987J336337J208663J002431R24348R10402P41780
2998.1F63211823N21838M27187L47852J72496L1650O855j3828q2613r5844q0526k33471
3020.6F64213419m71413n34952n35905o66499p83205p60258p29978q17060r10104q95023
3041F57109022r23693j036167j047015r87053j019180j081705j050234j021326j078486
3059.3F47864163j095176j046717j061618j098514j036167r72688j014114j047849
3075.6F39491320r98497r83417j047492j073718j039327j035511j072645j081527j055896
3094F30103290j058161j095474j109362j118183j166284j180768j147687j167834j211762
$$ plain form
2961.4 641563058 642121255 642915666 643905044 644976795 646248639 647804856 649449348 650997400 652541578
2979.8 652541578 654158413 655692875 657087862 658424199 659632862 660635293 661559641 662470043 663211823
2998.1 663211823 663733661 664160848 664508700 664681196 664712846 664719701 664705873 664623260 664527416 664446890 664213419
3020.6 664213419 663742006 663207054 662671149 662004650 661221445 660461187 659731209 658914149 658004045 657109022
3041 657109022 656185329 655149162 654102147 653115094 652095914 651014209 649963975 648942649 647864163
3059.3 647864163 646768987 645722270 644660652 643562138 642525971 641553283 640539169 639491320
3075.6 639491320 638492823 637509406 636461914 635388196 634348869 633313358 632240713 631159186 630103290
3094 630103290 629045129 627949655 626840293 625722110 624555826 623375058 622227371 621059537 619847775
3112.4F19847775j193345j185477j269102j385331j423061j390696j411020j444638
3128.7F09145105j408577j435876j528919j482188j398504j513362j652420j625359
3145E97099900j572489j592637j626968j656592j698494j750231j770079j730263j727641
3163.4E81974506j772642j765489j755715j800716j840710j827240j812518j834094
3179.7E67565382j822770j809776j870215j895904j838804j824736j883090j908064
3196E52712023j874685j850009j853645j856327j838446j859545j911402j896322j860559
3214.3E35911083j894355j960575j940787j863420j869977j892030j808762j728058
3230.7E20953119j723886j720071j657009j550257j469731j402855j342178j364171
$$ plain form
3112.4 619847775 618654430 617468953 616199851 614814520 613391459 612000763 610589743 609145105
3128.7 609145105 607736528 606300652 604771733 603289545 601891041 600377679 598725259 597099900
3145 597099900 595527411 593934774 592307806 590651214 588952720 587202489 585432410 583702147 581974506
3163.4 581974506 580201864 578436375 576680660 574879944 573039234 571211994 569399476 567565382
3179.7 567565382 565742612 563932836 562062621 560166717 558327913 556503177 554620087 552712023
3196 552712023 550837338 548987329 547133684 545277357 543438911 541579366 539667964 537771642 535911083
3214.3 535911083 534016728 532056153 530115366 528251946 526381969 524489939 522681177 520953119
3230.7 520953119 519229233 517509162 515852153 514301896 512832165 511429310 510087132 508722961
3247E08722961j445234j473725j431048j393497j431465j506805j535326j528413j477718
3265.3D95499730j338512j208961j219958j259535j220435j188666j172632j151472
3281.6D85739559j185775j250476j234471j159579j162082j259446j343846j375109
3298D75768775j349807j223028j069426j121402j355469j474291j454562j440525j451314
3316.3D63828951j474380j536936j645058j735717j816333j913428j980007j955300
3332.6D49771792j845330j772076j824320j890689j826793j731604j615047j403451
3348.9D35862482j347810j493663j524895j396209j332909j390517j405448j318335
3365.3D24652696j293540j415104j540154j507938j338810j171827j099050j127124
$$ plain form
3247 508722961 507277727 505804002 504372954 502979457 501547992 500041187 498505861 496977448 495499730
3265.3 495499730 494161218 492952257 491732299 490472764 489252329 488063663 486891031 485739559
3281.6 485739559 484553784 483303308 482068837 480909258 479747176 478487730 477143884 475768775
3298 475768775 474418968 473195940 472126514 471005112 469649643 468175352 466720790 465280265 463828951
3316.3 463828951 462354571 460817635 459172577 457436860 455620527 453707099 451727092 449771792
3332.6 449771792 447926462 446154386 444330066 442439377 440612584 438880980 437265933 435862482
3348.9 435862482 434514672 433021009 431496114 430099905 428766996 427376479 425971031 424652696
3365.3 424652696 423359156 421944052 420403898 418895960 417557150 416385323 415286273 414159149
3381.6D14159149j112461j002968q66949p45028q24064j088322j156359r03547o65903
3399.9D05793548p90656j056105r59992o23733m72814n46277o22570n58078l91424
3418.3C99771899k83599k83807k07335k7716P7247M2469O2346J70052J11401n1051
3438.7C99381906k3246J73479L32684M00900M07070M36873N52654O86675P71135Q12680
3459.1D03932810P61688P75814J009673J168459J001656P35998P51138R81718J202703
3477.4D12321657J232803J091659J110762J278669J301765J231969J282841J385420
3493.8D22237545J456380J484543J491368J496017J417190J315504J408756J669168
3510.1D33976471J864285J830160J656443J618505J738697J882195J850248J716226
$$ plain form
3381.6 414159149 413046688 412043720 411176771 410431743 409607679 408519357 407362998 406459451 405793548
3399.9 405793548 405002892 403946787 402986795 402363062 401890248 401343971 400721401 400163323 399771899
3418.3 399771899 399488300 399204493 398997158 398969442 399046689 399089158 399151504 399321556 399432957 399381906
3438.7 399381906 399358660 399532139 399864823 400265723 400672793 401109666 401662320 402348995 403120130 403932810
3459.1 403932810 404694498 405470312 406479985 407648444 408650100 409386098 410137236 411118954 412321657
3477.4 412321657 413554460 414646119 415756881 417035550 418337315 419569284 420852125 422237545
3493.8 422237545 423693925 425178468 426669836 428165853 429583043 430898547 432307303 433976471
3510.1 433976471 435840756 437670916 439327359 440945864 442684561 444566756 446417004 448133230
3526.4D48133230J804322K008110K085478K129286K144039K088815K168625K305985
3542.7D64867890K292603K195239K184183K251505K368182K440155K451271K559900
3559D83610928K647042K493650K358407K781242L192455K966165K779007K899289L009498
3577.4E08737683L088951L184438L116310K968311L178179L520906L341914L204584
3593.7E34341276L450691L614784L582954L607392L538788L318906L440499L705978
3610E62601268L727854L778040L638089L628313M148424M034281L319740K915382L621698
3628.4E95413089M631936M005611L507972L607392L534675L473639L362000K987743
3644.7F24524057K827525L639400M390717L526270K790987L307879L450871K829611
$$ plain form
3526.4 448133230 449937552 451945662 454031140 456160426 458304465 460393280 462561905 464867890
3542.7 464867890 467160493 469355732 471539915 473791420 476159602 478599757 481051028 483610928
3559 483610928 486257970 488751620 491110027 493891269 497083724 500049889 502828896 505728185 508737683
3577.4 508737683 511826634 515011072 518127382 521095693 524273872 527794778 531136692 534341276
3593.7 534341276 537791967 541406751 544989705 548597097 552135885 555454791 558895290 562601268
3610 562601268 566329122 570107162 573745251 577373564 581521988 585556269 588876009 591791391 595413089
3628.4 595413089 600045025 604050636 607558608 611166000 614700675 618174314 621536314 624524057
3644.7 624524057 627351582 630990982 635381699 638907969 641698956 645006835 648457706 651287317
3661F51287317K498269K313972K016187K178192K650201K149403K116859K672553K173841
3679.4F72056794J791597J676142J401007J483977J890123J743197J334846J154959
3695.7F84532642R45449P10368Q39949J014769O76870L64542N06044J029730J133620
3714F91753983O53148M29750M48644M58836N13494O84798O14047K14696J46449N03719
3734.4F96421564Q46028O70254j51753p33257l7431M91678j84178M3094P51317M18842
3754.8F98536158k3365Q1479L20912R1850o6101M0591J79290M25637K80380p1168q1062
3777.3F99714601J87337K22087p808Q2553J93893O2585k1636j44124j64211j20759
3797.7G00004518k19047K76864M25636q3506K56777L48866k73287n58257r0838R1314
$$ plain form
3661 651287317 653785586 656099558 658115745 660293937 662944138 665093541 667210400 669882953 672056794
3679.4 672056794 673848391 675524533 676925540 678409517 680299640 682042837 683377683 684532642
3695.7 684532642 685478091 686188459 687028408 688043177 688720047 689084589 689590633 690620363 691753983
3714 691753983 692407131 692836881 693285525 693744361 694257855 694942653 695556700 695771396 695917845 696421564
3734.4 696421564 697267592 697937846 697786093 697052836 697015405 697507083 697322905 697365999 698117316 698536158
3754.8 698536158 698512793 698594272 698915184 699007034 698940933 698981524 699160814 699586451 699866831 699795663 699714601
3777.3 699714601 699901938 700124025 700116217 700198770 700392663 700455248 700433612 700289488 700125277 700004518
3797.7 700004518 699785471 700062335 700487971 700404465 700661242 701010108 700736821 700178564 700087726 700179040
3818G00179040j91807L32355K87593j63258r5725j16288p6711o9380j67787J08659
3838.4G00026691K52664R5487J01208j15752o49094j062036l13342J265765O44683
3856.8G00246274m50789n41389k16485O6996j54674k55883J71781J17302J9073j48654
3877.2F98853552l43740J9253j6988l0756J10388k71678j18077J81675k71082n72741
3897.6F97539806l52800p1823K12908L57747N5015k21968k23219k71797k90215r0242
3918F96643412K0146j06573j64747j39117k46406k33233L5107J07885j18733l12328
3938.4F95485413l67939j95742l3736j51634j60635k9147n6922j19031p3194o0439
3958.8F94236994j46330j85966j66595j43588r2148m9413m5597l9518p5519j25945
$$ plain form
3818 700179040 699987233 700319588 700607181 700443923 700348198 700231910 700155199 700085819 699918032 700026691
3838.4 700026691 700279355 700374842 700476050 700360298 699711204 698649168 698335826 699601591 700246274
3856.8 700246274 699795485 699254096 699037611 699104607 698949933 698694050 698865831 698983133 699002206 698853552
3877.2 698853552 698509812 698529065 698512077 698481321 698591709 698320031 698201954 698383629 698112547 697539806
3897.6 697539806 697187006 697115183 697328091 697685838 697740853 697518885 697295666 697023869 696733654 696643412
3918 696643412 696663558 696556985 696392238 696253121 696006715 695773482 695808589 695916474 695797741 695485413
3938.4 695485413 695117474 694921732 694887996 694736362 694575727 694546580 694489658 694370627 694297433 694236994
3958.8 694236994 694090664 693904698 693738103 693594515 693502367 693452954 693407357 693367839 693292320 693166375
3979.2F93166375r4533o0677j03414j38343j01685q2732j28746j29938o6936
3997.5F92259371
$$ plain form
3979.2 693166375 693071842 693011165 692907751 692769408 692667723 692584991 692456245 692326307 692259371
3997.5 692259371
##END=$$ End of the data block
