##TITLE=T5PP $$ Begin of the data block
##JCAMP-DX=5.00 $$ ACD/SpecManager v 10.08
##SPECTROMETER/DATA SYSTEM=Alpha
##DATE=12 Mar 2014 10:59:36
##DATA TYPE=INFRARED SPECTRUM
##DATA CLASS=XYDATA
##ORIGIN=
##OWNER=
##NPOINTS=1765
##FIRSTX=399.75695801
##LASTX=3997.56933594
##MAXX=3997.56933594
##MINX=399.75695801
##MAXY=0.76778412
##MINY=0.04266923
##XFACTOR=1.0000000000
##YFACTOR=1.000000000000000e-9
##FIRSTY=0.31769699
##DELTAX=2.03957629
##XUNITS=1/CM
##YUNITS=ARBITRARY UNITS
##XYDATA=(X++(Y..Y))
399.8C17696989R673833R876907J0608018J0797918J0188996R766609R979665R793580
416.1C98382515J0025382R876549Q364767Q295566Q717179P971197O764651O104499
432.4D64502305O482363O984174O531954N701840N499124N714566N620241M897654
448.7E11934221M206240M183590M444480M776895M311383L049731K783239L457666
465E43147445L932416L580749K723098K498865L143430L567874K939225J808643J625180
483.4E68966925K584517L253281K669990J623333J455962K272130K775430K023518
499.7E87625086R28462J019597K147019K699673J729608M48465N19693J617253K142727
518.1F00877583J310468K58445M06802J505375J946151J125336K81930N08666J464844
$$ y = [317696989, 327370822, 337247729, 347855747, 358653665, 368842661, 378609270, 388588935, 398382515, 408407897, 418284446, 426649213, 434944779, 443661958, 451633155, 458397806, 464502305, 470984668, 477968842, 484500796, 490202636, 495701760, 501416326, 507036567, 511934221, 516140461, 520324051, 524768531, 529545426, 533856809, 536906540, 539689779, 543147445, 547079861, 550660610, 553383708, 555882573, 559026003, 562593877, 565533102, 567341745, 568966925, 571551442, 574804723, 577474713, 579098046, 580554008, 582826138, 585601568, 587625086, 588553548, 589573145, 591720164, 594419837, 596149445, 596597910, 597117603, 598734856, 600877583, 602188051, 602446496, 602853298, 604358673, 606304824, 607430160, 607712090, 608220756, 609685600]
536.4F09685600J822948J045227P6711j788P54178J160443M90844n36263p10607J08898
556.8F13896191P46787M33624k85864l22998N50926J209497O56307m74513p74562P7605
577.2F15713000R27687P34270q3506l39687N43415J454830R66192l32833p14540J37985
597.6F19006813Q43346J76489j339316j890362r49621R1076Q8155n88178o57022N56707
618F15338087J856029J639664M68493J10626J049578J973808J762509Q83520P48754
636.3F25831068J701772K458036J864373M56989j37687M55738R84788L77237q05318
654.7F33186996j250625n99146J59920P7307n25594j261651j201928J77205N42342
673.1F29304826j57952q71122q05557k82108k92123j181602k182603k577245k903402
$$ y = [609685600, 611508548, 612553775, 612630486, 612628698, 613382876, 614543319, 615034163, 614497900, 613787293, 613896191, 614642978, 615076602, 614790738, 614467740, 615018666, 616228163, 616884470, 616409957, 615635395, 615713000, 616640687, 617374957, 617291451, 616951764, 617495179, 618950009, 619916201, 619583368, 618868828, 619006813, 619850159, 620026648, 618687332, 616796970, 615847349, 615938425, 616026580, 615438402, 614781380, 615338087, 617194116, 618833780, 619302273, 619412899, 620462477, 622436285, 624198794, 625082314, 625831068, 627532840, 629990876, 631855249, 632312238, 632174551, 632630289, 633615077, 633992314, 633186996, 631936371, 631337225, 631497145, 631574452, 631048858, 629787207, 628585279, 628762484, 629304826, 629146874, 628275752, 627470195, 627188087, 626895964, 625714362, 623531759, 620954514, 618051112]
691.4F18051112m473687q259832j2637258j0445297k479851j318574q530438j6237795
707.7E53668380k1694601j8078744k278924Q710027O174087L171623O256521J1563062
724E47491431J6029120J8347025J8676281J7958998J6241968J2888789Q557022N333304
740.4F61523938M249215L890336K614677O98030k76387K60711J033962O16490o81102
758.7F73929870j278520n91516L26812K39313o72579j116276m68015L90231L16322
777.1F71075642o16908j230419p95066J4663O1393q31247j627683j411260n92887l39329
797.5F63706899j015663j816035j803040j196921r76980j571417k415776k541244j908302
815.8F48461521j524747k095639l066361l452063l104925k952397l781498n148589
$$ y = [618051112, 613577425, 605317593, 592680335, 582235038, 579755187, 578436613, 569906175, 553668380, 531973779, 513895035, 511616111, 520326138, 526500225, 529671848, 535928369, 547491431, 563520551, 581867576, 600543857, 618502855, 634744823, 647633612, 656190634, 661523938, 665773153, 669663489, 672278166, 672976196, 672699809, 672960520, 673994482, 674610972, 673929870, 672651350, 672059834, 672386646, 672625959, 671953380, 670837104, 670369089, 670759320, 671075642, 670458734, 669228315, 668433249, 668447912, 668509305, 667678058, 666050375, 664639115, 664046228, 663706899, 662691236, 660875201, 659072161, 657875240, 656898260, 655326843, 652911067, 650369823, 648461521, 646936774, 644841135, 641774774, 638322711, 635217786, 632265389, 628483891, 623335302]
832.1F23335302o025553o229699o821990r074509j1953473j3312816j3994992j3392925
848.5E42529345j1929334j5551149k3410947k8261721k8878689k8344184k7945608
862.7C78207713k9183805l6657333m7364771m5386419k6571706o005451J0018751K7182981
879.1B24239960M4856325N7282180O3063651O3033640N6376905M4323146L1321228
893.3E84497035K1145939J4816523J1448264R349644P177294M868388L590524L817022
909.6F60710633L893375K611876Q71420p1466n663K75851j13726j017809j502097j089215
930F64563179l57807k58922q71659j363098j055896l63887k81393r90212j658976j593292
950.4F55768037j076758j084924j979232k903640k981901k456427k320468l010512
$$ y = [623335302, 617309749, 611080050, 604258060, 595183551, 583230078, 569917262, 555922270, 542529345, 530600011, 515048862, 491637915, 463376194, 434497505, 406153321, 378207713, 349023908, 312366575, 265001804, 219615385, 193043679, 187038228, 197056979, 224239960, 269096285, 326378465, 389442116, 452475756, 508852661, 553175807, 584497035, 605642974, 620459497, 631907761, 641257405, 648434699, 653303087, 656893611, 660710633, 664604008, 667215884, 668087304, 668015838, 668010175, 668286026, 668172300, 667154491, 665652394, 664563179, 664205372, 663946450, 663074791, 661711693, 660655797, 660291910, 660010517, 659020305, 657361329, 655768037, 654691279, 653606355, 651627123, 648723483, 645741582, 643285155, 640964687, 637954175]
966.8F37954175l900885m125953l730535l618658m407644n574048o056309n705058
983.1F00835085n335808n539358n960345n838513n020380m231930m133165m575908
999.4E60199678m897833m739702m564106m977107n760610o082654n562663m634798
1015.7E18980205l993869l720879l305972k392709j289726o58094o44386p46489m39226
1034.1E01788855Q5771J20043o88672j696914k022207j681149j363516j387149j277327
1052.4D91877735n30482P00683J630634J676678J011998L40640j21742r16511k386421
1070.8D93283212l988385m838258n061865o455064q166045m157126L754706O621182
1087.1D70992357N367398M666805M109562L144562K269894J532495O74933j44094m07607
$$ y = [637954175, 634053290, 629927337, 626196802, 622578144, 618170500, 612596452, 606540143, 600835085, 595499277, 589959919, 583999574, 578161061, 573140681, 568908751, 564775586, 560199678, 555301845, 550562143, 545998037, 541020930, 535260320, 529177666, 523615003, 518980205, 514986336, 511265457, 507959485, 505566776, 504277050, 503618956, 502974570, 502228081, 501788855, 501874626, 501994669, 501305997, 499609083, 497586876, 495905727, 494542211, 493155062, 491877735, 491347253, 492047936, 493678570, 495355248, 496367246, 496707886, 496586144, 495669633, 493283212, 489294827, 484456569, 479394704, 472939640, 464773595, 460616469, 464371175, 470992357, 476359755, 481026560, 485136122, 488280684, 490550578, 492083073, 492758006, 492613912, 492206305]
1105.4D92206305Q4847Q02070R60023M23550k25812m85033m45723n73308j071006j520782
1125.8D90155131j457096j012325q77261j441598k165735k331018k023131j809090
1142.2D77037877j898199j954854j595467r39817n08040o24060r05097o99848N0426
1160.5D67962921P61211R69439Q25912P34747Q95381J102030R80675N86152L59923
1178.9D75178391M12822L61710k08676j171320j921833k156019k167344k380282k801031
1197.2D63146418l025621k769291k348572k289266k631992k966732l023386k942264
1213.5D41149294l034502l418177l770888l764361l506631l370792l514349l709108
1229.9D13060486l647804l373176l212780l318905l541649l593504l429949l270418
$$ y = [492206305, 492291152, 493093222, 494053245, 494476795, 494250983, 493765950, 493320227, 492746919, 491675913, 490155131, 488698035, 487685710, 486808449, 485366851, 483201116, 480870098, 478846967, 477037877, 475139678, 473184824, 471589357, 470649540, 470141500, 469517440, 468612343, 467912495, 467962921, 468724132, 469693571, 470519483, 471254230, 472149611, 473251641, 474232316, 474818468, 475178391, 475591213, 475952923, 475744247, 474572927, 472651094, 470495075, 468327731, 465947449, 463146418, 460120797, 457351506, 455002934, 452713668, 450081676, 447114944, 444091558, 441149294, 438114792, 434696615, 430925727, 427161366, 423654735, 420283943, 416769594, 413060486, 409412682, 406039506, 402826726, 399507821, 395966172, 392372668, 388942719, 385672301]
1246.2C85672301l357649l590017l657103l518999l405869l502488l717959l832370
1262.5C57089847l713339l552109l581465l796130l957719l920137l813476l823757
1278.8C26931715l993332m137755m143029m082591m147917m346430m525810m566879
1295.1B92987972m518002m514694m596770m706502m727453m646808m535138m566998
1311.4B56175607m672914m656911m577846m568576m619107m734561m861146m878566
1327.8B18605980m869088m822403m722000m728272n004332n192250m965499m778608
1344.1A79523528m856781m929468m887327m849628m881188m885227m734963m704982
1360.4A40793964m910722m809350m475206m433967m339837m266768m402377m223392
$$ y = [385672301, 382314652, 378724635, 375067532, 371548533, 368142664, 364640176, 360922217, 357089847, 353376508, 349824399, 346242934, 342446804, 338489085, 334568948, 330755472, 326931715, 322938383, 318800628, 314657599, 310575008, 306427091, 302080661, 297554851, 292987972, 288469970, 283955276, 279358506, 274652004, 269924551, 265277743, 260742605, 256175607, 251502693, 246845782, 242267936, 237699360, 233080253, 228345692, 223484546, 218605980, 213736892, 208914489, 204192489, 199464217, 194459885, 189267635, 184302136, 179523528, 174666747, 169737279, 164849952, 160000324, 155119136, 150233909, 145498946, 140793964, 135883242, 131073892, 126598686, 122164719, 117824882, 113558114, 109155737, 104932345]
1376.7A04932345l993839l959991l846690l697820l770813l698431l296740l296145
1393G5371876l606096l542348l402770l188468k895255k803512k489403k097964j851875
1411.4D9494185j600404j340639j197192r79737m82418j35775P350P0572J07132J23556
1431.8D4066630O9600p7624j34837j46523k24628k42617j81090j34166r9923n2717
1452.2D2842105p1473j01399L1874K19482J78565J16557K38225M44911O38083R97249
1472.6D5534179J417275J579516J665395J769613J901302J943566K058655K377101
1488.9F0246602K680637K577349K581231L118665L428958L263906K931199L233806
1505.2H4062353M545510M492543L857814L833324L989719M216365M289731M765153
$$ y = [104932345, 100938506, 96978515, 93131825, 89434005, 85663192, 81964761, 78668021, 75371876, 71765780, 68223432, 64820662, 61632194, 58736939, 55933427, 53444024, 51346060, 49494185, 47893781, 46553142, 45355950, 44376213, 43893795, 43758020, 43765370, 43835942, 43943074, 44066630, 44136230, 44058606, 43923769, 43777246, 43552618, 43310001, 43128911, 42994745, 42894822, 42842105, 42770632, 42669233, 42701107, 42920589, 43099154, 43215711, 43453936, 43898847, 44536930, 45534179, 46951454, 48530970, 50196365, 51965978, 53867280, 55810846, 57869501, 60246602, 62927239, 65504588, 68085819, 71204484, 74633442, 77897348, 80828547, 84062353, 88607863, 93100406, 96958220, 100791544, 104781263, 108997628, 113287359, 118052512]
1521.5A18052512M912928M542709M669413M472449M448876M975900M580572M040867
1537.8A54696226N105749N855843N252958N008086M862130N105927N329714N395606
1554.1A96612239N229786O420404Q013457O162896N520642N774662N831152O020204
1570.5B45585442N302667M905015N507470M981786M194557M133523M070043L786743
1586.8B82467246L433347L149926K969683K858162K658426K386600K172381K141356
1603.1C04237127K137363K001554J748085J548499J478404J494974J607388J584262
1619.4C17837656J499414J514137J556664J517982J526028J614630J806706K271563
1635.7C31144780K603531K547264K536684K654553L132254L608644L175377L233076
$$ y = [118052512, 122965440, 127508149, 132177562, 136650011, 141098887, 146074787, 150655359, 154696226, 159801975, 165657818, 170910776, 175918862, 180780992, 185886919, 191216633, 196612239, 201842025, 208262429, 216275886, 222438782, 227959424, 233734086, 239565238, 245585442, 250888109, 255793124, 261300594, 266282380, 270476937, 274610460, 278680503, 282467246, 285900593, 289050519, 292020202, 294878364, 297536790, 299923390, 302095771, 304237127, 306374490, 308376044, 310124129, 311672628, 313151032, 314646006, 316253394, 317837656, 319337070, 320851207, 322407871, 323925853, 325451881, 327066511, 328873217, 331144780, 333748311, 336295575, 338832259, 341486812, 344619066, 348227710, 351403087, 354636163]
1652C54636163M219710L955365L585487L657252L843307L973931L817290M010737M349441
1670.4C90048683L985166L962845M294187M106283L824383L875285M546523M490585
1686.7D23133940M113793M204720L970593M120469M469127M553646N050659M461408
1703D58078355L952235M158973M007221L754973L504842L354997L615439L706366L331721
1721.4D91465122L130495L060162K940804K920568K836704K994537L058672K709091
1737.7E15116155K775133K952218K885342K755880K666056K789021K955079K775788
1754E37670672K604484K529920K441346K543509K471805K161384J914143J658201J220346
1772.4E57215810K81036j026929k066791k345979k113759k216936k310991j568675
$$ y = [354636163, 358855873, 362811238, 366396725, 370053977, 373897284, 377871215, 381688505, 385699242, 390048683, 394033849, 397996694, 402290881, 406397164, 410221547, 414096832, 418643355, 423133940, 427247733, 431452453, 435423046, 439543515, 444012642, 448566288, 453616947, 458078355, 462030590, 466189563, 470196784, 473951757, 477456599, 480811596, 484427035, 488133401, 491465122, 494595617, 497655779, 500596583, 503517151, 506353855, 509348392, 512407064, 515116155, 517891288, 520843506, 523728848, 526484728, 529150784, 531939805, 534894884, 537670672, 540275156, 542805076, 545246422, 547789931, 550261736, 552423120, 554337263, 555995464, 557215810, 557496846, 556469917, 554403126, 552057147, 549943388, 547726452, 545415461, 543846786]
1788.7E43846786o10292j12891m2260n2512K27035R68873J751006K215922K529680
1807E50721347K879083L386319L886581M201948M339516M255653M028857L920495L936112
1825.4E85555911L634512L298045L136515K904356K753138K650142K366066K039373
1841.7F08338058K033830K225995K157151J914442J726687J689374J780987J806259
1858F23672783J718939J595497J497328J459956J519978J609743J525044J420618J429617
1876.4F37449503J482844J455546J341521J247943J251876J349986J389921J257002
1892.7F48226142J115799J179278J310289J324117J193166J067757J066685J157522
1909F57640755J228273J142442R81689R25541J077354J181960J099229R56833Q88526
$$ y = [543846786, 543236494, 543123603, 543081343, 543028831, 543255866, 544224739, 545975745, 548191667, 550721347, 553600430, 556986749, 560873330, 565075278, 569414794, 573670447, 577699304, 581619799, 585555911, 589190423, 592488468, 595624983, 598529339, 601282477, 603932619, 606298685, 608338058, 610371888, 612597883, 614755034, 616669476, 618396163, 620085537, 621866524, 623672783, 625391722, 626987219, 628484547, 629944503, 631464481, 633074224, 634599268, 636019886, 637449503, 638932347, 640387893, 641729414, 642977357, 644229233, 645579219, 646969140, 648226142, 649341941, 650521219, 651831508, 653155625, 654348791, 655416548, 656483233, 657640755, 658869028, 660011470, 660993159, 661918700, 662996054, 664178014, 665277243, 666234076, 667122602]
1927.4F67122602R55701J059413J044274Q81433Q04842Q78215R59754R63270Q90613
1945.7F75560117Q13782Q34763R18627R04739P46667N84543O28292Q01504Q61764P52807
1966.1F83407605O89625P89226R33945R74953Q40604O74069O60360Q06570Q75115P48992
1986.5F91401064N95332N86509O99222P99835P63238O16431N61297O66260P70152O94633
2006.9F98153973N29587M82678O11008P43091O94394N31673M64797N73755O96599O79016
2027.3G04160571N39780M35054M88937O59883P21872N80489M33267M64260O34313P07924
2047.7G09826350O01351M57585M61698O16074P30037O41287M35650L71694N11945O87897
2068.1G15341568O74069M81665L81649N16235O78719O39140M54545L57628M81844O56307
$$ y = [667122602, 668078303, 669137716, 670181990, 671063423, 671868265, 672746480, 673706234, 674669504, 675560117, 676373899, 677208662, 678127289, 679032028, 679778695, 680363238, 680991530, 681793034, 682654798, 683407605, 684097230, 684886456, 685820401, 686795354, 687635958, 688310027, 688970387, 689776957, 690652072, 691401064, 691996396, 692582905, 693282127, 694081962, 694845200, 695461631, 696022928, 696689188, 697459340, 698153973, 698683560, 699166238, 699777246, 700520337, 701214731, 701746404, 702211201, 702784956, 703481555, 704160571, 704700351, 705135405, 705624342, 706284225, 707006097, 707586586, 708019853, 708484113, 709118426, 709826350, 710427701, 710885286, 711346984, 711963058, 712693095, 713334382, 713770032, 714141726, 714653671, 715341568, 716015637, 716497302, 716878951, 717395186, 718073905, 718713045, 719167590, 719525218, 720007062, 720663369]
2088.5G20663369O39319M36425K97070L90231N88358O08861L95775K07007K48730M44770
2108.9G24919915N19872L58939J70529K26974M49956N13792L26574J35958K11358M49658
2129.3G28283525N26666L40283J41561J99556M41254N48422L82841J33633P4208K72036
2149.7G31343985M93466N09680L63350L23593N11766O99818O49154M37141L35991M67420
2170.1G36135364O54637O29962M34279L40343M83751O72698O56724M55618L16203M27067
2190.5G41206646O17802O17564M40359L13163L58999N05328N62191M06325K19106K51889
2210.9G45499372M47274N33461M06802K18987K08199L95656N20110M06981K08795J87874
2231.3G49033511L82602N24163M04656K02596J65940L45826N30600M49241J99079J25527
$$ y = [720663369, 721302688, 721739113, 722036183, 722426414, 723014772, 723623633, 724019408, 724226415, 724475145, 724919915, 725439787, 725798726, 725969255, 726196229, 726646185, 727159977, 727486551, 727622509, 727833867, 728283525, 728810191, 729150474, 729292035, 729491591, 729932845, 730481267, 730864108, 730997741, 731071949, 731343985, 731837451, 732347131, 732710481, 733034074, 733545840, 734245658, 734894812, 735331953, 735667944, 736135364, 736790001, 737419963, 737854242, 738194585, 738678336, 739351034, 740007758, 740463376, 740779579, 741206646, 741824448, 742442012, 742882371, 743195534, 743554533, 744059861, 744622052, 745028377, 745247483, 745499372, 745946646, 746480107, 746886909, 747105896, 747314095, 747709751, 748229861, 748636842, 748845637, 749033511, 749416113, 749940276, 750344932, 750547528, 750713468, 751059294, 751589894, 752039135, 752238214, 752363741]
2251.7G52363741L05832M77850M32730K40326J68681L20017M89355M49061K60353J70648
2272.1G55678594K74718M17769L89993K27571J41143K22922L61800L76403K17796O6757
2292.5G58375466P7903J87099K63751K06828Q2612M4942J20222J98603J84596P4088
2312.9G59816110k1636L3557J38462J07169j0789l337J18672J91033J59562L0935r3758
2335.3G60465980k5094J81139K55703K08915K47776M27008M67420K23040j15871k68698
2355.7G62067318k03788Q0943L98874L93510K11537K60591N21243O30200M92275L20971
2376.1G65173674L05533M21882N00083M17530J92344N0426J17004J99973J22488k1815
2396.5G67479122n2274M8817J65045J43409k4379j36792o3360O9499P1526o1632j65045
$$ y = [752363741, 752669573, 753147423, 753580153, 753820479, 753989160, 754309177, 754798532, 755247593, 755507946, 755678594, 755953312, 756371081, 756761074, 756988645, 757129788, 757352710, 757714510, 758090913, 758308709, 758375466, 758453369, 758640468, 758904219, 759111047, 759193659, 759238601, 759358823, 759557426, 759742022, 759816110, 759794474, 759828031, 759966493, 760073662, 760062873, 760059536, 760178208, 760369241, 760528803, 760559738, 760465980, 760440886, 760622025, 760877728, 761086643, 761334419, 761761427, 762228847, 762451887, 762336016, 762067318, 761863530, 761944473, 762343347, 762736857, 762948394, 763208985, 763730228, 764360428, 764852703, 765173674, 765479207, 765901089, 766401172, 766818702, 767011046, 767061472, 767178476, 767378449, 767500937, 767479122, 767426848, 767475665, 767640710, 767784119, 767759740, 767622948, 767559588, 767629087, 767700613, 767638981, 767473936]
2418.9G67473936j50740p2300l6717j34230k62618k77579j95682j39951k17438l73006
2439.3G65613675m51326l95537l32236m23729o38307p67469p56681p71761r23931j157701
2459.7G58994997j330674j382113j423359j623928j955271k265811k492428k678573
2476G43842840k913296l174603l345013l369212l302097l276467l323198l297388l053487
2494.4G14788079k598643k152622j880348j678049j423776j234651j340568j772880
2510.7G00706542k319158k627015k461850j951695j377463q28564k43605L97206J010358
2529F90304756J453877J709520J882613J978576J885116J586378J307666J400173J916051
2547.4G05424726K477586K719403K584934K277076K009749J830638J637638J392900
$$ y = [767473936, 767323196, 767250896, 767214179, 767079949, 766817331, 766539752, 766344070, 766204119, 765986681, 765613675, 765162349, 764766812, 764434576, 764010847, 763372540, 762605071, 761848390, 761076629, 760152698, 758994997, 757664323, 756282210, 754858851, 753234923, 751279652, 749013841, 746521413, 743842840, 740929544, 737754941, 734409928, 731040716, 727738619, 724462152, 721138954, 717841566, 714788079, 712189436, 710036814, 708156466, 706478417, 705054641, 703819990, 702479422, 700706542, 698387384, 695760369, 693298519, 691346824, 689969361, 689140797, 688897192, 689294398, 690304756, 691758633, 693468153, 695350766, 697329342, 699214458, 700800836, 702108502, 703508675, 705424726, 707902312, 710621715, 713206649, 715483725, 717493474, 719324112, 720961750, 722354650]
2563.7G22354650J220763J161099J133442J047253Q35777N92887M97997N27382N05924
2582.1G29877174L80397K55108K28822K74300K85447K02119J00553R6918J84536K68459
2602.5G32153833K52724J34646J13249L08037M95970M94421M34637M88162O44624P87974
2622.9G36308277Q22127P61926P35521Q36372R82106J010954R23455Q76129R33528
2641.2G44190395R97364R68814Q17657O46949O09934O58572O29007M58718K75194K33889
2661.6G50486493K87116K49326P0274r4533j13189n4419p2420j72675k37286k05636
2682G50143051j41024j21057j82093k79963l01540k32875j83344k20001k90334l23593
2702.4G47867227k82944k19762k41995l50773m11332l38971k54035l09110m32253m64797
$$ y = [722354650, 723575413, 724736512, 725869954, 726917207, 727752984, 728345871, 728843868, 729371250, 729877174, 730257571, 730512679, 730741501, 731015801, 731301248, 731503367, 731603920, 731700838, 731885374, 732153833, 732406557, 732541203, 732654452, 732962489, 733458459, 733952880, 734387517, 734875679, 735520303, 736308277, 737130404, 737892330, 738627851, 739464223, 740446329, 741457283, 742380738, 743256867, 744190395, 745187759, 746156573, 746974230, 747621179, 748231113, 748889685, 749518692, 749977410, 750252604, 750486493, 750773609, 751022935, 751093209, 750998676, 750885487, 750831068, 750758648, 750585973, 750348687, 750143051, 750002027, 749880970, 749698877, 749418914, 749117374, 748884499, 748701155, 748481154, 748190820, 747867227, 747584283, 747364521, 747122526, 746771753, 746360421, 746021450, 745767415, 745458305, 745026052, 744561255]
2722.8G44561255m02629k90454k30253l08334m04537m04239l46362l27826l78489m19915
2743.2G41048217m09246l72469l41892l60847m01795m22776m41133m46678m57167m95971
2763.6G36898243n13672n00381n12183n63741o14762n91934n40554n54264o11603o87719
2784G31207430p59065p83264p32542p04348q02636q99195q44062p49111q17239r96709
2804.4G23119259j102328j071334r87530j002610j150906j279473j268149j224994
2820.7G14031935j310826j439690j479566j517296j617611j753866j933813k152086
2837G00827181k299487k392531k668678l082872l259957k906084k152622j457572j080036
2855.4F79527342r72509r75847j024068j186073j431226j634956j764297j783729j600265
$$ y = [744561255, 744158626, 743868172, 743637919, 743329585, 742925048, 742520809, 742174447, 741846621, 741468132, 741048217, 740638971, 740266502, 739924610, 739563763, 739161968, 738739192, 738298059, 737851381, 737394214, 736898243, 736384571, 735884190, 735372007, 734808266, 734193504, 733601570, 733061016, 732506752, 731895149, 731207430, 730448365, 729665101, 728932559, 728228211, 727425575, 726526380, 725682318, 724933207, 724115968, 723119259, 722016931, 720945597, 719958067, 718955457, 717804551, 716525078, 715256929, 714031935, 712721109, 711281419, 709801853, 708284557, 706666946, 704913080, 702979267, 700827181, 698527694, 696135163, 693466485, 690383613, 687123656, 684217572, 682064950, 680607378, 679527342, 678554833, 677578986, 676554918, 675368845, 673937619, 672302663, 670538366, 668754637, 667154372]
2873.7F67154372j330018j234055j292229j314878j286387j276494j308262j333415
2890.1F56778634j268506j139939j009524r00090q57353q53658q73029j013577j339436
2908.4F47523522j755118k017975j946330j576483j105428o69241k74181M5120K08498
2926.8F38432384L11315N09977O91533P60138Q08418Q16107P06553O18637O48260O38306
2947.2F44941628M83334K84255J85132J55151J09672P9155J04547J75535K61545L36767
2967.6F47116721L73542L79920M16934M73261M28796L64661M42207N24879M76718L88622
2987.9F51386261L02017K51353L13878L70621L63529L47972K87175K72989L20971K53082
3008.3F54469848J13725P5639J44064K35379K40803J01029j10566k33650k51413l21567
$$ y = [667154372, 665824354, 664590299, 663298070, 661983192, 660696805, 659420311, 658112049, 656778634, 655510128, 654370189, 653360665, 652460575, 651603222, 650749564, 649876535, 648862958, 647523522, 645768404, 643750429, 641804099, 640227616, 639122188, 638452947, 638178766, 638223886, 638432384, 638743699, 639253676, 639945209, 640705347, 641513765, 642329872, 643036425, 643655062, 644303322, 644941628, 645424962, 645709217, 645894349, 646049500, 646159172, 646238327, 646342874, 646518409, 646779954, 647116721, 647490263, 647870183, 648287117, 648760378, 649189174, 649553835, 649996042, 650520921, 650997639, 651386261, 651688278, 651939631, 652253509, 652624130, 652987659, 653335631, 653622806, 653895795, 654216766, 654469848, 654583573, 654659212, 654803276, 655038655, 655279458, 655380487, 655269921, 655036271, 654784858, 654463291]
3028.7F54463291m52041n24343m85539m62115o04689p64727p68185o80626o46591p36654
3049.1F48337781q17358q08716q18014q18670p72238q07166r37104j017511r54747
3067.5F40586257q29279q18670r37224j053691j057088r62198r09209r20176r12726
3085.8F32185996r21488r58979r47893r31621r85920j074493j105666j064599j061618
3104.2F23133719j130939j152217j082063j087010j200497j264989j229763j119375
3120.5F13866866j044453j097977j209438j279532j274288j262903j288712j318872
3136.8F04090691j325190j294673j298308j348615j394272j482963j538456j452505
3153.2E92955709j377404j423180j486123j511216j531124j545310j569152j619816
$$ y = [654463291, 654011250, 653486907, 653001368, 652539253, 651934564, 651169837, 650401652, 649721026, 649074435, 648337781, 647520423, 646711707, 645893693, 645075023, 644302785, 643495619, 642558515, 641541004, 640586257, 639756978, 638938308, 638001084, 636947393, 635890305, 634928107, 634018898, 633098722, 632185996, 631264508, 630305529, 629357636, 628426015, 627440095, 626365602, 625259936, 624195337, 623133719, 622002780, 620850563, 619768500, 618681490, 617480993, 616216004, 614986241, 613866866, 612822413, 611724436, 610514998, 609235466, 607961178, 606698275, 605409563, 604090691, 602765501, 601470828, 600172520, 598823905, 597429633, 595946670, 594408214, 592955709, 591578305, 590155125, 588669002, 587157786, 585626662, 584081352, 582512200, 580892384]
3169.5E80892384j640677j620174j619220j657486j671612j637101j634777j694440
3185.8E67716897j738728j710116j652122j637936j679718j724482j728177j719594
3202.1E54126024j707911j675666j674950j712322j725614j685143j637041j664817
3218.4E40642560j713217j706660j681089j693904j745165j760423j680016j573325
3234.7E27088761j568019j625538j615882j566529j575947j587629j550079j510203
3251.1E14488935j496851j522303j540660j538575j531482j508593j487494j468718
3267.4E02394259j468122j489818j468569j417786j406431j407594j406997j431197
3283.7D90897745j423329j392335j409411j413107j401931j454950j490026j467944
$$ y = [580892384, 579251707, 577631533, 576012313, 574354827, 572683215, 571046114, 569411337, 567716897, 565978169, 564268053, 562615931, 560977995, 559298277, 557573795, 555845618, 554126024, 552418113, 550742447, 549067497, 547355175, 545629561, 543944418, 542307377, 540642560, 538929343, 537222683, 535541594, 533847690, 532102525, 530342102, 528662086, 527088761, 525520742, 523895204, 522279322, 520712793, 519136846, 517549217, 515999138, 514488935, 512992084, 511469781, 509929121, 508390546, 506859064, 505350471, 503862977, 502394259, 500926137, 499436319, 497967750, 496549964, 495143533, 493735939, 492328942, 490897745, 489474416, 488082081, 486672670, 485259563, 483857632, 482402682, 480912656, 479444712]
3300D79444712j471221j474410j488835j562297j608789j612038j652479j714170j748830
3318.4D65111643j775712j840681j931607j983404j984597j994639k053619k097189
3334.7D49450195k090931k104789k133161k123386k106696k085835k031386j997739
3351D32776272k025008k052635k010316j958102j978367k017021j983047j904398j870692
3369.3D14976686j867622j828611j747310j638889j510233j435608j402080j321196
3385.7D02225137j191586j071662j038015j027525r43094q51691q03232p97898q25673
3404C93674761p61479o21438n27769m35740l26693k87682k62499j77622p2360P4923
3424.4C90276402K11001K70277L04282M45366O37292O66947O30587O85066P97123R43243
$$ y = [479444712, 477973491, 476499081, 475010246, 473447949, 471839160, 470227122, 468574643, 466860473, 465111643, 463335931, 461495250, 459563643, 457580239, 455595642, 453601003, 451547384, 449450195, 447359264, 445254475, 443121314, 440997928, 438891232, 436805397, 434774011, 432776272, 430751264, 428698629, 426688313, 424730211, 422751844, 420734823, 418751776, 416847378, 414976686, 413109064, 411280453, 409533143, 407894254, 406384021, 404948413, 403546333, 402225137, 401033551, 399961889, 398923874, 397896349, 396953255, 396101564, 395298332, 394500434, 393674761, 392913282, 392291844, 391764075, 391328335, 391001642, 390713960, 390451461, 390273839, 390201479, 390276402, 390487403, 390757680, 391061962, 391507328, 392144620, 392811567, 393442154, 394127220, 394924343, 395867586]
3444.8C95867586J054883J101822J209408J316041J357972J453728J552432J534701
3461.1D06448573J565575J720638J789748J714021J642376J717806J853615J955480
3477.4D20407832J970827J905054J911640K015323K084732K110660K160996K171248
3493.8D36738312K164215K193302K242506K251446K200633K222031K357036K430857
3510.1D54800338K452552K490967K461791K477020K566606K649755K647191K600550
3526.4D75146770K667159K806783K872556K910108K954036K959877L009141L059804
3542.7D98386234L069729L085971L188848L254831L238857L289163L372252L444195
3559E24330080L502607L534734L556907L686190L826380L851831L850043L899276L982782
$$ y = [395867586, 396922469, 398024291, 399233699, 400549740, 401907712, 403361440, 404913872, 406448573, 408014148, 409734786, 411524534, 413238555, 414880931, 416598737, 418452352, 420407832, 422378659, 424283713, 426195353, 428210676, 430295408, 432406068, 434567064, 436738312, 438902527, 441095829, 443338335, 445589781, 447790414, 450012445, 452369481, 454800338, 457252890, 459743857, 462205648, 464682668, 467249274, 469899029, 472546220, 475146770, 477813929, 480620712, 483493268, 486403376, 489357412, 492317289, 495326430, 498386234, 501455963, 504541934, 507730782, 510985613, 514224470, 517513633, 520885885, 524330080, 527832687, 531367421, 534924328, 538610518, 542436898, 546288729, 550138772, 554038048, 558020830]
3577.4E58020830M086793M157126M140913M153729M231393M324257M296661M251539
3593.7E91663241M303396M389763M432261M412353M360735M309834M354000M380047
3610F26605630M318952M260064M205465M204929M241645M081667L884792L825664L884972
3628.4F63513780L968477L793239L590107L461004L351450L242671L126383L033161
3644.7F91080272K964735K919436K804339K651155K505898K380490K303839K203703
3661G11813867K025724J870811J726090J520038J460910J510441J330853J132369J168549
3679.4G25559652J223087J225889J185596J107871R42827Q58485R13740R28640Q66711
3697.7G34812498P06673N42760N18620N91755O50703N60463L09765L21806M79817M13597
$$ y = [558020830, 562107623, 566264749, 570405662, 574559391, 578790784, 583115041, 587411702, 591663241, 595966637, 600356400, 604788661, 609201014, 613561749, 617871583, 622225583, 626605630, 630924582, 635184646, 639390111, 643595040, 647836685, 651918352, 655803144, 659628808, 663513780, 667482257, 671275496, 674865603, 678326607, 681678057, 684920728, 688047111, 691080272, 694045007, 696964443, 699768782, 702419937, 704925835, 707306325, 709610164, 711813867, 713839591, 715710402, 717436492, 718956530, 720417440, 721927881, 723258734, 724391103, 725559652, 726782739, 728008628, 729194224, 730302095, 731244922, 732103407, 733017147, 733945787, 734812498, 735519171, 736061931, 736580551, 737172306, 737823009, 738383472, 738693237, 739015043, 739494860, 739908457]
3718.1G39908457K22504J45316K02179K22504K53201K88784K11120R4771J70350L11554
3738.5G42030740K58624M3691l3975K87175L53992L6597j6451K87712M13120K19762
3758.9G43880987O2645R7453R5368J06930J20819O2346K8492O3717J52171Q4221o8903
3781.3G44686246o3777k0444N7816J42872R4414q2791k30372q6844J00792l3200n5373
3803.8G44509339n9o6757K7656J04129m1067k27571j28746r6559k02656j3054J33694
3826.2G43998349J12474K4378m5180J251o8128k13742q9645O5207N3644J2398m053
3848.6G43846953j05262m64141n18143J2219J99019J01686q524p3015p7963j48058
3869G42764771j71423k2173Q7738P9990r7812k34306j59442j43051q8334k8372j45316
$$ y = [739908457, 740130961, 740276277, 740478456, 740700960, 740954161, 741242945, 741454065, 741548836, 741719186, 742030740, 742289364, 742333055, 742299080, 742586255, 742940247, 742976844, 742960393, 743248105, 743661225, 743880987, 743943632, 744041085, 744136453, 744243383, 744364202, 744426548, 744455040, 744518757, 744670928, 744755149, 744686246, 744622469, 744602025, 744659841, 744802713, 744897127, 744814336, 744583964, 744497120, 744597912, 744564712, 744509339, 744509280, 744442523, 744470179, 744574308, 744533241, 744305670, 744176924, 744080365, 743877709, 743864655, 743998349, 744110823, 744135201, 744090021, 744091272, 744023144, 743809402, 743719757, 743784964, 743838608, 743851006, 743846953, 743741691, 743277550, 742759407, 742771626, 742970645, 743072331, 743063807, 742990792, 742912829, 742764771, 742593348, 742571175, 742658913, 742738903, 742641091, 742406785, 742247343, 742104292, 742015958, 741987586, 741842270]
3891.5G41842270j28746J5557p4864k82168k87473r8169O0022M8577j6033l3021o1631
3913.9G40984321j32621j72972j26481q6844q5295n9068o3360j21891j55091r2388
3934.3G39888310j9788q7858j87277j49966n5015l5882q1539r2029m4287k3901n8890
3956.7G39051878p9333p7308j00731j01567o5028n3645n1796n3585n4419j8119k385
3979.2G38393962k5689j4603r358o3956m3571J9312l8982j04427r3937
3997.5G38018751
$$ y = [741842270, 741713524, 741729081, 741654217, 741372049, 741084576, 740986407, 741046429, 741095006, 741078973, 741045952, 740984321, 740851700, 740678728, 740552247, 740465403, 740380108, 740321040, 740257680, 740135789, 739980698, 739888310, 739868522, 739780664, 739593387, 739443421, 739388406, 739352524, 739270985, 739178956, 739134669, 739110768, 739051878, 738972545, 738895237, 738794506, 738692939, 738627911, 738574266, 738522470, 738468885, 738414466, 738396347, 738393962, 738368273, 738353670, 738344312, 738280356, 738236785, 738256097, 738217115, 738112688, 738018751]
##END=$$ End of the data block
