##TITLE=T5PF $$ Begin of the data block
##JCAMP-DX=5.00 $$ ACD/SpecManager v 10.08
##SPECTROMETER/DATA SYSTEM=Alpha
##DATE=12 Mar 2014 10:59:36
##DATA TYPE=INFRARED SPECTRUM
##DATA CLASS=XYDATA
##ORIGIN=
##OWNER=
##NPOINTS=1765
##FIRSTX=399.75695801
##LASTX=3997.56933594
##MAXX=3997.56933594
##MINX=399.75695801
##MAXY=0.69072038
##MINY=0.00687924
##XFACTOR=1.0000000000
##YFACTOR=1.000000000000000e-9
##FIRSTY=0.20856565
##DELTAX=2.03957629
##XUNITS=1/CM
##YUNITS=ARBITRARY UNITS
##XYDATA=(X++(Y..Y))
399.8B08565652R911895R655759R876132R908184J0023415J0207445R715199Q844555
$$ 208565652 218477547 228133306 238009438 247917622 257941037 268148482 277863681 286708236
416.1B86708236R540677R979576Q353263P686943P120013O352633O491423O553918
$$ 286708236 296248913 306228489 314581752 322268695 329388708 335741341 342232764 348786682
432.4C48786682O164461O126076O253600N938232N413950N221963N436808N061835
$$ 348786682 354951143 361077219 367330819 373269051 378683001 383904964 389341772 394403607
448.7C94403607M487097M887491N093426M442483L778458L897488M204988L727734
$$ 394403607 398890704 403778195 408871621 413314104 417092562 420990050 425195038 428922772
465D28922772L341079L741086L987252L386319L009886L441691L274888K540350K800643
$$ 428922772 432263851 436004937 439992189 443378508 446388394 449830085 453104973 455645323 458445966
483.4D58445966L553301L076256K245605K773225L490150K824128K100587K523422
$$ 458445966 461999267 465075523 467321128 470094353 473584503 476408631 478509218 481032640
499.7D81032640K864510K183646J759231K212494K147734J269699J104623J866906
$$ 481032640 483897150 486080796 487840027 490052521 492200255 493469954 494574577 496441483
516D96441483J790286Q06957R30488J931340J938343J222312J583219K416312K029479
$$ 496441483 498231769 499038726 499969214 501900554 503838897 505061209 506644428 509060740 511090219
534.4E11090219J254439J583398K004504J254261N82814J093447J318753L24249k78473
$$ 511090219 512344658 513928056 515932560 517186821 517769635 518863082 520181835 520506084 520227611
552.7E20227611K76804L85284l72827k75075P07805P37667n7220K3246O67929L48509
$$ 520227611 520504415 520889699 520516872 520241797 520949602 521687269 521630049 521653295 522321224 522669733
573.1E22669733l47734K0742P07508M70101J94431P53104J139403N69224J00196N28335
$$ 522669733 522321999 522342741 523050249 523520350 523714781 524467885 525607288 526176512 526276708 526805043
593.5E26805043P07865j28448q21888o92070r03845j710176j724303o83069N2571J76847
$$ 526805043 527512908 527384460 526562572 525870502 524966657 523256481 521532178 520849109 520901680 521078527
613.9E21078527O92070J486182J567602J155555J249790J543403J195848Q79765J571297
$$ 521078527 521770597 523256779 524824381 525979936 527229726 528773129 529968977 530848742 532420039
632.3E32420039K546430K749920K457261K298832K096832J517713J006543Q66354N96940
$$ 532420039 534966469 537716389 540173650 542472482 544569314 546087027 547093570 547959924 548556864
650.6E48556864N6565l12626m82381o92367r85623j064121n37575n2571p12931j006901
$$ 548556864 548613429 548300803 547818422 547126055 546140432 545076311 544538736 544486165 543773234 542766333
671E42766333k16782K00748M2438k12907m66764q62778j336455j896858k839267m267991
$$ 542766333 542549551 542750299 542792737 542579830 542113066 541250288 539913833 538016975 535177708 530909717
691.4E30909717o318748r490967j2842297j1982620p993668r194881j5503168k0488620
$$ 530909717 524590969 515100002 502257705 490275085 482281417 473086536 457583368 437094748
707.7D37094748k2402674j9059777r189159R209L917605P904470J4718473K1811485
$$ 437094748 414692074 395632297 386443138 386452347 390369952 398274422 412992895 434804380
724D34804380K7007580K8779477K7000934K3041248J8050849J2869478Q714795O112992
$$ 434804380 461811960 490591437 517592371 540633619 558684468 571553946 580268741 586381733
740.4E86381733M158259K316892J299024J113116N95391l39925o02245k30849l92676
$$ 586381733 590539992 592856884 594155908 595269024 595864415 595524490 594922245 594691396 594298720
758.7E94298720j030266r96351m28140m31598q52346o00219p212k36750p72297m87387
$$ 594298720 593268454 592272103 591843963 591412365 590560019 589959800 589952588 589715838 588943541 588456154
779.1E88456154l7134n22852j130461q28743n65529j253367j757085j199246q32200
$$ 588456154 588419020 587896168 586765707 585936964 585371435 584118068 582360983 581161737 580329537
797.5E80329537j443743j841724j480460j553893k347529k656043k301216k482176
$$ 580329537 578885794 577044070 575563610 574009717 571662188 569006145 566704929 564222753
813.8E64222753l303945l535807l158093l455996m409194m729927m656136n401671
$$ 564222753 560918808 557383001 554224908 550768912 546359718 541629791 536973655 531571984
830.1E31571984o657481p360041p933319r556353j2157649j4252275j6554743k0099521
$$ 531571984 524914503 517554462 509621143 500064790 487907141 473654866 457100123 437000602
846.4D37000602j9025892j3777434j4696449j9438804j8918901j5658200j6439259
$$ 437000602 417974710 404197276 389500827 370062023 351143122 335484922 319045663
860.7C19045663k3081005l4633696m9282387n8503255n0022982k7610391p517115O980591
$$ 319045663 295964658 261330962 212048575 153545320 103522338 75911947 68394832 75375423
877G5375423K3240864M2235315N9267133P1542874P5872779O8092376N1721007L5928160
$$ 75375423 98616287 140851602 200118735 271661609 347534388 415626764 467347771 503275931
893.3E03275931K4883509J7748117J3412952J0528565P902920N776048M835665M444957
$$ 503275931 528159440 545907557 559320509 569849074 577751994 583528042 588363707 592808664
909.6E92808664L346205J934111J182735N75602m60983j180172j183390j229763j645744
$$ 592808664 596154869 598088980 599271715 599847317 599386334 598206162 597022772 595793009 594147265
928E94147265j737475j312793j154840j435399j464128j191616j260460j705706k007186
$$ 594147265 592409790 591096997 589942157 588506758 587042630 585851014 584590554 582884848 580877662
946.4E80877662k116442k476692l083825l466904l620744m010439m574955m836261
$$ 580877662 578761220 576284528 573200703 569733799 566113055 562102616 557527661 552691400
962.7E52691400m915416n266726n838454o215274o459296o997645p761598q305192
$$ 552691400 547775984 542509258 536670804 530455530 523996234 516998589 509236991 500931799
979E00931799q607566q888960q992493q668900q046597p478684o988496o357580n678624
$$ 500931799 492324233 483435273 474442780 465773880 457727283 450248599 443260103 436902523 431223899
997.3D31223899n370080n504549n759358o075293o561965p044017p196933o970406
$$ 431223899 425853819 420349270 414589912 408514619 401952654 394908637 387711704 380741298
1013.7C80741298o514132n876899m976123l957689l102839k402812j691193r63240
$$ 380741298 374227166 368350267 363374144 359416455 356313616 353910804 352219611 351256371
1030C51256371m33505k09034j91271l55124q24422j468599j917809k040118j966476
$$ 351256371 350822866 350613832 350422561 350067437 349243015 347774416 345856607 343816489 341850013
1048.3C41850013j686544j051306k10286N05090J023352J463503J608074J145064J89364
$$ 341850013 340163469 339112163 338901877 339406967 340430319 341893822 343501896 344646960 344836324
1066.7C44836324r33915k148867l392070m296392m700274n211442n221427k078622
$$ 344836324 343902409 341753542 338361472 334065080 329364806 324153364 318931937 316853315
1083C16853315K731442M871100N038142N422950N501598M535199K824395J258880M62205
$$ 316853315 319584757 324455857 329493999 334916949 340418547 344953746 347778141 349037021 349499226
1101.4C49499226L12000L94702O07848R92447J266241J126260P25389L24517o8247
$$ 349499226 349811226 350205928 350813776 351806223 353072464 354198724 354924113 355248630 355180383
1119.7C55180383m85719p74651q61436r98974j352102j727998j975954k260118k636671
$$ 355180383 354694664 353920013 353058577 352059603 350707501 348979503 347003549 344743431 342106760
1138.1C42106760k801568k589404k195299j763403j306773r31114p86423q23200p27952
$$ 342106760 339305192 336715788 334520489 332757086 331450313 330519199 329732776 328909576 328181624
1156.4C28181624l02463L15129R77070J686155K279938K488672K390713K386391K640098
$$ 328181624 327879161 328194290 329171360 330857515 333137453 335626125 338016838 340403229 343043327
1174.8C43043327K860040K796709K456606J874983J039296P6175p47084j363814j910895
$$ 343043327 345903367 348700076 351156682 353031665 354070961 354147136 353400052 352036238 350125343
1193.1C50125343k392114k640098k673328k685428k689778k564073k400190k415657
$$ 350125343 347733229 345093131 342419803 339734375 337044597 334480524 332080334 329664677
1209.5C29664677k605706k819657l024191l253490l434300l499717l516942l585249
$$ 329664677 327058971 324239314 321215123 317961633 314527333 311027616 307510674 303925425
1225.8C03925425l641337l591061l489763l437489l425002l376841l296882l239781
$$ 303925425 300284088 296693027 293203264 289765775 286340773 282963932 279667050 276427269
1242.1B76427269l227770l176451l090769l068358l123045l189832l222584l246040
$$ 276427269 273199499 270023048 266932279 263863921 260740876 257551044 254328460 251082420
1258.4B51082420l274455l254980l190682l200575l252238l294632l341898l419221
$$ 251082420 247807965 244552985 241362303 238161728 234909490 231614858 228272960 224853739
1274.7B24853739l506422l530204l531829l578394l657148l722250l792197l865882
$$ 224853739 221347317 217817113 214285284 210706890 207049742 203327492 199535295 195669413
1291A95669413l944219m005074m069179m155338m214779m214018m180372m191130m189387
$$ 195669413 191725194 187720120 183650941 179495603 175280824 171066806 166886434 162695304 158505917
1309.4A58505917m161284m124269m069268m035116m035353m002095l983274m023268
$$ 158505917 154344633 150220364 146151096 142115980 138080627 134078532 130095258 126071990
1325.7A26071990m038647m029759l949135l792927l748275l992632m208855m029267
$$ 126071990 122033343 118003584 114054449 110261522 106513247 102520615 98311760 94282493
1342I4282493l782950l748797l768496l733270l675364l628582l565982l433928l391798
$$ 94282493 90499543 86750746 82982250 79248980 75573616 71945034 68379052 64945124 61553326
1360.4F1553326l481683l365386l091995l007792k903662k820705k861253k691977
$$ 61553326 58071643 54706257 51614262 48606470 45702808 42882103 40020850 37328873
1376.7C7328873k489712k415896k299839k167831k177704k107188j856604j806342
$$ 37328873 34839161 32423265 30123426 27955595 25777891 23670703 21814099 20007757
1393B0007757j871710j733044j610550j480608j287722j177507r99240q11967o66907
$$ 20007757 18136047 16403003 14792453 13311845 12024123 10846616 9847376 9035409 8368502
1411.4H368502n24093m07427l41698k16043N398J34431J71517J97186K63809K92105
$$ 8368502 7844409 7436982 7095284 6879241 6884639 7019070 7190587 7387773 7651582 7943687
1431.8G943687K66828K65770L07353K50948J69016J26117J01976J11670J10335Q3356
$$ 7943687 8210515 8476285 8783638 9034586 9203602 9329719 9431695 9543365 9653700 9737056
1452.2I737056K7979K3540J72579K62123J75790J45081J85109J53689J23252K19928
$$ 9737056 9765035 9788575 9961154 10223277 10399067 10544148 10729257 10882946 11006198 11226126
1472.6A1226126L51813L53006L87410M50306M99474M94921N08107O16329P80470Q21371
$$ 11226126 11577939 11930945 12318355 12768661 13268135 13763056 14271163 14887492 15667962 16489333
1493A6489333Q54413J117746J323400J315119J177672J291756J984488K155820J917777
$$ 16489333 17343746 18461492 19784892 21100011 22277683 23569439 25553927 27709747 29627524
1511.3B9627524J920443K042692K191484K270233K622903K788491K626226K777550
$$ 29627524 31547967 33590659 35782143 38052376 40675279 43463770 46089996 48867546
1527.6D8867546K711546K743590L140860K921491K662898L588050M203543L772967
$$ 48867546 51579092 54322682 57463542 60385033 63047931 66635981 70839524 74612491
1543.9G4612491L680199L685937L988497M230372M344151M382111N651630O912820
$$ 74612491 78292690 81978627 85967124 90197496 94541647 98923758 104575388 111488208
1560.3A11488208M988618M394785M702531M859969M998922M273415L969833M610315
$$ 111488208 116476826 120871611 125574142 130434111 135433033 139706448 143676281 148286596
1576.6A48286596M202411L566429L581538L553063L378183L205388L064588K900407
$$ 148286596 152489007 156055436 159636974 163190037 166568220 169773608 172838196 175738603
1592.9A75738603K710298K539500K444610K347887K226442K079457J951903J804218
$$ 175738603 178448901 180988401 183433011 185780898 188007340 190086797 192038700 193842918
1609.2A93842918J596823J401410J315623J294255J168832J140699J175553J081303
$$ 193842918 195439741 196841151 198156774 199451029 200619861 201760560 202936113 204017416
1625.5B04017416R83208J021043J106590J256868J458660J448229J435339J606077
$$ 204017416 205000624 206021667 207128257 208385125 209843785 211292014 212727353 214333430
1641.8B14333430J796290K149984K420322K116859K384871L182947K721429K501056
$$ 214333430 216129720 218279704 220700026 222816885 225201756 228384703 231106132 233607188
1658.2B33607188K851918L264010L423557L241345L475145L885582L615796L683389
$$ 233607188 236459106 239723116 243146673 246388018 249863163 253748745 257364541 261047930
1674.5B61047930L988087L781587L685981M038810M766077M352063L843248M105300
$$ 261047930 265036017 268817604 272503585 276542395 281308472 285660535 289503783 293609083
1690.8B93609083M125952M621268N107879M969687N393654M794806M339099M488051
$$ 293609083 297735035 302356303 307464182 312433869 317827523 322622329 326961428 331449479
1707.1C31449479M152536L945053L899872L871262L914655L483682K929896K908558
$$ 331449479 335602015 339547068 343446940 347318202 351232857 354716539 357646435 360554993
1723.4C60554993L039688L024608L053695K995163L122658L046065K681464K824724
$$ 360554993 363594681 366619289 369672984 372668147 375790805 378836870 381518334 384343058
1739.7C84343058K972334K912343K986193L082245L088504K977819K794176K813339
$$ 384343058 387315392 390227735 393213928 396296173 399384677 402362496 405156672 407970011
1756.1D07970011K820283K658934K652287K530158K340525K303034K134323J609654
$$ 407970011 410790294 413449228 416101515 418631673 420972198 423275232 425409555 427019209
1772.4D27019209O88940k16275r20952j540750k078325k684921l069609k801716k635390
$$ 427019209 427708149 427491874 426570922 425030172 422951847 420266926 417197317 414395601 411760211
1790.7D11760211k771348k363920j669854r30518K01851J450807K436757L357351M369319
$$ 411760211 408988863 406624943 404955089 404024571 404226422 405677229 408113986 411471337 415840656
1809.1D15840656N293011N746007N852491N930334N821556N401999M962235M662484
$$ 415840656 421133667 426879674 432732165 438662499 444484055 449886054 454848289 459510773
1825.4D59510773M189820L769725L435731L103644K940476K783984K586633K470910
$$ 459510773 463700593 467470318 470906049 474009693 476950169 479734153 482320786 484791696
1841.7D84791696K459914K342522K137601K088279K097636K011806J932740J934409
$$ 484791696 487251610 489594132 491731733 493820012 495917648 497929454 499862194 501796603
1858E01796603J961887J910567J863540J908242J866043J669407J554668J663267J732409
$$ 501796603 503758490 505669057 507532597 509440839 511306882 512976289 514530957 516194224 517926633
1876.4E17926633J627565J544773J613796J682758J602829J505315J516342J532138
$$ 517926633 519554198 521098971 522712767 524395525 525998354 527503669 529020011 530552149
1892.7E30552149J434207J391053J474559J501859J370131J323402J440823J448095
$$ 530552149 531986356 533377409 534851968 536353827 537723958 539047360 540488183 541936278
1909E41936278J310706J271010J386642J390756J248300J180827J263082J270175J143873
$$ 541936278 543246984 544517994 545904636 547295392 548543692 549724519 550987601 552257776 553401649
1927.4E53401649J127899J234412J244366J111627J104593J228988J214981J043618
$$ 553401649 554529548 555763960 557008326 558119953 559224546 560453534 561668515 562712133
1943.7E62712133J013517J125634J107156R69291R48191J002073Q90315P71045Q71837
$$ 562712133 563725650 564851284 565958440 566927731 567875922 568877995 569768310 570539355 571411192
1962.1E71411192J050592J045406R59754J032948J175225J133800R73522R86338J075446
$$ 571411192 572461784 573507190 574466944 575499892 576675117 577808917 578782439 579768777 580844223
1980.4E80844223J004935Q72314R26494J034856R51529Q09550Q32737R14990Q66175
$$ 580844223 581849158 582721472 583647966 584682822 585634351 586443901 587276638 588191628 589057803
1998.8E89057803P96914Q62479R33290Q14557P17223Q17477Q96097P89523O95467P70807
$$ 589057803 589854717 590717196 591650486 592465043 593182266 593999743 594895840 595685363 596380830 597151637
2019.2E97151637Q22008P39574O78182P51793P90000P08878O82295P79211Q08656O99163
$$ 597151637 597973645 598713219 599391401 600143194 600933194 601642072 602324367 603103578 603912234 604611397
2039.6F04611397O73294P79629P84516O53982O55949P80165P71344O54042O64294P64906
$$ 604611397 605284691 606064320 606848836 607502818 608158767 608938932 609710276 610364318 611028612 611793518
2060F11793518P39157O37472O51538P45654P15018O29008O78122P57098O87241O01888
$$ 611793518 612532675 613170147 613821685 614567339 615282357 615911365 616589487 617346585 618033826 618635714
2080.3F18635714O59764P18415O54697N79834O14464O57738N88953N08130N53429N90384
$$ 618635714 619295478 620013893 620668590 621248424 621862888 622520626 623109579 623617709 624171138 624761522
2100.7F24761522N03659M38988M72606M97758M19199L53456L90232M22835L89635L73483
$$ 624761522 625265181 625704169 626176775 626674533 627093732 627447188 627837420 628260255 628649890 629023373
2121.1F29023373M05431M07219L58164L42250M00603M03643L41236L62218M27782M01735
$$ 629023373 629428804 629836023 630194187 630536437 630937040 631340683 631681919 632044137 632471919 632873654
2141.5F32873654L59834M05013M34041L93808M12405N48958O60599O59585O47545P08460
$$ 632873654 633233488 633638501 634072542 634466350 634878755 635427713 636088312 636747897 637395442 638103902
2161.9F38103902P42674O94573O78837P21455P25150O63400O66916P45833P42972O48737
$$ 638103902 638846576 639541149 640219986 640941441 641666591 642329991 642996907 643742740 644485712 645134449
2182.3F45134449O30081O96957O93619O33061O29783O69658O37889N69463N73337O10351
$$ 645134449 645764530 646461487 647155106 647788167 648417950 649087608 649725497 650294960 650868297 651478648
2202.7F51478648N61416M84526N28276N78166M91321M27842N34475O01530M79877L95834
$$ 651478648 652040064 652524590 653052866 653631032 654122353 654550195 655084670 655686200 656166077 656561911
2223.1F56561911M97460N54681M56035M28319N27621N52237M63843M65274N63562N55098
$$ 656561911 657059371 657614052 658070087 658498406 659026027 659578264 660042107 660507381 661070943 661626041
2243.5F61626041M40061M39107N53191N42522M21047M41491N93186N70953M05788M22239
$$ 661626041 662066102 662505209 663058400 663600922 664021969 664463460 665056646 665627599 666033387 666455626
2263.9F66455626N75960N34594L76404M11152N26607M70639L24487L48509M88102M68254
$$ 666455626 667031586 667566180 667942584 668353736 668880343 669350982 669675469 670023978 670512080 670980334
2284.3F70980334L44575M20928N83410M87804L08514L85761N53489M89652L68715N06401
$$ 670980334 671324909 671745837 672329247 672817051 673125565 673511326 674064815 674554467 674923182 675429583
2304.7F75429583P07745O23822M58241N46694O99222O70671O43850P69317P66337N46634
$$ 675429583 676137328 676761150 677219391 677766085 678465307 679135978 679779828 680549145 681315482 681862116
2325.1F81862116M86016O74784O50168L48270L23713N62965N53608K43485l6657k84910
$$ 681862116 682348132 683022916 683673084 684021354 684345067 684908032 685461640 685705125 685668468 685383558
2345.5F85383558k88605K11834R80974J550674J437485Q42512L82602K19345p2598
$$ 685383558 685094953 685306787 686287761 687838435 689275920 690118432 690501034 690720379 690647781
2363.8F90647781m86195n54979l94464m99010o70314n18381l12448l73184m43817j99854
$$ 690647781 690161586 689606607 689212143 688713133 688042819 687524438 687211990 686838806 686394989 686195135
2384.2F86195135J13964J31548R358J05261K99335K24292L8207J19507K52187J02938
$$ 686195135 686309099 686440647 686450005 686555266 686854601 687078893 687117100 687236607 687488794 687591732
2404.6F87591732m6015Q8632K06828K8551j24932L0816J65641j8179k02656p8082K3961
$$ 687591732 687545717 687634349 687841177 687869728 687744796 687775612 687941253 687923074 687720418 687642336 687666297
2427.1F87666297j50979k81989j67728j23202l26515m41312l18408l07322n41866o75917
$$ 687666297 687515318 687233329 687065601 686942399 686615884 686174572 685856164 685548842 685006976 684331059
2447.5F84331059n93066o47664r47952j121521j096070j238286j586020j804471j864136
$$ 684331059 683737993 683090329 682142377 681020856 679924786 678686500 677100480 675296009 673431873
2465.8F73431873k103805k541125k844572l012955l366828l850162m137337m268230
$$ 673431873 671328068 668786943 665942371 662929416 659562588 655712426 651575089 647306859
2482.1F47306859m475295m714549m746914m587650m458487m278958l830731l313839
$$ 647306859 642831564 638117015 633370101 628782451 624323964 620045006 616214275 612900436
2498.5F12900436l027618k858281k605081k453267k643288k969384l130018l108740
$$ 612900436 609872818 607014537 604409456 601956189 599312901 596343517 593213499 590104759
2514.8E90104759k943278k496659j726747r01341k49446L67880J134276J891375K427876
$$ 590104759 587161481 584664822 582938075 582036734 581787288 582155168 583289444 585180819 587608695
2533.1E87608695K808452L129184L237903L086388K958596L090084L350317L451288
$$ 587608695 590417147 593546331 596784234 599870622 602829218 605919302 609269619 612720907
2549.4F12720907L362834L177405K859830K446056K118647J912892J701772J458645
$$ 612720907 616083741 619261146 622120976 624567032 626685679 628598571 630300343 631758988
2565.8F31758988J313865J266480J107454Q44419O82771O66738O34968N06520M35710
$$ 631758988 633072853 634339333 635446787 636291206 636973977 637640715 638275683 638782203 639217913
2584.1F39217913M61936M12583K99216K89500L56316L57568L18349L56257M22716M42624
$$ 639217913 639679849 640092432 640391648 640681148 641037464 641395032 641713381 642069638 642492354 642934978
2604.5F42934978M86135O15836P63297Q34346R01162J056254J190364J208187J235306
$$ 642934978 643421113 644036949 644800246 645634592 646535754 647592008 648782372 649990559 651225865
2622.9F51225865J353562J418590J356900J326263J395524J442790J415610J385093
$$ 651225865 652579427 653998017 655354917 656681180 658076704 659519494 660935104 662320197
2639.2F62320197J382410J315236J168430J074851J021921Q62778O61850N85079N50925
$$ 662320197 663702607 665017843 666186273 667261124 668283045 669145823 669807673 670392752 670943677
2657.5F70943677M25816K65896J67072J18911O0618k7597q9526j00314j29581j56522
$$ 670943677 671369493 671635389 671802461 671921372 671981990 671954393 671864867 671764553 671634972 671478450
2677.9F71478450j31607j20818j70708k28942k32934k18630k33949k52366k61664k77817
$$ 671478450 671346843 671226025 671055317 670826375 670593441 670374811 670140862 669888496 669626832 669349015
2698.3F69349015l05474l18825l04759l12805l50475l56078l24786l40760m06861m26412
$$ 669349015 669043541 668724716 668419957 668107152 667756677 667400599 667075813 666735053 666328192 665901780
2718.7F65901780l99172m15087m49181l74317k82824l44038m35590m18067l90947m12703
$$ 665901780 665502608 665087521 664638340 664264023 663981199 663637161 663201571 662783504 662392557 661979854
2739.1F61979854m02331l56555l75033m59730m77493m17650l87788m46558n20527m85778
$$ 661979854 661577523 661220968 660845935 660386205 659908712 659491062 659103274 658656716 658136189 657650411
2759.5F57650411m38630n11051n84900n67615n84245o73353p14660o48081o04034o84023
$$ 657650411 657211781 656700730 656115830 655548215 654963970 654290617 653575957 652927876 652323842 651639819
2779.9F51639819p48277p43568q28564r89496r90034q84830r26197j069129j094997
$$ 651639819 650891542 650147974 649319410 648329914 647339880 646455050 645528853 644459724 643364727
2798.3F43364727j012921j057327j225113j316607j325965j354278j412749j468539
$$ 643364727 642351806 641294479 640069366 638752759 637426794 636072516 634659767 633191228
2814.6F33191228j545489j671433j785934j837969j889050k002299k157569k321184
$$ 633191228 631645739 629974306 628188372 626350403 624461353 622459054 620301485 617980301
2830.9F17980301k512097k794266l162563l501415l903866m562974n295872n627215
$$ 617980301 615468204 612673938 609511375 606009960 602106094 597543120 592247248 586620033
2847.2E86620033n081952l737092k350986j506328j220525j241803j368821j613438
$$ 586620033 581538081 577800989 575450003 573943675 572723150 571481347 570112526 568499088
2863.5E68499088j981139k280950k386630k332151k098143j757860j506567j394809
$$ 568499088 566517949 564236999 561850369 559518218 557420075 555662215 554155648 552760839
2879.9E52760839j375138j385510j374603j341283j286745j247704j225770j124680
$$ 552760839 551385701 550000191 548625588 547284305 545997560 544749856 543524086 542399406
2896.2E42399406j001775r98080j065433j190304j475156j953423k545476l076613
$$ 542399406 541397631 540399551 539334118 538143814 536668658 534715235 532169759 529093146
2912.5E29093146l301441l010750k262652j385033o55413p2837M22418Q35836J226127
$$ 529093146 525791705 522780955 520518303 519133270 518477857 518405020 518827438 519663274 520889401
2930.8E20889401J554847J750648J855374J895248J842738J724720J558065J347721
$$ 520889401 522444248 524194896 526050270 527945518 529788256 531512976 533071041 534418762
2947.2E34418762J051962O53923L71575L06726L39746M30644O05821Q46803J048208
$$ 534418762 535470724 536124647 536496222 536802948 537142694 537573338 538179159 539025962 540074170
2965.5E40074170J179218J290262J324653J305342J314402J261234J178503J206219
$$ 540074170 541253388 542543650 543868303 545173645 546488047 547749281 548927784 550134003
2981.8E50134003J240373J140237J006782R21905Q74460R22679R93371J032055J059413
$$ 550134003 551374376 552514613 553521395 554443300 555317760 556240439 557233810 558265865 559325278
3000.2E59325278J036763J048088J063705R33945P61628P14242P33793O78539N34416
$$ 559325278 560362041 561410129 562473834 563407779 564169407 564883649 565617442 566295981 566830397
3018.5E66830397L55422J25349r0719j98423k87056m16935n34177n57959n48780o95467
$$ 566830397 567185819 567311168 567220449 567022026 566734970 566318035 565783858 565225899 564677119 563981652
3038.9E63981652q66055q39234p49290p84278r09745r49860q93950r26495j010656
$$ 563981652 563115597 562276363 561527073 560742795 559833050 558883190 557989240 557062745 556052089
3057.3E56052089j014889j007616j052439j097203j034200r04679q98480j021207j130521
$$ 556052089 555037200 554029584 552977145 551879942 550845742 549941063 549042583 548021376 546890855
3075.6E46890855j128733j033902r68576r81092j001358j026810j042962r79244r42052
$$ 546890855 545762122 544728220 543759644 542778552 541777194 540750384 539707422 538728178 537786126
3094E37786126j019060j118005j131892j086235j112282j207769j238764j181781j208126
$$ 537786126 536767066 535649061 534517169 533430934 532318652 531110883 529872119 528690338 527482212
3112.4E27482212j347125j390815j308083j232148j230955j300871j397729j453519
$$ 527482212 526135087 524744272 523436189 522204041 520973086 519672215 518274486 516820967
3128.7E16820967j429558j422941j512409j612246j622915j567185j545250j582265
$$ 516820967 515391409 513968468 512456059 510843813 509220898 507653713 506108463 504526198
3145E04526198j641452j719058j788735j759023j667678j688361j784176j828641j836121
$$ 504526198 502884746 501165688 499376953 497617930 495950252 494261891 492477715 490649074 488812953
3163.4D88812953j826375j832217j876533j904220j903027j906991j899779j881599
$$ 488812953 486986578 485154361 483277828 481373608 479470581 477563590 475663811 473782212
3179.7D73782212j921565j991689k004564j963705j913488j905590j947045j973540
$$ 473782212 471860647 469868958 467864394 465900689 463987201 462081611 460134566 458161026
3196D58161026j962334j940846j900911j855672j851112j871228j876563j893222j903325
$$ 458161026 456198692 454257846 452356935 450501263 448650151 446778923 444902360 443009138 441105813
3214.3D41105813j873076j872271j884133j865238j861066j873284j874030j870215
$$ 441105813 439232737 437360466 435476333 433611095 431750029 429876745 428002715 426132500
3230.7D26132500j855075j811892j796484j819402j822621j810818j801640j783490
$$ 426132500 424277425 422465533 420669049 418849647 417027026 415216208 413414568 411631078
3247D11631078j781404j790762j792700j800060j778871j756101j769990j754910j714617
$$ 411631078 409849674 408058912 406266212 404466152 402687281 400931180 399161190 397406280 395691663
3265.3C95691663j716852j723230j683414j627415j572699j537233j533419j516491
$$ 395691663 393974811 392251581 390568167 388940752 387368053 385830820 384297401 382780910
3281.6C82780910j484037j455843j446098j451523j417696j382470j389027j372456
$$ 382780910 381296873 379841030 378394932 376943409 375525713 374143243 372754216 371381760
3298C71381760j348108j372576j380742j357019j350283j342863j386285j469791j475006
$$ 371381760 370033652 368661076 367280334 365923315 364573032 363230169 361843884 360374093 358899087
3316.3C58899087j467884j551717j622320j608431j615137j674771j724631j742899
$$ 358899087 357431203 355879486 354257166 352648735 351033598 349358827 347634196 345891297
3332.6C45891297j744121j759649j771152j751691j728773j720011j678646j599043
$$ 345891297 344147176 342387527 340616375 338864684 337135911 335415900 333737254 332138211
3348.9C32138211j553298j562654j596720j605004j573771j565218j594484j595914
$$ 332138211 330584913 329022259 327425539 325820535 324246764 322681546 321087062 319491148
3365.3C19491148j530528j423508j367420j373291j328915j216084j114309j062691
$$ 319491148 317960620 316537112 315169692 313796401 312467486 311251402 310137093 309074402
3381.6C09074402j023352r90361r18806p75695p00652p23154p10785o46293n51671
$$ 309074402 308051050 307060689 306141883 305366188 304665536 303942382 303231597 302585304 302033633
3399.9C02033633m84347n09680m89652l66270k65479k21760j53511p8291l1412J0699
$$ 302033633 301549286 301039606 300549954 300183684 299918205 299696445 299542934 299464643 299433231 299443930
3420.3B99443930L8326J26749K83868L88562L95358M75675O37144O94334O82294P09922
$$ 299443930 299482256 299609005 299892873 300281435 300676793 301152468 301789612 302483946 303166240 303876162
3440.7C03876162P92235R18120J047313J099378J139134J188099J211644J296729J409530
$$ 303876162 304668397 305586517 306633830 307733208 308872342 310060441 311272085 312568814 313978344
3459.1C13978344J430840J454740J538366J588405J595169J583636J611799J682102
$$ 313978344 315409184 316863924 318402290 319990695 321585864 323169500 324781299 326463401
3475.4C26463401J772583J801818J772941J787781J874328J958013J968532K005726
$$ 326463401 328235984 330037802 331810743 333598524 335472852 337430865 339399397 341405123
3491.7C41405123K053917K077699K141684K219826K222091K188533K200216K294571
$$ 341405123 343459040 345536739 347678423 349898249 352120340 354308873 356509089 358803660
3508C58803660K394408K421587K436102K447128K485186K546608K638638K687395K700865
$$ 358803660 361198068 363619655 366055757 368502885 370988071 373534679 376173317 378860712 381561577
3526.4C81561577K792508K866149K844602K868473K947509K947957K999097L157466
$$ 381561577 384354085 387220234 390064836 392933309 395880818 398828775 401827872 404985338
3542.7D04985338L266514L201812L110826L183574L351539L404349L374607L447592
$$ 404985338 408251852 411453664 414564490 417748064 421099603 424503952 427878559 431326151
3559D31326151L560930L606737L735602M029274L931761L643036L749817L982127M079819
$$ 431326151 434887081 438493818 442229420 446258694 450190455 453833491 457583308 461565435 465645254
3577.4D65645254M157990M225433M199832M332096M707128M630386M186422M254907
$$ 465645254 469803244 474028677 478228509 482560605 487267733 491898119 496084541 500339448
3593.7E00339448M520953M504979M479885M470587M354298M406094M717827M669905
$$ 500339448 504860401 509365380 513845265 518315852 522670150 527076244 531794071 536463976
3610E36463976M380822M354060M273057M364908M526078M101336L729642L857970M500449
$$ 536463976 540844798 545198858 549471915 553836823 558362901 562464237 566193879 570051849 574552298
3628.4E74552298M456341L472447L288567L459096L420651L348708L252387L242076
$$ 574552298 579008639 582481086 585769653 589228749 592649400 595998108 599250495 602492571
3644.7F02492571L513336L831804L282130K292156K169072K583266K444803K146483
$$ 602492571 606005907 609837711 613119841 615411997 617581069 620164335 622609138 624755621
3661F24755621K123117K080620K077996K285719K205193J748264J763940J486063Q95262
$$ 624755621 626878738 628959358 631037354 633323073 635528266 637276530 639040470 640526533 641421795
3679.4F41421795R46820J255750J498342J804054J784980J104534O96897P77424Q97526
$$ 641421795 642368615 643624365 645122707 646926761 648711741 649816275 650513172 651290596 652188122
3697.7F52188122R64284R29773O77645N68629Q28445J026332P17461K20180J76251
$$ 652188122 653152406 654082179 654759824 655328453 656156898 657183230 657900691 658120871 658297122
3716.1F58297122M44054O41406O39915M67599K69472K06828M24147P52449O65367J92046
$$ 658297122 658741176 659382582 660022497 660490096 660759568 660966396 661390543 662142992 662808359 663000405
3736.5F63000405j07646p8440J96397N23508L74734K06650K75433r6083k63393P1824
$$ 663000405 662892759 662814319 663010716 663534224 663908958 664115608 664391041 664294958 664031565 664103389
3756.9F64103389K37882O9976p570J52767K32577J92702O7293j16884n7876J70648
$$ 664103389 664341271 664411247 664403677 664556444 664789021 664981723 665049016 664932132 664874256 665044904
3777.3F65044904K25782J4365q5831N1439Q7976N1380R5009J25051J62840J76489J82331
$$ 665044904 665270686 665285051 665199220 665250659 665338635 665390015 665485024 665610075 665772915 665949404 666131735
3799.7F66131735K37405K5273j63377j32024j92106j09553J60098L59177K50817O5028
$$ 666131735 666369140 666394413 666231036 666099012 665906906 665797353 665957451 666316628 666567445 666632473
3820.1F66632473l7610k34485k01583n0246L7968J70588J93775J86920J80602q9884
$$ 666632473 666594863 666360378 666158795 666108549 666146517 666317105 666510880 666697800 666878402 666788518
3840.5F66788518l19838l08335k34306m7445K25425M15384O3420n26428m66407l6478
$$ 666788518 666468680 666160345 665926039 665878594 666104019 666519403 666582823 666056395 665589988 665553510
3860.9F65553510K41697J83880p1942j35303m7445j71602k11775j09792K9743J01208
$$ 665553510 665795207 665979087 665907145 665771842 665724397 665552795 665341020 665231228 665260971 665362179
3881.3F65362179o8724j29759j55091j92345q4161j31548j87814o139J19030r894j43528
$$ 665362179 665293455 665163696 665008605 664816260 664732099 664600551 664412737 664406598 664525628 664515734 664372206
3903.7F64372206k00331k71202k29358j07348r1851r0420j9312n9724j57952j34707
$$ 664372206 664171875 663900673 663671315 663563967 663472116 663381696 663362384 663302660 663144708 663010001
3924.1F63010001r2923j10269q8036n5015r7573j37150j49727j48058o7353p1228j49906
$$ 663010001 662917078 662806809 662718773 662663758 662566185 662429035 662279308 662131250 662063897 661992669 661842763
3946.5F61842763p2300l3677j14321j10031n1379j5557k6762o8784n7518l2783o4730
$$ 661842763 661770463 661736786 661622465 661512434 661461055 661445498 661418736 661349952 661292434 661259651 661194921
3969F61194921n9844K98N186n2571p4327j8478J0372n0664j01328o4492O139K7299
$$ 661194921 661135077 661135375 661140561 661087990 661013663 660995185 661005557 660954893 660853565 660789073 660795212 660822511
3993.4F60822511J0073j9610
$$ 660822511 660832584 660812974
3997.5F60812974
$$ 660812974
##END=$$ End of the data block
