##TITLE=$$ Begin of the data block
##JCAMP-DX=5.00 $$ ACD/SpecManager v 10.08
##SPECTROMETER/DATA SYSTEM=Alpha
##DATE=11 Jun 2014 19:36:16
##DATA TYPE=INFRARED SPECTRUM
##DATA CLASS=XYDATA
##ORIGIN=
##OWNER=
##NPOINTS=1765
##FIRSTX=399.75695801
##LASTX=3997.56933594
##MAXX=3997.56933594
##MINX=399.75695801
##MAXY=0.71634674
##MINY=0.04075948
##XFACTOR=1.0000000000
##YFACTOR=1.000000000000000e-9
##FIRSTY=0.31025124
##DELTAX=2.03957629
##XUNITS=1/CM
##YUNITS=ARBITRARY UNITS
##XYDATA=(X++(Y..Y))
399.8C10251236Q973718Q495867R035021R149969Q897692R081691Q863986P543653
416.1C80292833P486731Q533001P802426P095814O462962N509197N450577O023407
432.4D34656948N995691N243450M762918M859507N190730M957736L933012L277391
448.7D72877383L625185L962785L196686K184957K042830K520263K773643K284676
465D95468408J495540J447976K309292L265739L245532K740026K923488L486991L568650
483.4E19951642K936840K131641K053678K770781L038704K141238J036823R78589J970589
501.7E39010525K323806J199305J87695N57006J381754J194239M9114p12156j62542
520.1E45028746Q66711R75132N1081n79595k7120R83715J443147J142860P16686J087904
$$ y = [310251236, 319224954, 327720821, 336755842, 345905811, 354803503, 363885194, 372749180, 380292833, 387779564, 396312565, 404114991, 411210805, 417673767, 423182964, 428633541, 434656948, 440652639, 445896089, 450659007, 455518514, 460709244, 465666980, 469599992, 472877383, 476502568, 480465353, 483662039, 485846996, 487889826, 490410089, 493183732, 495468408, 496963948, 498411924, 500721216, 503986955, 507232487, 509972513, 512896001, 516382992, 519951642, 522888482, 525020123, 527073801, 529844582, 532883286, 535024524, 536061347, 537039936, 539010525, 541334331, 542533636, 542721331, 543278337, 544660091, 545854330, 545903444, 545191288, 545028746, 545895457, 546870589, 546921670, 546342075, 546314955, 547298670, 548741817, 549884677, 550601363, 551689267]
540.5E51689267J923978J827240P19905q5353K49683R21727O57081l74794r03666k76506
560.9E56348562O20246O40571j50621q41438o75559M1425L07500r7573k78353M95672
581.3E56410432J609802J821399J152813O07670P40647J134932R50158M8816p94709
599.6E63681960p92205n03719r21965j603901j510918n69463M27425P40528M80354
618E59428096M99725J139701J767933J637399R36985O46472J208842J997173K101540
636.3E71363866J372934P78198R79781J278699R26315P5043n19395m26293j85847l90589
656.7E75252712r25541j164794p23660l74973j063287j342595P6175O74903P37667
675.1E71146607N83113P4982l42786l65257k94268p11739j735569k802133l579378
$$ y = [551689267, 553613245, 555440485, 556160390, 556075037, 556324720, 557246447, 557903528, 557528734, 556625068, 556348562, 556968808, 557609379, 557458758, 556617320, 555941761, 555983186, 556290686, 556193113, 555914760, 556410432, 558020234, 559841633, 560994446, 561602116, 562342763, 563477695, 564427853, 564476669, 563681960, 562889755, 562386036, 561464071, 559860170, 558349252, 557779789, 558207214, 558947742, 559428096, 559927821, 561067522, 562835455, 564472854, 565409839, 566056311, 567265153, 569262326, 571363866, 572736800, 573514998, 574494779, 575773478, 576699793, 576774836, 576255441, 575829148, 575643301, 575252712, 574327171, 573162377, 572438717, 572063744, 571000457, 569657862, 569734037, 570408940, 571146607, 571729720, 571804702, 571461916, 571096659, 570802391, 570090652, 568355083, 565552950, 561973572]
693.5E61973572m471362n812168o664395o796658p863641r968639j1607885j1917859
709.8D96870965r855896n476654j586825M53413L081918P553815J2451321J6386450
726.1E19878507J8418491J8145263J6174853J3504326J0703325P955015N631208L924311
742.4F14335299K689659J883149J402617Q71539K46882m7922L0160Q3625o9737k38776
762.8F21186495j98484J51813N92888P65323O55473N54025O81519R24886J016140Q44121
783.2F27174199N22613K69890J93596J19150n1558k21551k73943k4736L36528L21269
803.6F28365457p5221m19497n08786m74989o94037j245796j592696j494288j366318
821.9F20493829j615405k263784k940834l190279l262102l763915m831910o052255
$$ y = [561973572, 557502210, 551690042, 545025647, 538228989, 530365348, 520396709, 508788824, 496870965, 487015069, 481538415, 479951590, 480405003, 483486921, 491040736, 503492057, 519878507, 538296998, 556442261, 572617114, 586121440, 596824765, 604779780, 610410988, 614335299, 617024958, 618908107, 620310724, 621182263, 621429145, 621381223, 621411383, 621495008, 621425271, 621186495, 620988011, 621139824, 621732712, 622498035, 623153508, 623707533, 624389052, 625313938, 626330078, 627174199, 627696812, 627966702, 628160298, 628279448, 628227890, 628006339, 627732396, 627707660, 628044188, 628365457, 628290236, 627870739, 627361953, 626886964, 626192927, 624947131, 623354435, 621860147, 620493829, 618878424, 616614640, 613673806, 610483527, 607221425, 603457510, 598625600, 592573345]
838.3E92573345p142067q523345j1260152j4118016j2068570o836414o833970j1113942
854.6E14676869j3645470j5250802j8841386k5187820l5495729n1402062o6404968
868.9B88448632o3229367l8810745j2436539O298035K3982942M2246074N6549221O4926565
885.2C67974818O5975427N7637126M3117731K9548884K0371914J4433026J0260284
899.4F09319210P588089O124258N004525L638267K320707J638591J587928J387775
915.8F38609350N19395n13852r01103o14643l73006o93440j173258j003504k30610
934.1F33625329K49803l3737n13136m57823M3511J32382o76751j777470k343059k386868
954.5F25862181k592921l368437m284442m622102m428386m474104n183816o105661
$$ y = [592573345, 585431278, 576907933, 565647781, 551529765, 539461195, 532624781, 525790811, 514676869, 501031399, 485780597, 466939211, 441751391, 406255662, 354853600, 288448632, 225219265, 186408520, 173971981, 180270016, 204252958, 246499032, 303048253, 367974818, 433950245, 491587371, 534705102, 564253986, 584625900, 599058926, 609319210, 616907299, 623031557, 628036082, 631674349, 633995056, 635633647, 637221575, 638609350, 639128745, 638614893, 637713790, 637099147, 636726141, 636032701, 634859443, 633855939, 633625329, 633875132, 633841395, 633328259, 632870436, 632913947, 633046329, 632369578, 630592108, 628249049, 625862181, 623269260, 619900823, 615616381, 610994279, 606565893, 602091789, 596907973, 590802312]
970.8E90802312o624580o819725p379710q624077r943664j0558605j0459662j0223329
987.1E20168960j0161519j0006070r312511q188515p239789o843120o812841o799340
1003.5D54805255o857187p265776p953048q429497q281499p464022o291091n124003
1019.8C97139132l927112k487480r62764K18659Q37148J065969J222700J381904J334101
1038.1C95822257Q66115J68174k55614k13474L2663L39985R23485J938879L157318
1056.5D02779788M136532M583240M357397L459871J901359k92302k757191m687518
1072.8D13481176n236536m350156k940178j559377L15756K508223M060596M918218
1089.1D11197722N256474M811466L626018K183766R14752P4357j42038K33769R00686
$$ y = [590802312, 584177732, 577358007, 569978297, 561354220, 551410556, 540851951, 530392289, 520168960, 510007441, 500001371, 490688860, 482500345, 475260556, 468417436, 461604595, 454805255, 447948068, 440682292, 432729244, 424299747, 416018248, 408554226, 402263135, 397139132, 393212020, 390724540, 389761776, 389980435, 390817583, 391883552, 393106252, 394488156, 395822257, 396688372, 396856546, 396600932, 396387458, 396420121, 396760106, 397683591, 399622470, 402779788, 406916320, 411499560, 415856957, 419316828, 421218187, 420925885, 418168694, 413481176, 408244640, 403894484, 400954306, 399394929, 399710685, 402218908, 406279504, 411197722, 416454196, 421265662, 424891680, 427075446, 427990198, 428064555, 427922517, 428156286, 429056972]
1107.5D29056972J537621J933337K098947K108574J932264J612931J286119J061857
1123.8D42628622R89467J052946J080513P50214m6730r89408j828432k548516l081232
1142.2D38007444l300935l099114k578467j981765j407295p54446Q0824J139939K391815
1160.5D28498000L591925M477083M895062M813701M408031L880859L368944K965152
1176.8D60898757K621829K202005J591205Q09402l577p64698j405507j934141k392918
1195.2D61622357k654194k647937k478778k255231k023071j837045j750142j813084
1211.5D44162875k057969k431065k828091l122032l301114l418624l488064l498525
1227.8D20017391l477662l428430l299296l107279k934456k847612k795905k714097
$$ y = [429056972, 430594593, 432527930, 434626877, 436735451, 438667715, 440280646, 441566765, 442628622, 443618089, 444671035, 445751548, 446501762, 446455032, 445465624, 443637192, 441088676, 438007444, 434706509, 431607395, 429028928, 427047163, 425639868, 424885422, 424966246, 426106185, 428498000, 432089925, 436567008, 441462070, 446275771, 450683802, 454564661, 457933605, 460898757, 463520586, 465722591, 467313796, 468123198, 468119621, 467354923, 465949416, 464015275, 461622357, 458968163, 456320226, 453841448, 451586217, 449563146, 447726101, 445975959, 444162875, 442104906, 439673841, 436845750, 433723718, 430422604, 427003980, 423515916, 420017391, 416539729, 413111299, 409812003, 406704724, 403770268, 400922656, 398126751, 395412654]
1244.1C95412654k603293k545446k564669k617597k676815k761722k867728k909422
1260.4C73865962k893031k881556k903611k935141l044814l184080l275186l376991
1276.8C49371552l496795l557653l519863l530502l636658l810734m018217m205942
1293.1C19595188m316181m425764m591584m747928m841297m846454m852831m861504
1309.4B82111645m913152m911780m757017m632801m647463m706293m828245n020142
1325.7B43694752n199551n361423n378053n265608n235955n475760n632996n375207
1342B00770199n188763n319685n505621n640358n749196n793452n759239n653694n760491
1360.4A50399700o073430n891219n432651n419001n373507n327873n432457n090214
$$ y = [395412654, 392809361, 390263915, 387699246, 385081649, 382404834, 379643112, 376775384, 373865962, 370972931, 368091375, 365187764, 362252623, 359207809, 356023729, 352748543, 349371552, 345874757, 342317104, 338797241, 335266739, 331630081, 327819347, 323801130, 319595188, 315279007, 310853243, 306261659, 301513731, 296672434, 291825980, 286973149, 282111645, 277198493, 272286713, 267529696, 262896895, 258249432, 253543139, 248714894, 243694752, 238495201, 233133778, 227755725, 222490117, 217254162, 211778402, 206145406, 200770199, 195581436, 190261751, 184756130, 179115772, 173366576, 167573124, 161813885, 156160191, 150399700, 144326270, 138435051, 133002400, 127583399, 122209892, 116882019, 111449562, 106359348]
1376.7A06359348m767113m717856m540377m335187m416287m292019l791019l778584
1393G1720906m040905l812074l551629l250751k896440k808138k499879k066217j765002
1411.4D5029871j483235j184214r41143n82553p9245K48097M83461O54224P79458Q51940
1431.8D3776661Q30557Q36566R28697Q07549O37737N35354M65862M36794L92903L41620
1452.2D9990300K60979K61743N07455O95966O44688O88258Q40556Q68544Q72888J128755
1472.6E6760132J475621J555473J562595J612250J749516J831263J974985K356879
1488.9G0878714K770998K721257K771847L382817L719144L505692L050901L246471
1505.2I6047841M619069M608438L873028L736078L796980L986471M052408M498280
$$ y = [106359348, 101592235, 96874379, 92334002, 87998815, 83582528, 79290509, 75499490, 71720906, 67680001, 63867927, 60316298, 57065547, 54169107, 51360969, 48861090, 46794873, 45029871, 43546636, 42362422, 41421279, 40838726, 40759481, 41007578, 41491039, 42145263, 42924721, 43776661, 44607218, 45443784, 46372481, 47180030, 47817767, 48353121, 48818983, 49255777, 49648680, 49990300, 50251279, 50513022, 51020477, 51716443, 52361131, 53049389, 53889945, 54758489, 55631377, 56760132, 58235753, 59791226, 61353821, 62966071, 64715587, 66546850, 68521835, 70878714, 73649712, 76370969, 79142816, 82525633, 86244777, 89750469, 92801370, 96047841, 100666910, 105275348, 109148376, 112884454, 116681434, 120667905, 124720313, 129218593]
1521.5A29218593M640535M286438M428074M199013M113942M660130M307791L708765
1537.8A63563281M866585N959675N531043N394116N292788N558759N780772N821228
1554.1B07768247N591809P182539R581461P250324O142214O291479O368339O667942
1570.5B62844354N703300M920423N588472N352140M542619M279464M051209L759205
1586.8C01041186L500789L252447K985716K769559K546609K333045K156824K028942
1603.1C22615117J827657J609266J460194J297296R45329N78463O68258Q19683M88490
1621.4C32309753K21282L35067L70533M30912M46230J90615K81543J095265J405835
1639.8C37087035J268238J069009J125425J787067J800805J632065K881318L391564
$$ y = [129218593, 133859128, 138145566, 142573640, 146772653, 150886595, 155546725, 159854516, 163563281, 168429866, 174389541, 179920584, 185314700, 190607488, 196166247, 201947019, 207768247, 213360056, 220542595, 230124056, 237374380, 243516594, 249808073, 256176412, 262844354, 268547654, 273468077, 279056549, 284408689, 288951308, 293230772, 297281981, 301041186, 304541975, 307794422, 310780138, 313549697, 316096306, 318429351, 320586175, 322615117, 324442774, 326052040, 327512234, 328809530, 329754859, 330333322, 331001580, 331821263, 332309753, 332531035, 332866102, 333236635, 333667547, 334113777, 334304392, 334585935, 335681200, 337087035, 338355273, 339424282, 340549707, 342336774, 344137579, 345769644, 348650962, 352042526]
1656.1C52042526K919316K814204L175258L627867L380179L360182M025549M019559
1672.4C79364640M061102M475952M132628L529072L538072M954874N340785M568637
1688.8D13965762M502087M130006M132361M523992M579961N400896M925669M137188
1705.1D50297922M266083L938705L369599K881200K621710L175855L769189L323078
1721.4D77643341K862990K705097K409100K125025J852006K190471K960026K667904
1737.7D97415960K487898K751529K803385K699793K588868K800345L167391K866268
1754E19581437K468586K353251K114952K151072K201914J791776J386940J110792J180232
1772.4E36340952J385152R09150J00195n14567r29474j423181j832962k123534k615929
$$ y = [352042526, 354961842, 357776046, 360951304, 364579171, 367959350, 371319532, 375345081, 379364640, 383425742, 387901694, 392034322, 395563394, 399101466, 404056340, 409397125, 413965762, 418467849, 422597855, 426730216, 431254208, 435834169, 441235065, 446160734, 450297922, 454564005, 458502710, 461872309, 464753509, 467375219, 470551074, 474320263, 477643341, 480506331, 483211428, 485620528, 487745553, 489597559, 491788030, 494748056, 497415960, 499903858, 502655387, 505458772, 508158565, 510747433, 513547778, 516715169, 519581437, 522050023, 524403274, 526518226, 528669298, 530871212, 532662988, 534049928, 535160720, 536340952, 537726104, 538635254, 538735449, 538220882, 537291408, 535868227, 534035265, 531911731, 529295802]
1790.7E29295802k596974j701951j096666p20143J17659J191735J954794K474189K976894
1809.1E31895339L585279M041970M188717M281461M265129L881217L447711L367245
1825.4E62954068L132522K948642L060162K745748K320707K225935K011538J500427
1841.7E82899749J449347J979947K089441J828134J562118J397014J433372J503289
1858E96142411J467586J316070J100123R03309J070499J570463J614571J339495J208127
1876.4F07732654J204311J189173J131475J071274R90272J008331J171470J127481
1892.7F16626441R67682J031756J126409J094282R60648Q86976R17912R66251J026451
1911.1F25604808R50098P08700O54935R31025R98437R13620R37164Q86262Q39829Q48413
$$ y = [529295802, 526698828, 524996877, 523900211, 523180068, 523297727, 524489462, 526444256, 528918445, 531895339, 535480618, 539522588, 543711305, 547992766, 552257895, 556139112, 559586823, 562954068, 566086590, 569035232, 572095394, 574841142, 577161849, 579387784, 581399322, 582899749, 584349096, 586329043, 588418484, 590246618, 591808736, 593205750, 594639122, 596142411, 597609997, 598926067, 600026190, 600929499, 601999998, 603570461, 605185032, 606524527, 607732654, 608936965, 610126138, 611257613, 612328887, 613319159, 614327490, 615498960, 616626441, 617594123, 618625879, 619752288, 620846570, 621807218, 622694194, 623612106, 624578357, 625604808, 626554906, 627263606, 627918541, 628849566, 629848003, 630761623, 631698787, 632585049, 633424878, 634273291]
1931.5F34273291P99477P16805P11501O78003O44564P49767Q04544P66933P73489P45833
1951.9F41664207O52492N78642N54681N92172O21915N74827N35846O80983Q59141Q50022
1972.3F48164928P17699N99802N94139O52433O87182O05046M76182M50015N52714O96063
1992.6F54196203O79493N32865M94302N55753N66781N28216M61877M24742M76718N03242
2013F59420192M10974L73900M52757M95434M84824M37856L88086L88562M31896M51088
2033.4F63735569M26054L94225L84211M24922M67062M34696L80099L95179M54664M93288
2053.8F67989969M55380L69787L35515L86893M58479M58181M06742L83854M06027M11451
2074.2F72062278M07219M09484M05550L99768L92556L81530L47256L18051L20196L56793
$$ y = [634273291, 635072768, 635789573, 636501074, 637179077, 637823641, 638573408, 639377952, 640144885, 640918374, 641664207, 642316699, 642895341, 643450022, 644042194, 644664109, 645238936, 645774782, 646455765, 647314906, 648164928, 648882627, 649482429, 650076568, 650729001, 651416183, 652021229, 652497411, 652947426, 653500140, 654196203, 654875696, 655408561, 655902863, 656458616, 657025397, 657553613, 658015490, 658440232, 658916950, 659420192, 659831166, 660205066, 660657823, 661153257, 661638081, 662075937, 662464023, 662852585, 663284481, 663735569, 664161623, 664555848, 664940059, 665364981, 665832043, 666266739, 666646838, 667042017, 667496681, 667989969, 668445349, 668815136, 669150651, 669537544, 669996023, 670454204, 670860946, 671244800, 671650827, 672062278, 672469497, 672878981, 673284531, 673684299, 674076855, 674458385, 674805641, 675123692, 675443888, 675800681]
2094.6F75800681L73185L28421K80977K96235L19242K64406K02656K11835K72513L07917
2115F78658068K78056K15530J81854J99497K34604K41935K22981K21550K19405K33531
2135.4F80907011K49743K38777K31445K38001K74777L01481K78651K78533L51846M20630
2155.8F83770895M25041M07755M19140M27782M21465M22060M46022M86851M65572M47392
2176.2F88139975M74453M56989M35948M55082M52161M37319M21524L83377M04775M59611
2196.6F92521214M25041L38912L32833L80635L71933L19958L04698L48270L79980L67880
2217F96091354L60250L44694K98023L07203L36349L09288K89917K95103L22163L37839
2237.4F99292183L21746K95937K89082L00169K95818K91407K97845K89738K85268L13341
$$ y = [675800681, 676173866, 676502287, 676783264, 677079499, 677398741, 677663147, 677865803, 678077638, 678350151, 678658068, 678936124, 679151654, 679333508, 679533005, 679767609, 680009544, 680232525, 680454075, 680673480, 680907011, 681156754, 681395531, 681626976, 681864977, 682139754, 682441235, 682719886, 682998419, 683350265, 683770895, 684195936, 684603691, 685022831, 685450613, 685872078, 686294138, 686740160, 687227011, 687692583, 688139975, 688614428, 689071417, 689507365, 689962447, 690414608, 690851927, 691273451, 691656828, 692061603, 692521214, 692946255, 693285167, 693618000, 693998635, 694370568, 694690526, 694995224, 695343494, 695723474, 696091354, 696451604, 696796298, 697094321, 697401524, 697737873, 698047161, 698337078, 698632181, 698954344, 699292183, 699613929, 699909866, 700198948, 700499117, 700794935, 701086342, 701384187, 701673925, 701959193, 702272534]
2257.8G02272534L28720L11792K93553K86460K86877L10361L32713L16382K81811K81751
2278.2G05302954L36945L05354J77145J32502J61886J41144P8737O7473R2506P7307
2298.6G06873953J4007o3180j18554j29104j57773k10703j99616j87933k73645l77536
2319G05169916l51727k04682j39952k15828j88470J1444J07229J6749k6405M4107J99735
2341.4G04422116O36757J227319R28760k48671j149118j249731r37163n36859l3200
2359.8G03060210M04477P43151J028239J260758J364708J291632J206458J179814J129389
2378.1G12668836J014888Q07882N80311L97563K70545J76787R4355O2227P8916P3314
2398.5G16225624K8670j0192l1054K443P2658N8592l4273p0333n2274n3823p6890j15096
$$ y = [702272534, 702601254, 702913046, 703206599, 703493059, 703779936, 704090297, 704423010, 704739392, 705021203, 705302954, 705639899, 705945253, 706122398, 706254900, 706416786, 706557930, 706636667, 706704140, 706796646, 706873953, 706887960, 706824780, 706706226, 706577122, 706419349, 706208646, 706009030, 705821097, 705547452, 705169916, 704818189, 704613507, 704473555, 704257727, 704069257, 704080701, 704187930, 704204679, 704178274, 704222381, 704422116, 705058873, 706286192, 707214952, 706966281, 705817163, 704567432, 703630269, 703093410, 703060210, 703464687, 704207838, 705236077, 706496835, 707861543, 709153175, 710359633, 711539447, 712668836, 713683724, 714491606, 715071917, 715469480, 715740025, 715916812, 716011167, 716073394, 716152310, 716225624, 716254294, 716244102, 716213048, 716215491, 716288149, 716346741, 716312468, 716242135, 716189861, 716136038, 716059148, 715944052]
2423G15944052j25885j23084j46925j83165k24352k66493k95996l02136k93792l33130
2443.4G13649094m39882n06401n07891n43535o67691q13961q76844q87096r69291j146853
2463.8G06289649j336336j467943j556695j707256j954496k186238k313853k412974
2480.1F91353858k550304k698422k837777k911747k881526k791286k693594k592623
2496.4F69396579k455711k224982j987815j909077j916170j863182j745224j650631
2512.7F53643787j592994j473844j250327r30547n42999j78635J29164M57286Q38459
2531.1F49099350J216948J499116J632929J701653J801014J905203J959384J944601
2547.4F62760198J911402J894712J823068J634240J378834J186133J091182J024783
$$ y = [715944052, 715818167, 715695083, 715548158, 715364993, 715140641, 714874148, 714578152, 714276016, 713982224, 713649094, 713209212, 712702811, 712194920, 711651385, 710983694, 710169733, 709292889, 708405793, 707436502, 706289649, 704953313, 703485370, 701928675, 700221419, 698266923, 696080685, 693766832, 691353858, 688803554, 686105132, 683267355, 680355608, 677474082, 674682796, 671989202, 669396579, 666940868, 664715886, 662728071, 660818994, 658902824, 657039642, 655294418, 653643787, 652050793, 650576949, 649326622, 648396075, 647853076, 647674441, 647803605, 648260891, 649099350, 650316298, 651815414, 653448343, 655149996, 656951010, 658856213, 660815597, 662760198, 664671600, 666566312, 668389380, 670023620, 671402454, 672588587, 673679769, 674704552]
2563.7F74704552R14693P39574N96225N54800N24223M26114L16977K41757K12848K24531
2584.1F79456294K04980J42097J05203J12533J42336J61707J45972J12951J24693K17676
2604.5F80926442K93732L04818L45469M53531N76139O25014N98311N81623O07729O84261
2624.9F85997069P70271P68602P08103P00116P48336P47860O48677N40912N15521N69641
2645.3F92715108N83887M46976K62797J97053K17795J92106R0718l0756r1672o9261
2665.7F94514751p2121j73032k54989k47777k21789k08497k24292k61605k80320k66195
2686.1F92304134k37524k46108l27527m01080l67701k88904k80380l50416m00900l86894
2706.5F89016700l69489l83974m08470m30226m29690m13478m34994n04077n32567m06683
$$ y = [674704552, 675619245, 676358819, 676955044, 677509844, 678034067, 678460181, 678777158, 679018915, 679231763, 679456294, 679661274, 679803371, 679908574, 680021107, 680163443, 680325150, 680471122, 680584073, 680708766, 680926442, 681220174, 681524992, 681870461, 682323992, 682900131, 683525145, 684123456, 684705079, 685312808, 685997069, 686767340, 687535942, 688244045, 688944161, 689692497, 690440357, 691089034, 691629946, 692145467, 692715108, 693298995, 693745971, 694008768, 694205821, 694423616, 694615722, 694706440, 694675684, 694584012, 694514751, 694442630, 694269598, 694014609, 693766832, 693545043, 693336546, 693112254, 692850649, 692570329, 692304134, 692066610, 691820502, 691492975, 691091895, 690724194, 690435290, 690154910, 689804494, 689403594, 689016700, 688647211, 688263237, 687854767, 687424541, 686994851, 686581373, 686146379, 685642302, 685109735, 684703052]
2726.9F84703052k55346k99037m49538m99964m24623l15249k99394m17829n27561n05447
2747.3F80709064m01080l63826m14610m48168m55379m86076n14507n17488n41568n81383
2767.7F75984979n80311n84364o52611o65486o17326o37829o79672p10308p63655q25465
2788.1F69267952q54373q75473r34779r88543r76265r34183r53734j018942j113474
2806.4F60618186j220524j249552j229286j274705j368582j441122j503586j573444
2822.7F49757385j650572j747429j862526j988470k138436k327740k571404k840698
2839.1F32630110l202975l820002m566372m887819m195392k709329j341641o29902
2855.4F07276678n03540o68287q99136j175642j516164j811206j987875k023518j846850
$$ y = [684703052, 684447706, 684148669, 683699131, 683199167, 682774544, 682459295, 682159901, 681742072, 681214511, 680709064, 680307984, 679944158, 679529548, 679081380, 678626001, 678139925, 677625418, 677107930, 676566362, 675984979, 675404668, 674820304, 674167693, 673502207, 672884881, 672247052, 671567380, 670857072, 670093417, 669267952, 668413579, 667538106, 666603327, 665614784, 664638519, 663704336, 662750602, 661731660, 660618186, 659397662, 658148110, 656918824, 655644119, 654275537, 652834415, 651330829, 649757385, 648106813, 646359384, 644496858, 642508388, 640369952, 638042212, 635470808, 632630110, 629427135, 625607133, 621040761, 616152942, 611957550, 609248221, 607906580, 607276678, 606773138, 606104851, 605205715, 604030073, 602513909, 600702703, 598714828, 596691310, 594844460]
2873.7E94844460j572072j438797j427114j421332j424134j395881j328945j255810
2890.1E83580375j190305j144707j056671r72867j004577j111806j242101j441478
2906.4E74415863j812101k396524l021061l315628l005624k200782j286089n69821
2922.7E56808233j04546J89900M27365P35701J064419J267314J403034J503527J457155
2941E64752102J374185J363516J293957J086712P91609N83828N75125O49452P00355
2959.4E73170841P79330R47476J166820J342178J410842J413285J403809J350641J184225
2977.8E84169447J031578J044154J021266Q44002O98507N86033M81367M78148M31776
2996.1E90786278L24667K74539K11239J53660J01746l4929j78933j72496m0769K4438
$$ y = [594844460, 593272388, 591833591, 590406477, 588985145, 587561011, 586165130, 584836185, 583580375, 582390070, 581245363, 580188692, 579215825, 578211248, 577099442, 575857341, 574415863, 572603762, 570207238, 567186177, 563870549, 560864925, 558664143, 557378054, 556808233, 556703687, 556893587, 557320952, 558056653, 559121072, 560388386, 561791420, 563294947, 564752102, 566126287, 567489803, 568783760, 569870472, 570662081, 571245909, 571821034, 572470486, 573170841, 573950171, 574897647, 576064467, 577406645, 578817487, 580230772, 581634581, 582985222, 584169447, 585201025, 586245179, 587266445, 588110447, 588808954, 589394987, 589876354, 590354502, 590786278, 591110945, 591385484, 591596723, 591750383, 591852129, 591817200, 591638267, 591465771, 591425002, 591449440]
3016.5E91449440l4273j87755l95715n22435n87761p02918q21292q62956p94053p92325
3036.9E85747957r98437j163304j134455j057983j063883j154542j201391j174033
3053.2E76799929j158178j142502j150965j229525j285016j273573j210332j104653
3069.5E67245185j073420j165211j265228j286029j250625j204610j166761j172066
3085.8E57661235j215338j230955j207233j214683j268268j328706j353085j318634
3102.2E47524333j320004j418114j479864j422167j419425j539886j582921j507342
3118.5E35834610j445710j472295j597344j702369j689434j661420j696050j738488
3134.8E22831500j769782j780509j758814j762987j800417j847804j912594j945317
$$ y = [591449440, 591415167, 591227412, 590831697, 590309262, 589721501, 589018583, 588197291, 587334335, 586540282, 585747957, 584749520, 583586216, 582451761, 581393778, 580329895, 579175353, 577973962, 576799929, 575641751, 574499249, 573348284, 572118759, 570833743, 569560170, 568349838, 567245185, 566171765, 565006554, 563741326, 562455297, 561204672, 560000062, 558833301, 557661235, 556445897, 555214942, 554007709, 552793026, 551524758, 550196052, 548842967, 547524333, 546204329, 544786215, 543306351, 541884184, 540464759, 538924873, 537341952, 535834610, 534388900, 532916605, 531319261, 529616892, 527927458, 526266038, 524569988, 522831500, 521061718, 519281209, 517522395, 515759408, 513958991, 512111187, 510198593, 508253276]
3151.1E08253276j931011j940191j954079j932680j958579k043098k065272k028524
3167.4D92399842k012611k018154k059370k101779k075523k031892k058387k131850
3183.7D75910276k145439k070636k014279k043575k092749k079874k007157j962751
3200.1D59493816j974821j999468k028674k017438j946122j927793j974701j962185
3216.4D43662614j893193j870274j897872j913935j916826j904875j854568j783580
3232.7D28627491j776308j831323j843244j843631j848310j808316j783311j799911
3249D14093137j801670j771301j738131j745671j785397j799703j784742j759350j692832
3267.4C98214340j610637j624375j669377j607329j522809j465052j386285j342207
$$ y = [508253276, 506322265, 504382074, 502427995, 500495315, 498536736, 496493638, 494428366, 492399842, 490387231, 488369077, 486309707, 484207928, 482132405, 480100513, 478042126, 475910276, 473764837, 471694201, 469679922, 467636347, 465543598, 463463724, 461456567, 459493816, 457518995, 455519527, 453490853, 451473415, 449527293, 447599500, 445624799, 443662614, 441769421, 439899147, 438001275, 436087340, 434170514, 432265639, 430411071, 428627491, 426851183, 425019860, 423176616, 421332985, 419484675, 417676359, 415893048, 414093137, 412291467, 410520166, 408782035, 407036364, 405250967, 403451264, 401666522, 399907172, 398214340, 396603703, 394979328, 393309951, 391702622, 390179813, 388714761, 387328476, 385986269]
3283.7C85986269j358837j359761j311302j272768j255155j254350j262813j224161
3300C75687122j167059j125186j139611j213908j255930j251519j226663j247824j314222
3318.4C64745200j324535j333236j388729j392424j353502j358599j383155j361192
3334.7C53849828j316070j322538j343399j269549j155883j092822j066625j078010
3351C44204932j051694r61482q90583q76337r14783q96096p54267o70969p45625q20368
3371.4C35622728p69019o62804o11097n96106n86927n51462m86135m03404k97219k75135
3391.8C30383420l69877l79532k18898r8527j70886k74778k06619q8185k1190N8085
3412.2C28613013Q6635O9410J39356K14874J78397K06024L69608M74572M77314N81682
$$ y = [385986269, 384627432, 383267671, 381956369, 380683601, 379428446, 378174096, 376911283, 375687122, 374520063, 373394877, 372255266, 371041358, 369785428, 368533909, 367307246, 366059422, 364745200, 363420665, 362087429, 360698700, 359306276, 357952774, 356594175, 355211020, 353849828, 352533758, 351211220, 349867821, 348598272, 347442389, 346349567, 345282942, 344204932, 343153238, 342191756, 341301173, 340424836, 339510053, 338613957, 337859690, 337188721, 336443096, 335622728, 334853709, 334190905, 333579808, 332983702, 332396775, 331845313, 331359178, 330955774, 330658555, 330383420, 330013543, 329634011, 329415113, 329316586, 329145700, 328870922, 328664303, 328576118, 328554928, 328613013, 328699648, 328769058, 328908414, 329123288, 329301685, 329507709, 329877317, 330351889, 330829203, 331410885]
3432.6C31410885O90967N74708M22984M60416N92888P00503Q16941Q84176Q92728R32902
3453C38380098R98766J104593J218706J208902J182317J266182J328796J286536J206577
3471.3C49181473J234889J360685J450926J464635J471549J503051J562386J625956
3487.6C60855550J673430J705974J689047J714021J757919J760811J788795J831144
3504C74776691J842022J906961K050728K163231K130509K012908K012134K079963K145738
3522.3C93120885K140760K111584K249390K439857K476781K479643K533048K469927
3538.6D12021875K396047K459944K629548K770007K710879K651840K802998K900422
3554.9D33343560K875983K877385K815604K600074K631992L420830L886938L412753
$$ y = [331410885, 332101852, 332676560, 333099544, 333559960, 334152848, 334853351, 335670292, 336554468, 337447196, 338380098, 339378864, 340483457, 341702163, 342911065, 344093382, 345359564, 346688360, 347974896, 349181473, 350416362, 351777047, 353227973, 354692608, 356164157, 357667208, 359229594, 360855550, 362528980, 364234954, 365924001, 367638022, 369395941, 371156752, 372945547, 374776691, 376618713, 378525674, 380576402, 382739633, 384870142, 386883050, 388895184, 390975147, 393120885, 395261645, 397373229, 399622619, 402062476, 404539257, 407018900, 409551948, 412021875, 414417922, 416877866, 419507414, 422277421, 424988300, 427640140, 430443138, 433343560, 436219543, 439096928, 441912532, 444512606, 447144598, 450565428, 454452366, 457865119]
3571.3D57865119L127277L264457L396928L442139L332227L028482L008992L696561
3587.6D84162182M003226L375173L231734L632337L705650L685058L776133L491342
3603.9E13062835L153562L483117L775954L551543L357947L067910L284812M123986
3620.2E40861666L891885K919853K646625M161775N415500M158437L449797L509045
3636.5E71014583L401578L305375K932310K171219K086877L771842M851460L330112
3652.8E96865356K489746L257453L250182K486169K137899J663685J186967J830578
3669.2F15168035K439261J616001K211928L150642K120912J372397Q33511K19465N35190
3687.5F29667342J513123J453459P32184M54724M58717P07984J438975J654089Q64446
$$ y = [457865119, 460992396, 464256853, 467653781, 471095920, 474428147, 477456629, 480465621, 484162182, 488165408, 491540581, 494772315, 498404652, 502110302, 505795360, 509571493, 513062835, 516216397, 519699514, 523475468, 527027011, 530384958, 533452868, 536737680, 540861666, 544753551, 547673404, 550320029, 554481804, 559897304, 564055741, 567505538, 571014583, 574416161, 577721536, 580653846, 582825065, 584911942, 588683784, 593535244, 596865356, 599355102, 602612555, 605862737, 608348906, 610486805, 612150490, 613337457, 615168035, 617607296, 619223297, 621435225, 624585867, 626706779, 628079176, 628912687, 629132152, 629667342, 631180465, 632633924, 633366108, 633820832, 634279549, 634987533, 636426508, 638080597, 638945043]
3705.9F38945043M14908R98795K096117J910746P14123J24872J47223L73364O12497
3724.2F46337688P26998L40223l24428l79920N61595J623571J014352o45697r30369
3742.6F48324013P61926R63449q8870Q62956J544893M02212j45137M30345P05183P6651
3763F53837621j69396J03354N04315Q19862L71695k20836j91807K65360L47852N5313
3783.4F55723333J60396L14415J94251m5418m19319n11110l87966j36674O95288N17130
3803.8F56104326o795O73712L96371p29979q91804n1678N5433n3942Q77380N98133
3824.2F56971157q8692j50383l52621l97384l84450j76549N36025P23064M53233L04163
3844.6F57437563k74718j236141j657009J15753K348661Q03709p70152p89702k43425
$$ y = [638945043, 639359951, 640358746, 642454863, 644365609, 645079732, 645204604, 645351827, 645725191, 646337688, 647064686, 647404909, 647080481, 646700561, 647262156, 648885727, 649900079, 649254382, 648324013, 649085939, 650049388, 649960518, 650823474, 652368367, 652770579, 652625442, 653055787, 653760970, 653837621, 653668225, 653771579, 654275894, 655095756, 655467451, 655246615, 655054808, 655320168, 655668020, 655723333, 655883729, 656198144, 656392395, 656346977, 655927658, 655416548, 655028582, 654891908, 655587196, 656104326, 656097531, 656771243, 657167614, 656437635, 655545831, 655494153, 655549586, 655495644, 656373024, 656971157, 656882465, 656732082, 656379461, 655982077, 655597627, 655421078, 655957103, 656680167, 657133400, 657437563, 657162845, 655926704, 654269695, 654385448, 656734109, 657537818, 656767666, 655977964, 655734539]
3862.9F55734539J32561k29478j38462O27697N07116R8705m01079n41032k7418r6619
3883.3F55666530J39654L21507k76446N4002M17709m07219r35256n52535J15573P52091
3903.7F55295610Q32141J45495l12090l34561m57168m03046P1645J88946j32024q8871
3924.1F54806077M1545k67983l09765J47045K51829p0333l02732l06487o2883M1246
3944.5F53967559j25706q1241N7578J5378o2883q8393q7202o3717k3902n1737j15990
3966.9F53339744j40310j39594r7811k2948k6107r9122o8546L3856K2352r4176j54316
3989.4F52553022p9692K5511L0458m7266
3997.5F52482033
$$ y = [655734539, 655867100, 655637622, 655499160, 656126857, 656633973, 656732678, 656331599, 655790567, 655763149, 655666530, 655806184, 656127691, 655851245, 655905247, 656322956, 655915737, 654980481, 654427946, 654543519, 655295610, 656127751, 656273246, 655961156, 655626595, 655169427, 654766381, 654838026, 655026972, 654894948, 654806077, 654847622, 654579639, 654269874, 654416919, 654668748, 654598415, 654295683, 653989196, 653926313, 653967559, 653841853, 653760612, 653818190, 653833568, 653770685, 653682292, 653595090, 653531373, 653507471, 653455734, 653339744, 653199434, 653059840, 652962029, 652939081, 652912974, 652813852, 652745306, 652779162, 652801514, 652707338, 652553022, 652473330, 652498841, 652529299, 652482033]
##END=$$ End of the data block
