##TITLE=$$ Begin of the data block
##JCAMP-DX=5.00 $$ ACD/SpecManager v 10.08
##SPECTROMETER/DATA SYSTEM=Alpha
##DATE=11 Jun 2014 19:36:16
##DATA TYPE=INFRARED SPECTRUM
##DATA CLASS=XYDATA
##ORIGIN=
##OWNER=
##NPOINTS=1765
##FIRSTX=399.75695801
##LASTX=3997.56933594
##MAXX=3997.56933594
##MINX=399.75695801
##MAXY=0.71720010
##MINY=0.04079481
##XFACTOR=1.0000000000
##YFACTOR=1.000000000000000e-9
##FIRSTY=0.30974907
##DELTAX=2.03957629
##XUNITS=1/CM
##YUNITS=ARBITRARY UNITS
##XYDATA=(X++(Y..Y))
399.8C09749067R923339R355813Q878767Q352697Q129955Q756727Q966654P579595
416.1C79692614P222325Q416593Q116454P467895O593109N558461N473673N707413
432.4D34248537N728364N181819M426807M660636N429596N106747L939808L441095
448.7D72163409L730059L844618L001839J980663J971483K588659K673775K092988
465D94047493J677602J810938K498657L414273L436148K928615K900302L367484L631592
483.4E19713104K916097J837373J731932K738953L267109K245129J012086J042426
499.7E36504209K005756K174973J063943K80440N95629J247108J123012k2173q14796
518.1E44158101j46151R31383R16242j3351m82857J31487J094759J414359J024246
$$ y = [309749067, 319672406, 329028219, 337906986, 346259683, 354389638, 363146365, 372113019, 379692614, 386914939, 395331532, 403447986, 410915881, 417508990, 423067451, 428541124, 434248537, 439976901, 445158720, 449585527, 454246163, 459675759, 464782506, 468722314, 472163409, 475893468, 479738086, 482739925, 484720588, 486692071, 489280730, 491954505, 494047493, 495725095, 497536033, 500034690, 503448963, 506885111, 509813726, 512714028, 516081512, 519713104, 522629201, 524466574, 526198506, 528937459, 532204568, 534449697, 535461783, 536504209, 538509965, 540684938, 541748881, 542029321, 542624950, 543872058, 544995070, 544972897, 544158101, 544011950, 544943333, 545859575, 545846224, 545363367, 545494854, 546589613, 548003972, 549028218]
536.4E49028218P08222J176953J958788J822352P63476k5928K20895Q03113N24342
554.8E56980431m57585r34839l45469N63682O66797j40727q52167o72341P868K78711
575.2E55094361r6678k64764N99980J731813J889467J207233N51581O16014J093567
593.5E62422574R17673Q285p55310p58767n18501r09150j535296j418233n38647L53753
613.9E57268381O29306N04017O23524J159668J729965J614690R07302O39439J224875
632.3E66301167J972020K084434J479089Q53062R13560J203120Q37922J8120m26531
650.6E75235963k91467j37806l80516q66175j143574q35479m63903r65595j222729
669E68928719k3008N45800O99758O21617J35601l19421l99530l56973p76767j748681
$$ y = [549028218, 549736440, 550913393, 552872181, 554694533, 555458009, 555432081, 555652976, 556456089, 556980431, 556522846, 555588007, 555242538, 555806220, 556473017, 556332290, 555480123, 554807782, 554815650, 555094361, 554997683, 554732919, 555332899, 557064712, 558954179, 560161412, 560712993, 561329007, 562422574, 563340247, 563348532, 562593222, 561834455, 561315954, 560406804, 558871508, 557453275, 556914628, 557268381, 557897687, 558401704, 559025228, 560184896, 561914861, 563529551, 564436853, 565076292, 566301167, 568273187, 570357621, 571836710, 572689772, 573603332, 574806452, 575644374, 575662494, 575235963, 574944496, 574806690, 574426174, 573559999, 572416425, 571580946, 571117043, 570151448, 568928719, 568905711, 569451511, 570151269, 570772886, 570908487, 570589066, 570189536, 569832563, 569055796, 567307115]
689.4E67307115k752543l537655m479408n855858o689072o792545p872105r949863
705.7E19378066j1511862j1825800r810716n457282j647771L78162L093869P578909
722D90175575J2452155J6411960J8450380J8136501J6154707J3494372J0685742P951796
738.3F03913188N630612L900826K713561J956344J404345Q39353L01778J9908N841
756.7F20685756l040j74164l07501j67072K41042O67274P75337O33120O26564P66457
777.1F23743773R10758R89855Q11100M95672K68638J86563J49429k3842k50578l20375
797.5F26960993p3135L03209L17275p4625l80575l89934l83735p04467j264453j575828
817.9F22734725j473903j340687j621485k293647k922773l142118l218294l786206
$$ y = [567307115, 564554572, 561016917, 556537509, 550681651, 543992579, 537200034, 529327929, 519378066, 507866204, 496040404, 486229688, 480772406, 479124635, 479502797, 482596666, 490175575, 502627730, 519039690, 537490070, 555626571, 571781278, 585275650, 595961392, 603913188, 609543800, 613444626, 616158187, 618114531, 619518876, 620358229, 620660007, 620679915, 620685756, 620682716, 620508552, 620201051, 620033979, 620275021, 620942295, 621717632, 622350752, 622977316, 623743773, 624654531, 625644386, 626455486, 626951158, 627219796, 627406359, 627555788, 627531946, 627281368, 626960993, 626887858, 627191067, 627508342, 627433717, 627053142, 626663208, 626279473, 625575006, 624310553, 622734725, 621260822, 619920135, 618298650, 616005003, 613082230, 609940112, 606721818, 602935612]
834.2F02935612m923820o073833p075190q489907j1279881j4111042j2029350o806493
850.5E32146096o819784j1097193j3626695j5275389j8866718k5131970l5407186n1346630
866.8C54574531o6341757o3143641l8771793j2454734O289766K4002715M2240337N6557760
883.1C02953184O4968586O5941840N7557404M3083698K9557168K0406127J4465451
897.4E98933458J0258854P537186O073952N009234L637075K293289J640856J598060
913.7F36981964J384795N14209n33998r15766n94139l45289o87004j152873r77099
932.1F33674800k52843K02716o5267n18382m30643P8916J61469o57797j805424k407670
952.5F27979875k405942k561748l362715m285634m592240m409790m468560n179524
$$ y = [602935612, 598011792, 591937959, 584862769, 576372862, 565092981, 550981939, 538952589, 532146096, 525326312, 514229119, 500602424, 485327035, 466460317, 441328347, 405921161, 354574531, 288232774, 225089133, 186317340, 173862606, 180152372, 204155087, 246395424, 302953184, 367921770, 433863610, 491421014, 534504712, 564061880, 584468007, 598933458, 609192312, 616729498, 622803450, 627812684, 631449759, 633743048, 635383904, 636981964, 638366759, 638880968, 638346970, 637431204, 636837065, 636491776, 635804772, 634651899, 633674800, 633421957, 633624673, 633559406, 633041024, 632610381, 632689297, 632850766, 632192969, 630387545, 627979875, 625573933, 623012185, 619649470, 615363836, 610771596, 606361806, 601893246, 596713722]
968.8E96713722o119013o620169o785452p375419q644343r951174j0574400j0461092
985.1E30182660j0195077j0150850j0011255r314329q188695p230520o849795o844193
1001.4D61397946o809443o834120p225037p904678q407146q299976p485360o298840
1017.7D02133346n097658l864288k448261r54330K01136P87586J033157J230389J378059
1036.1C94399136J292467Q48443K17736k09123k24591J1057L31521R32693J954496
1054.5C99553835L144265M111170M571975M375457L482879J888632l16321k770901
1070.8D18040991m676640n183995m324079k972275j567661L48180K492726L991991
1087.1D06149238M900158N293608M818081L601939K182245R32306R8854j30325K08288
$$ y = [596713722, 590594709, 583974540, 577189088, 569813669, 561169326, 551218152, 540643752, 530182660, 519987583, 509836733, 499825478, 490511149, 482322454, 475091934, 468242139, 461397946, 454588503, 447754383, 440529346, 432624668, 424217522, 415917546, 408432186, 402133346, 397035688, 393171400, 390723139, 389768809, 389969945, 390757531, 391790688, 393021077, 394399136, 395691603, 396540046, 396757782, 396548659, 396324068, 396335125, 396666646, 397599339, 399553835, 402698100, 406809270, 411381245, 415756702, 419239581, 421128213, 420811892, 418040991, 413364351, 408180356, 403856277, 400884002, 399316341, 399664521, 402157247, 406149238, 411049396, 416343004, 421161085, 424763024, 426945269, 427877575, 427976429, 427846104, 428054392]
1105.4D28054392Q79914J552045J961798K102494K071023J895994J622319J309604
1121.8D41449583J077383J033873J100808J078069P24852n0693r85802j839220k584398
1140.1D41004455l107250l280639l088624k601832j988172j381725p28488J06662J162976
1158.5D26097363K379567L559947M429996M837572M811287M448682L902942L383607
1174.8D57850963K975702K624333K204537J582087P71671n3167p86603j415819j931876
1193.1D63821828k351939k614707k642602k490908k265066k018869j834005j764774
1209.5D45838958j824886k046227k402514k824247l151983l306657l387958l469020
1225.8D23425466l500700l477663l416002l288299l120571k963871k871662k811521
$$ y = [428054392, 428934306, 430486351, 432448149, 434550643, 436621666, 438517660, 440139979, 441449583, 442526966, 443560839, 444661647, 445739716, 446464568, 446413875, 445428073, 443588853, 441004455, 437897205, 434616566, 431527942, 428926110, 426937938, 425556213, 424827725, 424934387, 426097363, 428476930, 432036877, 436466873, 441304445, 446115732, 450564414, 454467356, 457850963, 460826665, 463450998, 465655535, 467237622, 468009293, 467956126, 467169523, 465753704, 463821828, 461469889, 458855182, 456212580, 453721672, 451456606, 449437737, 447603732, 445838958, 444014072, 441967845, 439565331, 436741084, 433589101, 430282444, 426894486, 423425466, 419924766, 416447103, 413031101, 409742802, 406622231, 403658360, 400786698, 397975177]
1242.1C97975177k725929k613694k549022k552688k605320k678215k747059k832502
1258.4C76670748k901763k924561k894223k881110k932578l070176l214597l289134
1274.7C52562606l344565l440440l556669l575027l547430l624856l821075m007906
1291C23644638m182666m324168m446805m603982m734784m796267m800171m838049m881740
1309.4B82036006m926681m898578m761249m670679m674197m694938m817978n034163
1325.7B43557543n200178n340636n371883n280793n242288n467728n630120n366207
1342B00657710n164891n307749n527645n676031n759821n788237n752697n625040n727469
1360.4A50328130o055430n875886n433246n431637n366653n303294n424671n114324
$$ y = [397975177, 395249248, 392635554, 390086532, 387533844, 384928524, 382250309, 379503250, 376670748, 373768985, 370844424, 367950201, 365069091, 362136513, 359066337, 355851740, 352562606, 349218041, 345777601, 342220932, 338645905, 335098475, 331473619, 327652544, 323644638, 319461972, 315137804, 310690999, 306087017, 301352233, 296555966, 291755795, 286917746, 282036006, 277109325, 272210747, 267449498, 262778819, 258104622, 253409684, 248591706, 243557543, 238357365, 233016729, 227644846, 222364053, 217121765, 211654037, 206023917, 200657710, 195492819, 190185070, 184657425, 178981394, 173221573, 167433336, 161680639, 156055599, 150328130, 144272700, 138396814, 132963568, 127531931, 122165278, 116861984, 111437313, 106322989]
1376.7A06322989m797585m737527m560276m343711m384242m249752l790721l799215
1393G1659960m052550l812834l522911l233376k925653k811838k463270k060276j776129
1411.4D5001123j458809j139298r30853o15142o2209L06435M83185O06921P61378Q63713
1431.8D3816444Q41438Q50883R28472P86424O28419N39974M67125M22221L78046L48579
1452.2E0008025K72971K62290N09582P07243O62629P11806Q46956Q34561Q20067J116582
1472.6E6752712J498956J542702J553901J646343J776234J813583J939743K362937
1488.9G0887111K814114K728373K742320L368967L737993L516495L035278L235250
1505.2I6065901M668839M648500L856025L721901L815785M000038M012160M438459
$$ y = [106322989, 101525404, 96787877, 92227601, 87883890, 83499648, 79249896, 75459175, 71659960, 67607410, 63794576, 60271665, 57038289, 54112636, 51300798, 48837528, 46777252, 45001123, 43542314, 42403016, 41472163, 40857021, 40794812, 41101247, 41584432, 42191353, 42952731, 43816444, 44657882, 45508765, 46437237, 47223661, 47852080, 48392054, 48859179, 49281400, 49659446, 50008025, 50280996, 50543286, 51052868, 51760111, 52422740, 53134546, 53981502, 54816063, 55636130, 56752712, 58251668, 59794370, 61348271, 62994614, 64770848, 66584431, 68524174, 70887111, 73701225, 76429598, 79171918, 82540885, 86278878, 89795373, 92830651, 96065901, 100734740, 105383240, 109239265, 112961166, 116776951, 120776989, 124789149, 129227608]
1521.5A29227608M633233M324973M476979M227475M104346M637897M304245L701374
1537.8A63638130M837453N967573N582705N422458N286932N536332N771086N847424
1554.1B07890093N638406P218480R574220P220909O107896O254062O333530O653011
1570.5B62890607N716086M950672N622208N352020M519284M259646M034281L745645
1586.8C01090449L494501L228039K943605K755314K571493K354950K138138J989454
1603.1C22565943J808912J606851J433373J256883R30101N53041O23346Q06808M76837
1621.4C32062095J86414L05414L71933M53264M59700J92613K71261J085072J417071
1639.8C36804837J287878J088380J151264J795650J771420J603573K910704L423691
$$ y = [129227608, 133860841, 138185814, 142662793, 146890268, 150994614, 155632511, 159936756, 163638130, 168475583, 174443156, 180025861, 185448319, 190735251, 196271583, 202042669, 207890093, 213528499, 220746979, 230321199, 237542108, 243650004, 249904066, 256237596, 262890607, 268606693, 273557365, 279179573, 284531593, 289050877, 293310523, 297344804, 301090449, 304584950, 307812989, 310756594, 313511908, 316083401, 318438351, 320576489, 322565943, 324374855, 325981706, 327415079, 328671962, 329602063, 330155104, 330778450, 331585258, 332062095, 332248509, 332553923, 332925856, 333379120, 333838820, 334031433, 334302694, 335387766, 336804837, 338092715, 339181095, 340332359, 342128009, 343899429, 345503002, 348413706, 351837397]
1656.1C51837397K917111K834141L237814L668546L393203L387451M050166M004687
1672.4C79330516M030704M491359M185826L564537L562629M971266N320280M568130
1688.8D14025247M543722M173517M168779M551857M586280N407065M933715M134804
1705.1D50524986M271030L964067L392249K886683K610385L149450L774852L353148
1721.4D77926850K889157K744704K444327K117336J821786K179623K949297K645224
1737.7D97718304K492756K795816K842009K699852K558469K780557L196776K910376
1754E19994915K482414K345323K117932K161086K200186J793861J398087J104057J155376
1772.4E36753237J387120R41872J25826n14329r24051j403033j819015k120972k640724
$$ y = [351837397, 354754508, 357588649, 360826463, 364495009, 367888212, 371275663, 375325829, 379330516, 383361220, 387852579, 392038405, 395602942, 399165571, 404136837, 409457117, 414025247, 418568969, 422742486, 426911265, 431463122, 436049402, 441456467, 446390182, 450524986, 454796016, 458760083, 462152332, 465039015, 467649400, 470798850, 474573702, 477926850, 480816007, 483560711, 486005038, 488122374, 489944160, 492123783, 495073080, 497718304, 500211060, 503006876, 505848885, 508548737, 511107206, 513887763, 517084539, 519994915, 522477329, 524822652, 526940584, 529101670, 531301856, 533095717, 534493804, 535597861, 536753237, 538140357, 539082229, 539208055, 538693726, 537769675, 536366642, 534547627, 532426655, 529785931]
1790.7E29785931k636790j711786j087367p12693J10805J158178J912117K455115K998590
1809.1E32272100L631831M089951M229844M299640M250467L855825L436386L373266
1825.4E63439310L160059K983928L078520K752721K320052K217948K006352J494825
1841.7E83453715J438320J988053K104401J844109J589477J401960J410187J472592
1858E96702814J447260J320065J119792R10997J066924J593470J639009J328766J190662
1876.4F08319759J199603J174331J100302J053333J004279J029193J187563J145005
1892.7F17213368R74238J042784J138627J081169R51290Q79347Q73208R33528J045585
1911.1F26133144R66668P10845O80208R59277R99689R08793R39190Q97586Q56042Q56280
$$ y = [529785931, 527149141, 525437355, 524349988, 523637295, 523748100, 524906278, 526818395, 529273510, 532272100, 535903931, 539993882, 544223726, 548523366, 552773833, 556629658, 560066044, 563439310, 566599369, 569583297, 572661817, 575414538, 577734590, 579952538, 581958890, 583453715, 584892035, 586880088, 588984489, 590828598, 592418075, 593820035, 595230222, 596702814, 598150074, 599470139, 600589931, 601500928, 602567852, 604161322, 605800331, 607129097, 608319759, 609519362, 610693693, 611793995, 612847328, 613851607, 614880800, 616068363, 617213368, 618187606, 619230390, 620369017, 621450186, 622401476, 623280823, 624154031, 625087559, 626133144, 627099812, 627810657, 628490865, 629450142, 630449831, 631358624, 632297814, 633195400, 634051442, 634907722]
1931.5F34907722Q12889P35879O96897O44684O46472P72655Q07762P46787P57515P50959
1951.9F42280221O59049N68449N27084N79297O36757N84185N33402O76751Q45671Q25703
1972.3F48716569P09057O18636O09518O62386O92904N96344M89653M72784N25772O63519
1992.6F54757142O97136N48303M74632N51999N99145N39542M41253M37081N20348N14150
2013F60080731L77119L29554M31835N14150N13554M33444L51131L71516M68493M92930
2033.4F64364457M36068L89993L87370M37737M72128M37975L83258L91841M42028M55678
2053.8F68598533M19438L82423L76046M00006M51863M73261M25220L67403L97741M50910
2074.2F72742844M23431L59714L49164L96431M27544L98516L30270L04818L41058L86297
$$ y = [634907722, 635720611, 636456490, 637153387, 637798071, 638444543, 639217198, 640024960, 640771747, 641529262, 642280221, 642939270, 643507719, 644034803, 644614100, 645250857, 645835042, 646368444, 647045195, 647890866, 648716569, 649425626, 650044262, 650653780, 651316166, 652009070, 652605414, 653095067, 653567851, 654093623, 654757142, 655454278, 656002581, 656477213, 657029212, 657628357, 658167899, 658609152, 659046233, 659566581, 660080731, 660457850, 660787404, 661219239, 661733389, 662246943, 662680387, 663031518, 663403034, 663871527, 664364457, 664800525, 665190518, 665577888, 666015625, 666487753, 666925728, 667308986, 667700827, 668142855, 668598533, 669017971, 669400394, 669776440, 670176446, 670628309, 671101570, 671526790, 671894193, 672291934, 672742844, 673166275, 673525989, 673875153, 674271584, 674699128, 675097644, 675427914, 675732732, 676073790, 676460087]
2094.6F76460087L66628L00885K83837L16799L35693K97368K36034K12193K40206K64347
2115F79314077K58326K35677J96457J81377K10047K31147K15292K12609K32339K50280
2135.4F81537628K56300K37286K16425K34961K86699L04102K72930K91467L70860M07755
2155.8F84416413M08054M21524M45902M46081M33147M29273M20868M52817M88698M71711
2176.2F88834488M61281M61638M52041M69327M69625M32372M04895L91960M13537M59552
2196.6F93250716M44233L49343L22461L71575L66629L36229L34561L31700L28481L42787
2217F96778715L48508L39568L18467L30031L66450L50236L02315K86341L17395L34441
2237.4G00072467L13461K83599K74777K86818L01778L17455L23891L10064K88784K95997
$$ y = [676460087, 676826715, 677127600, 677411437, 677728236, 678063929, 678361297, 678597331, 678809524, 679049730, 679314077, 679572403, 679808080, 680004537, 680185914, 680395961, 680627108, 680842400, 681055009, 681287348, 681537628, 681793928, 682031214, 682247639, 682482600, 682769299, 683073401, 683346331, 683637798, 684008658, 684416413, 684824467, 685245991, 685691893, 686137974, 686571121, 687000394, 687421262, 687874079, 688362777, 688834488, 689295769, 689757407, 690209448, 690678775, 691148400, 691580772, 691985667, 692377627, 692791164, 693250716, 693694949, 694044292, 694366753, 694738328, 695104957, 695441186, 695775747, 696107447, 696435928, 696778715, 697127223, 697466791, 697785258, 698115289, 698481739, 698831975, 699134290, 699420631, 699738026, 700072467, 700385928, 700669527, 700944304, 701231122, 701532900, 701850355, 702174246, 702484310, 702773094, 703069091]
2257.8G03069091L06964K93016L01480L27826L15249K99037L06785L13222L00229L03268
2278.2G06136167L44455L08097K21312J68502J18673Q5235O7830P7903J13785J13666
2298.6G07755625N6923k8670j16527j58370j62601j79172j51038r7632j57297k98202
2319G06463039l36766k21908j04428r4354j52528j19508M8519J20341P1109N7339J48714
2341.4G05879569N55992J152516Q59201k72871j098573j113653p08043l81649l3557
2359.8G04838932L53753O33657R01759J162588J272202J229882J157403J132727J098692
2378.1G13781595R84371P76768N37276L33667K21073J71543J08897N6148O0379Q0943
2398.5G17112660N5850J1086j5080q463K4437J9610k6762m8161l9160l2008m8160r7692
$$ y = [703069091, 703376055, 703669071, 703970551, 704298377, 704613626, 704912663, 705219448, 705532670, 705832899, 706136167, 706480622, 706788719, 707010031, 707178533, 707297206, 707382441, 707450271, 707528174, 707641959, 707755625, 707812548, 707783878, 707667351, 707508981, 707346380, 707167208, 707016170, 706918538, 706761241, 706463039, 706126273, 705904365, 705799937, 705705583, 705553055, 705433547, 705482066, 705602407, 705673516, 705730855, 705879569, 706435561, 707588077, 708447278, 708174407, 707075834, 705962181, 705254138, 704872489, 704838932, 705192685, 705826342, 706728101, 707890689, 709162891, 710392773, 711550176, 712682903, 713781595, 714765966, 715542734, 716080010, 716413677, 716634750, 716806293, 716915190, 716971338, 717031717, 717112660, 717168510, 717179596, 717164516, 717156053, 717180490, 717200100, 717173338, 717125177, 717086017, 717054009, 717005849, 716908157]
2423G16908157j44243j61887j65343j81913k33054k83838k77817k56598k82764l62218
2443.4G14558482m65691m98354m69685n25236o94156q47220r10938r28998r73463j106858
2463.8G07137883j302898j468599j574397j710355j941324k179265k325594k423406
2480.1F92212045k537966k687156k856731k946973k900422k787172k678752k579928
2496.4F70236945k435624k216876k028883j938819j893282j846075j777888j693785
2512.7F54405713j593828j453102j230597r05395n18203j72495J14381M53234Q61048
2531.1F49960756J243174J508356J621484J667321J772285J907348J961410J942754
2547.4F63584888J928270J931131J862585J638294J358389J193166J120389J034438
$$ y = [716908157, 716763914, 716602027, 716436684, 716254771, 716021717, 715737879, 715460062, 715203464, 714920700, 714558482, 714092791, 713594437, 713124752, 712599516, 711905360, 711058140, 710147202, 709218204, 708244741, 707137883, 705834985, 704366386, 702791989, 701081634, 699140310, 696961045, 694635451, 692212045, 689674079, 686986923, 684130192, 681183219, 678282797, 675495625, 672816873, 670236945, 667801321, 665584445, 663555562, 661616743, 659723461, 657877386, 656099498, 654405713, 652811885, 651358783, 650128186, 649222791, 648704588, 648532093, 648646474, 649099708, 649960756, 651203930, 652712286, 654333770, 656001091, 657773376, 659680724, 661642134, 663584888, 665513158, 667444289, 669306874, 670945168, 672303557, 673496723, 674617112, 675651550]
2563.7F75651550R01938P21276N84781N66959N45621M50194L42071K34187J86324K27868
2584.1F80412769K31088J44720O9975O6996J32680K03967J72854Q5055R9600K35617
2604.5F81855321L37660L28005L23712M14908N37396O12378O32644O15775O36757P24613
2624.9F87019169P68364P24256O86407P06017P40349P28727O57737N75602N33581N56647
2645.3F93696856N56529M36485K79665J93179J83463J80840J18733m352j02460q9109
2665.7F95449829n8651j46985k63870k65121k07126j94609k44737k88785k68459k43127
2686.1F93268359k43902k49565k99692l74914l82542l16799k94745l76284m19140l64959
2706.5F89945817l51846l93629m16875m12047l78847l77298m52458n32151n25594m02629
$$ y = [675651550, 676553488, 677274764, 677859545, 678426504, 678972125, 679422319, 679764390, 679998577, 680184901, 680412769, 680643857, 680788577, 680858552, 680925548, 681058228, 681262195, 681435049, 681520104, 681619704, 681855321, 682192981, 682520986, 682844698, 683259606, 683797002, 684409380, 685042024, 685657799, 686294556, 687019169, 687787533, 688511789, 689198196, 689904213, 690644562, 691373289, 692031026, 692606628, 693140209, 693696856, 694253385, 694689870, 694969535, 695162714, 695346177, 695527017, 695645750, 695641398, 695538938, 695449829, 695391178, 695244193, 694980323, 694715202, 694508076, 694313467, 694068730, 693779945, 693511486, 693268359, 693024457, 692774892, 692475200, 692100286, 691717744, 691400945, 691106200, 690729916, 690310776, 689945817, 689593971, 689200342, 688783467, 688371420, 687992573, 687615275, 687162817, 686630666, 686105072, 685702443]
2726.9F85702443k96175l37422m26412m49240m24028l73363l61621m30227m84645m66645
2747.3F81652665m19378l95060m00781m47512m95791m77493m65691n13852n51999n45144
2767.7F76939964n43952o06179o73711o33776n88835o49333p09235p41482q10027q87692
2788.1F70095742q71480q27074r00030r98020r81093r30190r69588j044572j116156
2806.4F61457539j204193j250327j248002j281857j371801j452804j499474j548648
2822.7F50600433j625716j739562j879036k025426k185821k365351k588093k837360
2839.1F33354068l193379l824353m563212m847110m147529k711713j395882o81638
2855.4F07989252n27203o73712q91506j148105j462937j767456k007663k085924j879037
$$ y = [685702443, 685406268, 685068846, 684642434, 684193194, 683769166, 683395803, 683034182, 682603955, 682119310, 681652665, 681233287, 680838227, 680437446, 679989934, 679494143, 679016650, 678550959, 678037107, 677485108, 676939964, 676396012, 675789833, 675116122, 674482346, 673893511, 673244178, 672534943, 671793461, 670983434, 670095742, 669224262, 668397188, 667497158, 666499138, 665518045, 664587855, 663618267, 662573695, 661457539, 660253346, 659003019, 657755017, 656473160, 655101359, 653648555, 652149081, 650600433, 648974717, 647235155, 645356119, 643330693, 641144872, 638779521, 636191428, 633354068, 630160689, 626336336, 621773124, 616926014, 612778485, 610066772, 608670890, 607989252, 607462049, 606788337, 605896831, 604748726, 603285789, 601518333, 599510670, 597424746, 595545709]
2873.7E95545709j562476j420856j440525j465082j426995j361846j327158j270174
2890.1E84270597j184762j140654j067221r71854r97663j111209j223445j419008j812577
2908.4E73342204k401352l050744l384769l038228k164543j241087n70000j25527K06113
2926.8E57572067M66704P41899J011670J222372J429379J540124J459599J369655J376629
2945.1E68190098J317501J079202P69794O03139N87583O06179O76155Q04961R63568
2963.5E75598180J149237J325787J435160J426578J356661J311302J210571J071274
2979.8E85884750J024842R98259Q91268P47085N80072M69804M79340M12703K90215
2998.1E91778338K47061J83225J42693J52469L1710j74046j94669n7578j4424r3102
$$ y = [595545709, 593983233, 592562377, 591121852, 589656770, 588229775, 586867929, 585540771, 584270597, 583085835, 581945181, 580877960, 579906106, 578908443, 577797234, 576573789, 575154781, 573342204, 570940852, 567890108, 564505339, 561467111, 559302568, 558061481, 557491481, 557365954, 557572067, 558038771, 558780670, 559792340, 561014712, 562444091, 563984215, 565443814, 566813469, 568190098, 569507599, 570586801, 571356595, 571959734, 572547317, 573153496, 573829651, 574634612, 575598180, 576747417, 578073204, 579508364, 580934942, 582291603, 583602905, 584813476, 585884750, 586909592, 587907851, 588799119, 589546204, 590126276, 590596080, 591075420, 591488123, 591778338, 592025399, 592208624, 592351317, 592503786, 592535496, 592361450, 592166781, 592109203, 592094779, 592001677]
3018.5E92001677k20180l93093n40673o07431o82950p83503q26896q07285q44240j011789
3038.9E85283637j151085j132667j048565j051605j164317j217842j176774j164913
3055.3E76175869j157523j179874j284003j308620j225769j150668j107395j134515
3071.6E66627502j215696j283646j292884j226127j154721j170635j225650j233101
3087.9E56825042j235903j253366j266778j289606j312971j319587j315474j380623
3104.2E46450734j499116j497150j403332j432538j554012j575529j497984j448751
3120.5E34542322j478016j555622j627445j658082j682162j727105j773595j830042
3136.8E21210253j834213j778007j784563j830757j833558j857340j950026k011716
$$ y = [592001677, 591781497, 591388404, 590847731, 590240300, 589557350, 588773847, 587946951, 587139666, 586295426, 585283637, 584132552, 582999885, 581951320, 580899715, 579735398, 578517556, 577340782, 576175869, 575018346, 573838472, 572554469, 571245849, 570020080, 568869412, 567762017, 566627502, 565411806, 564128160, 562835276, 561609149, 560454428, 559283793, 558058143, 556825042, 555589139, 554335773, 553068995, 551779389, 550466418, 549146831, 547831357, 546450734, 544951618, 543454468, 542051136, 540618598, 539064586, 537489057, 535991073, 534542322, 533064306, 531508684, 529881239, 528223157, 526540995, 524813890, 523040295, 521210253, 519376040, 517598033, 515813470, 513982713, 512149155, 510291815, 508341789, 506330073]
3153.2E06330073j990259j945495j917363j947850k019971k071977k079040k023101
3169.5D90335017j973599k041042k171009k178252k057374k016693k095729k154797
3185.8D73646522k130092k061069k027928k060563k085715k041012j983256j970201
3202.1D57286686k004326k061456k050966j949519j907826j972466j991600j948416
3218.4D41400111j917720j881510j876176j920133j909435j844466j821250j838207
3234.7D26391214j840055j833051j837224j816750j802802j839637j831621j751006
3251.1D11839068j733691j778125j800537j812578j812905j788795j739502j681834
3267.4C97691101j634896j623809j618773j575083j542657j508504j429737j350790
$$ y = [506330073, 504339814, 502394319, 500476956, 498529106, 496509135, 494437158, 492358118, 490335017, 488361418, 486320376, 484149367, 481971115, 479913741, 477897048, 475801319, 473646522, 471516430, 469455361, 467427433, 465366870, 463281155, 461240143, 459256887, 457286686, 455282360, 453220904, 451169938, 449220419, 447312593, 445340127, 443348527, 441400111, 439482391, 437600881, 435724705, 433804572, 431895137, 430050671, 428229421, 426391214, 424551159, 422718108, 420880884, 419064134, 417261332, 415421695, 413590074, 411839068, 410105377, 408327252, 406526715, 404714137, 402901232, 401112437, 399372935, 397691101, 396056205, 394432396, 392813623, 391238540, 389695883, 388187379, 386757642, 385406852]
3283.7C85406852j323313j351446j345783j273185j236141j268268j293927j265556
3300C75049233j201748j135379j117528j160443j221299j273185j292646j305729j343519
3318.4C63997757j338481j299799j316696j362831j415580j454145j417220j325130
3334.7C53067875j282930j363606j465291j382112j161784j035631j016557j040906
3351C43319058j065999j034349r56625q80062q72791q91596q35777p48813p27385p90447
3371.4C34515214p98732o96451o30021o27875o51658o08652m56423l23802k64108l00885
3391.8C29156607m11182m24773k68459j13159j54734k53290j82122q4072n9218j460
3412.2C27204138P6711J01269J10566J31518J41442K31057M17829N45412N22762N29379
$$ y = [385406852, 384083539, 382732093, 381386310, 380113125, 378876984, 377608716, 376314789, 375049233, 373847485, 372712106, 371594578, 370434135, 369212836, 367939651, 366647005, 365341276, 363997757, 362659276, 361359477, 360042781, 358679950, 357264370, 355810225, 354393005, 353067875, 351784945, 350421339, 348956048, 347573936, 346412152, 345376521, 344359964, 343319058, 342253059, 341218710, 340262085, 339382023, 338509232, 337617636, 336781859, 336033046, 335305661, 334515214, 333716482, 333020031, 332390010, 331762135, 331110477, 330501825, 330045402, 329721600, 329457492, 329156607, 328745425, 328320652, 328052193, 327939034, 327784300, 327531010, 327348888, 327264816, 327205598, 327204138, 327280849, 327382118, 327492684, 327624202, 327765644, 327996701, 328414530, 328959942, 329482704, 330012083]
3432.6C30012083O01262N58942M68493M94391N82725O69628Q22365R09418Q93980R37522
3453C36950809R94384J034975J106083J126946J172274J337170J427740J301766J158029
3471.3C47610176J239478J410127J515448J531154J478046J464099J524210J588672
3487.6C59361410J660675J732975J720458J716882J746804J783431J877576J917869
3504C73518080J837492J879692K058178K146929K090454J992077J989692K038360K145618
3522.3C91696572K219916K214521K329677K482593K464652K445698K515346K495199
3538.6D10864174K474457K524168K638936K770990K735138K667248K814800K923905
3554.9D32413816K879709K908797K891361K656669K672672L471106L946036L446788
$$ y = [330012083, 330613345, 331172287, 331640780, 332135171, 332717896, 333387524, 334209889, 335119307, 336013287, 336950809, 337945193, 338980168, 340086251, 341213197, 342385471, 343722641, 345150381, 346452147, 347610176, 348849654, 350259781, 351775229, 353306383, 354784429, 356248528, 357772738, 359361410, 361022085, 362755060, 364475518, 366192400, 367939204, 369722635, 371600211, 373518080, 375355572, 377235264, 379293442, 381440371, 383530825, 385522902, 387512594, 389550954, 391696572, 393916488, 396131009, 398460686, 400943279, 403407931, 405853629, 408368975, 410864174, 413338631, 415862799, 418501735, 421272725, 424007863, 426675111, 429489911, 432413816, 435293525, 438202322, 441093683, 443750352, 446423024, 449894130, 453840166, 457286954]
3571.3D57286954L136516L304570L426075L437400L367007L076047L043502L710151
3587.6D83788222L982842L419220L360987L763974L794104L726303L780365L485382
3603.9E13101399L141999L478885L831386L679574L468335L070831L273606M230857
3620.2E41276872M035056K993047K669811M186034N431593M155278L495634L626764
3636.5E71870089L508329L331661K902031K195895K186954L836691M902959L382504
3652.8E98117113K498150L250003L261745K555966K235592J742005J232028J817763
3669.2F16710365K409875J611769K234042L183127K087116J314938Q74400L29137O07729
3687.5F31362498J563191J476288P02679M45783M88580P32779J423061J629829Q99077
$$ y = [457286954, 460423470, 463728040, 467154115, 470591515, 473958522, 477034569, 480078071, 483788222, 487771064, 491190284, 494551271, 498315245, 502109349, 505835652, 509616017, 513101399, 516243398, 519722283, 523553669, 527233243, 530701578, 533772409, 537046015, 541276872, 545311928, 548304975, 550974786, 555160820, 560592413, 564747691, 568243325, 571870089, 575378418, 578710079, 581612110, 583808005, 585994959, 589831650, 594734609, 598117113, 600615263, 603865266, 607127011, 609682977, 611918569, 613660574, 614892602, 616710365, 619120240, 620732009, 622966051, 626149178, 628236294, 629551232, 630425632, 630754769, 631362498, 632925689, 634401977, 635104656, 635550439, 636039019, 636771798, 638194859, 639824688, 640723765]
3705.9F40723765M74214J016617K060116J892268P31528J22964J64748M04715N63324
3724.2F48154259O63042L71098k16067k68816N72085J532733R52840o19948q50141
3742.6F50291085P86782Q84532j63316Q79168J622021M46499j27912M05491O57379
3760.9F55681729R0599j39653P4207M82262Q64446L75986k94864j94967L84152M00722
3781.3F57724619j4067J27793L50534J98365r4772m70280m97043l57449j99557O31392
3801.7F57399535N80907O4611O66440L90351o98686q56221l7670O0857l3021Q80360
3822.1F58417463N75543j05024j44660l21865l85583m27961k27988N37217P59721M65274
3842.5F59142137L03089k44558j176834j620710O4493K320647Q65459p41184q02040
$$ y = [640723765, 641197979, 642214596, 644274712, 646166980, 646898508, 647021472, 647186220, 647590935, 648154259, 648817301, 649188399, 648972332, 648703516, 649275601, 650808334, 651761174, 651141226, 650291085, 651077867, 651962399, 651799083, 652678251, 654300272, 654746771, 654618859, 655024350, 655681729, 655772328, 655632675, 655706882, 656189144, 657053590, 657429576, 657134712, 656939745, 657323897, 657724619, 657710552, 657838345, 658188879, 658387244, 658292472, 657822192, 657325149, 656967700, 656768143, 657399535, 657980442, 658045053, 658711493, 659101844, 658403158, 657546937, 657509267, 657570124, 657537103, 658417463, 658993006, 658887982, 658743322, 658421457, 658035874, 657607913, 657379925, 657917142, 658676863, 659142137, 659445226, 659200668, 658023834, 656403124, 656467617, 658788264, 659653723, 658912539, 658110499]
3860.9F58110499k58982R3937l15785k03371O44087N29826Q8632m10914n58376l58
3881.3F57719195q047J51933K81035k81155K0623L70682l91901q82506n59867L8147
3901.7F56458139P29979Q83877J94490k40028k31087l98815l97503N3346J92761r6619
3922.1F57148540j15871l6657l00467l15249J37746K74897k9803k89082l45349j28568
3942.5F56000137J1742j28865o5625J04845N3048n6565j07884j17183o0677L0458l755
3964.9F55659676j10031j36435j07169p4446o8963p3909o9201l5763K5034M887r8347
3987.3F54915333j49191r7870q226J3948p4268
3997.5F54599726
$$ y = [658110499, 657851517, 657945454, 657629669, 657426298, 658070385, 658600211, 658688843, 658277929, 657719553, 657719195, 657711148, 657863081, 658144116, 657862961, 657883584, 658254266, 657862365, 656979859, 656419992, 656458139, 657188118, 658071995, 658266485, 658026457, 657795370, 657396555, 656999052, 657052398, 657245159, 657148540, 657032669, 656996012, 656695545, 656380296, 656518042, 656792939, 656763136, 656474054, 656128705, 656000137, 656011879, 655883014, 655817389, 655922234, 655975282, 655918717, 655810833, 655693650, 655632973, 655663431, 655659676, 655549645, 655413210, 655306041, 655231595, 655162632, 655088723, 655019522, 654983759, 655008793, 655013680, 654915333, 654766142, 654668272, 654660046, 654673994, 654599726]
##END=$$ End of the data block
