##TITLE=$$ Begin of the data block
##JCAMP-DX=5.00 $$ ACD/SpecManager v 10.08
##SPECTROMETER/DATA SYSTEM=Alpha
##DATE=11 Jun 2014 19:36:16
##DATA TYPE=INFRARED SPECTRUM
##DATA CLASS=XYDATA
##ORIGIN=
##OWNER=
##NPOINTS=1765
##FIRSTX=399.75695801
##LASTX=3997.56933594
##MAXX=3997.56933594
##MINX=399.75695801
##MAXY=0.71836531
##MINY=0.04079631
##XFACTOR=1.0000000000
##YFACTOR=1.000000000000000e-9
##FIRSTY=0.30879563
##DELTAX=2.03957629
##XUNITS=1/CM
##YUNITS=ARBITRARY UNITS
##XYDATA=(X++(Y..Y))
399.8C08795631R727895R294987R316087Q949786Q418650Q608788Q877307P851571
$$ 308795631 318523526 327818513 337134600 346084386 354503036 363111824 371989131 379840702
416.1C79840702P433474Q310020P660776O802023O426483N825371N717605N970269
$$ 379840702 387274176 395584196 403244972 410046995 416473478 422298849 428016454 433986723
432.4D33986723N611122M793882M427582M799635N440741N250305M063487L276319
$$ 433986723 439597845 444391727 448819309 453618944 459059685 464309990 468373477 471649796
448.7D71649796L500342L720522L007829K167970K200902K789616L004551K222270
$$ 471649796 475150138 478870660 481878489 484046459 486247361 489036977 492041528 494263798
465D94263798J200050J421869K809793L664761L026069K478420K863825L475308L703535
$$ 494263798 495463848 496885717 499695510 503360271 506386340 508864760 511728585 515203893 518907428
483.4E18907428K949178J826286J787126K740443L108204K158880J009285R44197J831711
$$ 518907428 521856606 523682892 525470018 528210461 531318665 533477545 534486830 535431027 537262738
501.7E37262738K177179J293301L64125M59790J159191J242638K85804n99742k26974
$$ 537262738 539439917 540733218 541097343 541557133 542716324 543958962 544244766 543645024 543418050
520.1E43418050P44939R23037J92881l20971Q4281R21428J304805R09150N80847J201332
$$ 543418050 544162989 545086026 545278907 544957936 545042217 545963645 547268450 548177600 548758447 549959779
540.5E49959779K013206J733244O22749m4882K60055Q02815N88119l54290r04918l29375
$$ 549959779 551972985 553706229 554328978 554284096 554544151 555346966 555935085 555580795 554675877 554346502
560.9E54346502O62982P38085k86758j047194o42598J24395K99096m5240k17497L88682
$$ 554346502 555009484 555747569 555460811 554413617 553771019 553895414 554194510 554149270 553931773 554320455
581.3E54320455J443922J805484J231313O52492P66337J171708R75788R7453p03752
$$ 554320455 555764377 557569861 558801174 559453666 560220003 561391711 562367499 562464952 561761200
599.6E61761200q30650o89089j030028j588166j456499m92871M62771O77883M70460
$$ 561761200 560930550 560241461 559211433 557623267 556166768 555673897 556136668 556814551 557285011
618E57285011O14643J191378J684188J558662R63628O86348J212656K029896K094328
$$ 557285011 557899654 559091032 560775220 562333882 563297510 563983858 565196514 567226410 569320738
636.3E69320738J370728Q69871J022398J250923Q93116O5744m92871m40717k04742
$$ 569320738 570691466 571561337 572583735 573834658 574727774 574793518 574300647 573859930 573655188
654.7E73655188m04417r53019j125395p32541m39823r59277j178265L9637N82099O31690
$$ 573655188 573250771 572297752 571172357 570439816 569999993 569040716 567862451 567902088 568484187 569115877
675.1E69115877N33581J17958l45290l97861k86222p31885j750887k793312l571927
$$ 569115877 569649458 569767416 569422126 569024265 568738043 568006158 566255271 563461959 559890032
693.5E59890032m422307n771101o658256o731093p762789r912134j1554539j1881560
$$ 559890032 555467725 549696624 543038368 536307275 528544486 518632352 507077813 495196253
709.8D95196253r834975n402654j532942M56214L116041P600695J2407780J6252040
$$ 495196253 485361278 479958624 478425682 478881896 481997937 489598632 502006412 518258452
726.1E18258452J8320203J8100083J6103506J3443411J0727286Q017778N638063L886521
$$ 518258452 536578655 554678738 570782244 584225655 594952941 602970719 608608782 612495303
742.4F12495303K692044J931965J380086P81238K52903N2333Q4817M7803j33395k62678
$$ 612495303 615187347 617119312 618499398 619280636 619533539 619585872 619670689 619718492 619585097 619322419
762.8F19322419j90198J59383O24477Q19862O87719N57363O69181R35853J071930R20057
$$ 619322419 619132221 619291604 619916081 620735943 621423662 621981025 622650206 623586059 624657989 625578046
783.2F25578046N72920K36869J26600J09434l1591k21133k69532J2934L69430K99096
$$ 625578046 626150966 626387835 626514435 626623869 626592278 626371145 626101613 626114547 626483977 626783073
803.6F26783073j03593l71456m05967l92914o69718j272023j617491j484156j323819
$$ 626783073 626679480 626308024 625902057 625509143 624839425 623567402 621949911 620465755 619141936
821.9F19141936j556277k205908k909005l207385l285826l794193m872203o025135
$$ 619141936 617585659 615379751 612470746 609263361 605977535 602183342 597311139 591286004
838.3E91286004p082880q543491j1304677j4054894j1961520o780922o792605j1087776
$$ 591286004 584203124 575659633 564354956 550300062 538338542 531557620 524765015 513677239
854.6E13677239j3657331j5272230j8803567k5066822l5346896n1232964o6214502
$$ 513677239 500019908 484747678 465944111 440877289 405530393 354297429 288082927
868.9B88082927o3087433l8743138j2415559O299884K3992434M2238280N6541562O4937919
$$ 288082927 224995494 186252356 173836797 180136681 204129115 246367395 302908957 367846876
885.2C67846876O5905363N7514280M3065220K9539168K0384908J4474272J0258079
$$ 367846876 433752239 491266519 534331739 563870907 584255815 598730087 608988166
899.4F08988166P537544O088137N007327L656208K326548J643479J583398J362562
$$ 608988166 616525710 622613847 627621174 631277382 633603930 635247409 636830807 638193369
915.8F38193369M86553n51463r24408o01053l29733o41704j136660j005292k76983
$$ 638193369 638679922 638128459 637204051 636602998 636273265 635631561 634494901 633489609 633212626
934.1F33212626J92165n3882n05626m59254M2498J44362o72757j834989k443135k412378
$$ 633212626 633404791 633350909 632845283 632386029 632428527 632572889 631900132 630065143 627622008 625209630
954.5F25209630k540052l348351m295826m594505m380882m447460n187809o138206
$$ 625209630 622669578 619321227 615025401 610430896 606050014 601602554 596414745 590276539
970.8E90276539o626784o766022p355869q652627r961188j0549962j0416508j0163486
$$ 590276539 583649755 576883733 569527864 560875237 550914049 540364087 529947579 519784093
987.1E19784093j0152459j0015995r271949q164644p283628o898344o821632o765306
$$ 519784093 509631634 499615639 490343690 482179046 474895418 467997074 461175442 454410136
1003.5D54410136o827623p223576p903606q429140q305847p478446o271839n037487
$$ 454410136 447582513 440358937 432455331 424026191 415720344 408241898 401970059 396932572
1019.8C96932572l838211k474457r79811K06858Q05735J018763J172841J352995J345158
$$ 396932572 393094361 390619904 389640093 389846951 390652686 391671449 392844290 394197285 395542443
1038.1C95542443Q85218J84119k41637k34753J1354L68298R69827J970261L143877
$$ 395542443 396427661 396611780 396370143 396135390 396146744 396515042 397484869 399455130 402599007
1056.5D02599007M081964M560709M384131L483802J926511k41279k726347m710257
$$ 402599007 406680971 411241680 415625811 419109613 421036124 420794845 418068498 413358241
1072.8D13358241n266815m354864k943844j583666K79337K473206M038721M926205
$$ 413358241 408091426 403736562 400792718 399209052 399488389 401961595 406000316 410926521
1089.1D10926521N278766M807264L608316K193272R48310J17898j21892J95325Q38667
$$ 410926521 416205287 421012551 424620867 426814139 427762449 427880347 427758455 427953780 428792447
1107.5D28792447J503408J944512K123594K098561J911222J611263J282543J053721
$$ 428792447 430295855 432240367 434363961 436462522 438373744 439985007 441267550 442321271
1123.8D42321271J005590J098692J110166P62880k6256j009166j870334k539933l039866
$$ 442321271 443326861 444425553 445535719 446298599 446272343 445263177 443392843 440852910 437813044
1142.2D37813044l283620l112793k606482k012044j398265p17461J14143J175642K388596
$$ 437813044 434529424 431416631 428810149 426798105 425399840 424682379 424796522 425972164 428360760
1160.5D28360760L532618M413277M875571M834920M414052L863633L367364K967983
$$ 428360760 431893378 436306655 441182226 446017146 450431198 454294831 457662195 460630178
1176.8D60630178K628863K234310J610756P72685p4476q01921j401037j942187k426267
$$ 460630178 463259041 465493351 467104107 467876792 467802316 467000395 465599358 463657171 461230904
1195.2D61230904k676398k646744k469003k236813k013296j853258j757085j785845
$$ 461230904 458554506 455907762 453438759 451201946 449188650 447335392 445578307 443792462
1211.5D43792462k034396k433657k814859l082008l274619l409714l489345l516406
$$ 443792462 441758066 439324409 436509550 433427542 430152923 426743209 423253864 419737458
1227.8D19737458l497720l430098l280043l086180k930880k863019k825171k756119
$$ 419737458 416239738 412809640 409529597 406443417 403512537 400649518 397824347 395068228
1244.1C95068228k627671k513200k509355k610892k701283k738535k816677k897978
$$ 395068228 392440557 389927357 387418002 384807110 382105827 379367292 376550615 373652637
1260.4C73652637k918720k890140k878964k943605l101796l227204l294081l379225
$$ 373652637 370733917 367843777 364964813 362021208 358919412 355692208 352398127 349018902
1276.8C49018902l462881l527016l540247l560871l637672l793806l989398m190803
$$ 349018902 345556021 342029005 338488758 334927887 331290215 327496409 323507011 319316208
1293.1C19316208m326641m419565m574985m752218m847408m835695m844665m869581
$$ 319316208 314989567 310570002 305995017 301242799 296395391 291559696 286715031 281845450
1309.4B81845450m909455m902780m784316m668594m636883m667491m824028n056932
$$ 281845450 276935995 272033215 267248899 262580305 257943422 253275931 248451903 243394971
1325.7B43394971n208805n325750n353749n278959n257756n476654n635306n395040
$$ 243394971 238186166 232860416 227506667 222227708 216969952 211493298 205857992 200462952
1342B00462952n196646n296245n471021n612299n722522n787820n782872n669311n741790
$$ 200462952 195266306 189970061 184499040 178886741 173164219 167376399 161593527 155924216 150182426
1360.4A50182426o035164n874798n445823n419299n339369n298361n449690n108304
$$ 150182426 144147262 138272464 132826641 127407342 122067973 116769612 111319922 106211618
1376.7A06211618m735768m689500m548229m338727m397809m276090l788709l773101
$$ 106211618 101475850 96786350 92238121 87899394 83501585 79225495 75436786 71663685
1393G1663685m014820l787830l556080l263444k919279k826482k470929k039776j777742
$$ 71663685 67648865 63861035 60304955 57041511 54122232 51295750 48824821 46785045 45007303
1411.4D5007303j474581j133047r14101o10098p9170K92409M90207O00461P37716Q58106
$$ 45007303 43532722 42399675 41485574 40875476 40796306 41088715 41578922 42179383 42917099 43775205
1431.8D3775205Q46222Q47805R41377Q07088O18543N21452M65545M33173M06970L83798
$$ 43775205 44621427 45469232 46410609 47217697 47836240 48357692 48823237 49256410 49663380 50047178
1452.2E0047178K88363K42219M82514P11195O68612P01677Q60497Q84485Q51497J091379
$$ 50047178 50335541 50577760 51060274 51771469 52440081 53141758 54002255 54886740 55738237 56829616
1472.6E6829616J462821J552023J563985J628362J754135J812674J968592K374374
$$ 56829616 58292437 59844460 61408445 63036807 64790942 66603616 68572208 70946582
1488.9G0946582K805717K747916K765610L374100L720671L501237L051117L241203
$$ 70946582 73752299 76500215 79265825 82639925 86360596 89861833 92912950 96154153
1505.2I6154153M610651M614435L889002L783941L855288L979690L987186M464380
$$ 96154153 100764804 105379239 109268241 113052182 116907470 120887160 124874346 129338726
1521.5A29338726M655406M306466M460022M233554M116296M652009M314854L718451
$$ 129338726 133994132 138300598 142760620 146994174 151110470 155762479 160077333 163795784
1537.8A63795784M871756N933031N520031N416826N300939N555749N793839N849108
$$ 163795784 168667540 174600571 180120602 185537428 190838367 196394116 202187955 208037063
1554.1B08037063N628318P208437R535536P185981O122812O314516O406933O687284
$$ 208037063 213665381 220873818 230409354 237595335 243718147 250032663 256439596 263126880
1570.5B63126880N682856M902243N610258N361736M519701M252761M018635L713965
$$ 263126880 268809736 273711979 279322237 284683973 289203674 293456435 297475070 301189035
1586.8C01189035L458768L215075K940833K740652K567708K354205K113551J960009
$$ 301189035 304647803 307862878 310803711 313544363 316112071 318466276 320579827 322539836
1603.1C22539836J786530J583338J409799J230061R04947N32777N83618P53731M39674
$$ 322539836 324326366 325909704 327319503 328549564 329454511 329987288 330570906 331324637 331764311
1621.4C31764311J71214L01510L48896M13716M44978K10643L05265J105428J412898
$$ 331764311 331935525 332237035 332585931 332999647 333444625 333655268 333960533 335065961 336478859
1639.8C36478859J279473J082808J142621J812607J834482J681865K945303L436924
$$ 336478859 337758332 338841140 339983761 341796368 343630850 345312715 348258018 351694942
1656.1C51694942K944886K849460L248870L704787L422886L377318M041433M041493
$$ 351694942 354639828 357489288 360738158 364442945 367865831 371243149 375284582 379326075
1672.4C79326075M076869M505694M172682L556282L575503N021871N371540M570932
$$ 379326075 383402944 387908638 392081320 395637602 399213105 404234976 409606516 414177448
1688.8D14177448M519581M148364M160107M585564M644245N464941M976988M157185
$$ 414177448 418697029 422845393 427005500 431591064 436235309 441700250 446677238 450834423
1705.1D50834423M283935L975928L390193K869129K606601L189236L820329L380180
$$ 450834423 455118358 459094286 462484479 465353608 467960209 471149445 474969774 478349954
1721.4D78349954K912581K741933K417654K113878J853407K213627K968251K660841
$$ 478349954 481262535 484004468 486422122 488536000 490389407 492603034 495571285 498232126
1737.7D98232126K497971K780617K830207K725363K609253K800464L167510K874136
$$ 498232126 500730097 503510714 506340921 509066284 511675537 514476001 517643511 520517647
1754E20517647K462983K353311K162158K204717K200782J769960J372218J093686J182019
$$ 520517647 522980630 525333941 527496099 529700816 531901598 533671558 535043776 536137462 537319481
1772.4E37319481J429797R48667R4116n38826r27031j402319j806736k105295k639294
$$ 537319481 538749278 539697945 539792061 539253235 538326204 536923885 535117149 533011854 530372560
1790.7E30372560k635241j708269j097738p30515J03533J178980J941800K464772L004968
$$ 530372560 527737319 526029050 524931312 524200797 524304330 525483310 527425110 529889882 532894850
1809.1E32894850L641665M072785M202902M296482M262686L883898L451824L359318
$$ 532894850 536536515 540609300 544812202 549108684 553371370 557255268 560707092 564066410
1825.4E64066410L174782L020942L091693K750933K305389K193570J988530J487970
$$ 564066410 567241192 570262134 573353827 576104760 578410149 580603719 582592249 584080219
1841.7E84080219J454056K007067K095938J823782J594425J447737J443207J457036
$$ 584080219 585534275 587541342 589637280 591461062 593055487 594503224 595946431 597403467
1858E97403467J423001J317382J122773R14692J084209J600206J621187J321494J209736
$$ 597403467 598826468 600143850 601266623 602181315 603265524 604865730 606486917 607808411 609018147
1876.4F09018147J220047J188577J126170J077294R93431R94503J170039J139522R69529
$$ 609018147 610238194 611426771 612552941 613630235 614623666 615618169 616788208 617927730 618897259
1894.7F18897259J059652J157939J074374R32514Q68142Q93355R85145J066864R40322
$$ 618897259 619956911 621114850 622189224 623121738 623989880 624883235 625868380 626935244 627875566
1913.1F27875566O83070O64293R58443J016438R23634R44137Q90673Q38339Q37624
$$ 627875566 628558636 629222929 630181372 631197810 632121444 633065581 633956254 634794593 635632217
1931.5F35632217P86960P10189P03633O67811O53445P80225Q28147P68244P66814P49409
$$ 635632217 636419177 637129366 637832999 638500810 639154255 639934480 640762627 641530871 642297685 643047094
1951.9F43047094O59287N66423N24819N86093O53028N96821N29349O63638Q33273Q23856
$$ 643047094 643706381 644272804 644797623 645383716 646036744 646633565 647162914 647826552 648659825 649483681
1972.3F49483681P18772O25432O18934O62148O61552N81205N07772M89771N44131O77586
$$ 649483681 650202453 650827885 651446819 652108967 652770519 653351724 653859496 654349267 654893398 655570984
1992.6F55570984O85811N26667M75108N66364N99145N23687M31180M33743M97341N13196
$$ 655570984 656256795 656783462 657258570 657824934 658424079 658947766 659378946 659812689 660310030 660823226
2013F60823226M28617L67284M28855M91619M89295M38273L85582L92080M49180M55320
$$ 660823226 661251843 661619127 662047982 662539601 663028896 663467169 663852751 664244831 664694011 665149331
2033.4F65149331M14670L91066L82662M13894M51088M41074M16458M14074M23491M47034
$$ 665149331 665564001 665955067 666337729 666751623 667202711 667643785 668060243 668474317 668897808 669344842
2053.8F69344842M46916M08113L83973M06087M52876M50313M05192L92795M28438M33087
$$ 669344842 669791758 670199871 670583844 670989931 671442807 671893120 672298312 672691107 673119545 673552632
2074.2F73552632L87967L66449L99590M28438M14789L69966L08156K93374L39746L90768
$$ 673552632 673940599 674307048 674706638 675135076 675549865 675919831 676227987 676521361 676861107 677251875
2094.6F77251875L77655L24011L05236L20673L23951K78056K30610K31624K66194K84612
$$ 677251875 677629530 677953541 678258777 678579450 678903401 679181457 679412067 679643691 679909885 680194497
2115F80194497K55585J96755J78814K09868K38120K36392K01643K01404K35319K52843
$$ 680194497 680450082 680646837 680825651 681035519 681273639 681510031 681711674 681913078 682148397 682401240
2135.4F82401240K50876K38120K29836K38180K62380K87473K91824K99216L57031M30882
$$ 682401240 682652116 682890236 683120072 683358252 683620632 683908105 684199929 684499145 684856176 685287058
2155.8F85287058M51446M17173M08828M38213M56512M42625M17470M48049M94778M92274
$$ 685287058 685738504 686155677 686564505 687002718 687459230 687901855 688319325 688767374 689262152 689754426
2176.2F89754426M66228M42624M40359M67301M75049M65929M35114L71873L86954M66764
$$ 689754426 690220654 690663278 691103637 691570938 692045987 692511916 692947030 693318903 693705857 694172621
2196.6F94172621M68433L81529L36826L36289L14653L14117L42607L60847L59773L63708
$$ 694172621 694641054 695022583 695359409 695695698 696010351 696324468 696667075 697027922 697387695 697751403
2217F97751403L71277L57986L21448L08096L17931L09408L01361L08692L27170L49224
$$ 697751403 698122680 698480666 698802114 699110210 699428141 699737549 700038910 700347602 700674772 701023996
2237.4G01023996L36110K72453K69473L27766L24607K92062L00110L09646L08037L16858
$$ 701023996 701360106 701632559 701902032 702229798 702554405 702846467 703146577 703456223 703764260 704081118
2257.8G04081118K99752K82287L18170L68536L59892K94507K33114K52664L13759L25143
$$ 704081118 704380870 704663157 704981327 705349863 705709755 706004262 706237376 706490040 706803799 707128942
2278.2G07128942L26693K99096K40505K10881J70648J04308O4016P7069J15335J33991
$$ 707128942 707455635 707754731 707995236 708206117 708376765 708481073 708545089 708622158 708737493 708871484
2298.6G08871484Q8811j6630j11520j36256j34349j54972j37270q7917j42455k81572
$$ 708871484 708960295 708943665 708832145 708695889 708561540 708406568 708269298 708181381 708038926 707757354
2319G07757354l16859j74224l4034j01447j92404p6294O3777Q5533R1135Q9109J93298
$$ 707757354 707440495 707266271 707232237 707130790 706938386 706862092 706925869 707011402 707102537 707191646 707384944
2341.4G07384944O22630J106381P77066k30491r81212j085400p92384l85404L0875
$$ 707384944 708007574 709113955 709891021 709660530 708679318 707593918 706801534 706416130 706447005
2359.8G06447005L35932O16014R33170J140058J194954J175464J126647J061022R91940
$$ 706447005 706782937 707398951 708332121 709472179 710667133 711842597 712969244 714030266 715022206
2378.1G15022206Q96871P20382N18322L54529K46763J72972R3282M4882P8201J03236
$$ 715022206 715919077 716639459 717157781 717512310 717759073 717932045 718025327 718070209 718148410 718251646
2398.5G18251646L1709k8372j0788L2544O0797K7776n1141p9870m7148k0206l9100
$$ 718251646 718283355 718254983 718244195 718276739 718337536 718365312 718314171 718234301 718187153 718166947 718127847
2421G18127847r5010j45018j71542j68145j59741j83999k41876k90990k97546l03388
$$ 718127847 718032837 717887819 717716277 717548132 717388391 717204392 716962516 716671526 716373980 716070592
2441.3G16070592l69131m69268n05507m91142n30422o59048p95722q73029r30071j029313
$$ 716070592 715701461 715232193 714726686 714235544 713705122 713046074 712250352 711377323 710447252 709417939
2461.7G09417939j179576j324475j440346j547098j703680j932680k166629k351701
$$ 709417939 708238363 706913888 705473542 703926444 702222764 700290084 698123455 695771754
2478.1F95771754k471268k564371k702653k850712k920270k898097k800047k675772
$$ 695771754 693300486 690736115 688033462 685182750 682262480 679364383 676564336 673888564
2494.4F73888564k566337k426386k220750k038479j942933j882612j823604j761616
$$ 673888564 671322227 668895841 666675091 664636612 662693679 660811067 658987463 657225847
2510.7F57225847j703381j619160j470864j245618r09984m88818j30415J39892M61221
$$ 657225847 655522466 653903306 652432442 651186824 650276840 649788022 649657607 649797499 650258720
2529F50258720Q41021J194299J456976J610398J714706J827240J930714J953900J923144
$$ 650258720 651099741 652294040 653751016 655361414 657076120 658903360 660834074 662787974 664711118
2547.4F64711118J927495J914084J800239J612603J402081J224279J099825J017749
$$ 664711118 666638613 668552697 670352936 671965539 673367620 674591899 675691724 676709473
2563.7F76709473R33588P79569O28173N75245N35786M33922L21805K17557J68383K19107
$$ 676709473 677643061 678422630 679050803 679626048 680161834 680595756 680917561 681135118 681303501 681522608
2584.1F81522608K45631J72495Q4877P5698J42873J79112J51097J17362J19567K08676
$$ 681522608 681768239 681940734 682025611 682101309 682244182 682423294 682574391 682691753 682811320 683019996
2604.5F83019996L19779L43740L57329M42386N43594O07133O14405N86927O08742P13229
$$ 683019996 683339775 683683515 684040844 684483230 685026824 685633957 686248362 686835289 687444031 688157260
2624.9F88157260Q09789P82311O90937O88911P61568P73609O58274N11586M67122N37514
$$ 688157260 688967049 689749360 690440297 691129208 691890776 692664385 693322659 693834245 694301367 694838881
2645.3F94838881N64993M47214L10480K46167K13087J76251J06573j0788q4162o3300
$$ 694838881 695403874 695851088 696161568 696407735 696620822 696797073 696903646 696892858 696808696 696745396
2665.7F96745396o1930j62303k70963k91407k47001j99378k15530k59698k74479k77341
$$ 696745396 696683466 696521163 696250200 695958793 695711792 695512414 695296884 695037186 694762707 694485366
2686.1F94485366k70962k55764k86281l65675l70740k77698k58685l82721m59492m03762
$$ 694485366 694214404 693958640 693672359 693306684 692935944 692658246 692399561 692016840 691557348 691153586
2706.5F91153586l54409l68476l88801m02749m18007m19021m58658n32627n17308l92676
$$ 691153586 690799177 690430701 690041900 689639151 689221144 688802123 688343465 687810838 687293530 686900854
2726.9F86900854l02613l38316m17649m43519m19259l71873l49402m10140m89652m88639
$$ 686900854 686598241 686259925 685842276 685398757 684979498 684607625 684258223 683848083 683358431 682869792
2747.3F82869792m23372l80873l88563m39644m93109n04732n16653n43297n50627n37456
$$ 682869792 682446420 682065547 681676984 681237340 680744231 680239499 679722846 679179549 678628922 678091466
2767.7F78091466n43594o09755o87600o66856o20962o37888o47605o89208q03352q99970
$$ 678091466 677547872 676938117 676250517 675583661 674962699 674324811 673677206 672987998 672184646 671284676
2788.1F71284676r00865q72016q97288r50694r74596r52005r55284j017332j136005
$$ 671284676 670383811 669511795 668614507 667663813 666689217 665737212 664781928 663764596 662628591
2806.4F62628591j245856j240432j218737j303017j389742j433015j516819j603245
$$ 662628591 661382735 660142303 658923566 657620549 656230807 654797792 653280973 651677728
2822.7F51677728j653672j725018j838564k003968k201855k379895k585411k853751
$$ 651677728 650024056 648299038 646460474 644456506 642254651 639874756 637289345 634435594
2839.1F34435594l237367l856241m575491m869163m181087k735615j403630o63996
$$ 634435594 631198227 627341986 622766495 617897332 613716245 610980630 609577000 608913004
2855.4F08913004m88340o36638q74877j182615j526654j804292k007902k076268j892865
$$ 608913004 608424664 607788026 606913149 605730534 604203880 602399588 600391686 598315418 596422553
2873.7E96422553j582801j421631j434564j451552j395941j326621j300275j259565
$$ 596422553 594839752 593418121 591983557 590532005 589136064 587809443 586509168 585249603
2890.1E85249603j189470j139284j062214r84252j025080j136840j243174j417339
$$ 585249603 584060133 582920849 581858635 580874383 579849303 578712463 577469289 576051950
2906.4E76051950j787960k403498l048956l332138l022969k222002j298904o05941
$$ 576051950 574263990 571860492 568811536 565479398 562456429 560234427 558935523 558329582
2922.7E58329582j48415K10940N08786P81953J005948J192629J410007J559973J520336
$$ 558329582 558181167 558392107 558900893 559682846 560688794 561881423 563291430 564851403 566371739
2941E66371739J398325J348078J299441J098752P90894O00159N68807N99206O84321
$$ 566371739 567770064 569118142 570417583 571516335 572307229 572907388 573476195 574075401 574759722
2959.4E74759722P89881R29176J144290J331985J432598J453340J401126J328111J188159
$$ 574759722 575549603 576478779 577623069 578955054 580387652 581840992 583242118 584570229 585758388
2977.8E85758388J039565J032948J026929Q82446P11441N73934M70399M34637L91186
$$ 585758388 586797953 587830901 588857830 589740276 590451717 591025651 591496050 591930687 592321873
2996.1E92321873L46243L17931K06292J03295P6294l0279k00808k10047p1645p033
$$ 592321873 592668116 592986047 593192339 593295634 593371928 593341649 593140841 592930794 592859149 592852116
3016.5E92852116o7711j98186l62932n22912o54042p37905p81834q20279q20518q64148
$$ 592852116 592784405 592586219 592223287 591700375 591046333 590308428 589526594 588706315 587885797 587021649
3036.9E87021649j052201j156449j062751j008093j101613j219392j248181j202166
$$ 587021649 585969448 584812999 583750248 582742155 581640542 580421150 579172969 577970803
3053.2E77970803j166463j152516j170516j261174j324237j281976j174689j094341
$$ 577970803 576804340 575651824 574481308 573220134 571895897 570613921 569439232 568344891
3069.5E68344891j123488j218080j304508j334846j276076j199126j172721j172304
$$ 568344891 567221403 566003323 564698815 563363969 562087893 560888767 559716046 558543742
3085.8E58543742j199544j231432j239657j272500j320302j370728j394868j348198
$$ 558543742 557344198 556112766 554873109 553600609 552280307 550909579 549514711 548166513
3102.2E48166513j349747j429677j425087j365900j440525j602948j640856j551748
$$ 548166513 546816766 545387089 543962002 542596102 541155577 539552629 537911773 536360025
3118.5E36360025j473546j495182j614809j703322j704872j678049j680672j739264
$$ 536360025 534886479 533391297 531776488 530073166 528368294 526690245 525009573 523270309
3134.8E23270309j815021j831830j787066j785517j850366j905740j937747j966774
$$ 523270309 521455288 519623458 517836392 516050875 514200509 512294769 510357022 508390248
3151.1E08390248j968205j959264j970590j960158j972407k047032k085328k081365
$$ 508390248 506422043 504462779 502492189 500532031 498559624 496512592 494427264 492345899
3167.4D92345899k073496k043784k056688k113938k099306k034574k054513k131522
$$ 492345899 490272403 488228619 486171931 484057993 481958687 479924113 477869600 475738078
3183.7D75738078k171725k151668k068519k020479k075135k129257k100170k027690
$$ 475738078 473566353 471414685 469346166 467325687 465250552 463121295 461021125 458993435
3200.1D58993435j982242k016813k073943k052337j985490j960546j973838j949340
$$ 458993435 457011193 454994380 452920437 450868100 448882610 446922064 444948226 442998886
3216.4D42998886j919210j932889j924604j915097j928062j893073j861364j872331
$$ 442998886 441079676 439146787 437222183 435307086 433379024 431485951 429624587 427752256
3232.7D27752256j856416j832843j837730j828641j797676j794368j833528j863838
$$ 427752256 425895840 424062997 422225267 420396626 418598950 416804582 414971054 413107216
3249D13107216j811653j733065j740515j806259j833051j789481j739204j722723j706869
$$ 413107216 411295563 409562498 407821983 406015724 404182673 402393192 400653988 398931265 397224396
3267.4C97224396j683235j674413j647890j567721j495690j470178j441061j399160
$$ 397224396 395541161 393866748 392218858 390651137 389155447 387685269 386244208 384845048
3283.7C84845048j360863j345516j341193j280427j224131j262188j303553j278639
$$ 384845048 383484185 382138669 380797476 379517049 378292918 377030730 375727177 374448538
3300C74448538j213163j146913j161516j232802j274169j276463j259327j282543j331270
$$ 374448538 373235375 372088462 370926946 369694144 368419975 367143512 365884185 364601642 363270372
3318.4C63270372j340329j338244j350284j372635j413047j449257j461596j412451
$$ 363270372 361930043 360591799 359241515 357868880 356455833 355006576 353544980 352132529
3334.7C52132529j338124j348049j378506j325637j242280j165509j075328j051903
$$ 352132529 350794405 349446356 348067850 346742213 345499933 344334424 343259096 342207193
3351C42207193j115977j097709r44764q60899r16154r46402q76010p73757p40618p95454
$$ 342207193 341091216 339993507 339048743 338187844 337271690 336325288 335449278 334675521 333934903 333139449
3371.4C33139449q11517p34359o41704o02513o43790o18964n02706m16189l18408k93523
$$ 333139449 332327932 331593573 330951869 330349356 329705566 329086602 328583896 328167707 327849299 327555776
3391.8C27555776m05074m21762k73734j63883j99646k66731j89930o6876k4498J9103
$$ 327555776 327150702 326728940 326455206 326291323 326091677 325824946 325635016 325568140 325543642 325562745
3412.2C25562745L3558k682N6982J74552K19136K68251L64810M52459N01782N55247
$$ 325562745 325596303 325593621 325650603 325825155 326044291 326312542 326677352 327129811 327631593 328186840
3432.6C28186840N76854N13523M42714M47392N73546P37727Q48114R13203R43661R53436
$$ 328186840 328763694 329277217 329719931 330167323 330740869 331478596 332326710 333239913 334183574 335137010
3453C35137010J012444J127780J172959J115561J139522J295089J414120J353950J194536
$$ 335137010 336149454 337277234 338450193 339565754 340705276 342000365 343414485 344768435 345962971
3471.3C45962971J188517J339823J484513J511991J493574J515895J562208J616776
$$ 345962971 347151488 348491311 349975824 351487815 352981389 354497284 356059492 357676268
3487.6C57676268J674145J739889J746417J761496J800745J792789J839846J915008
$$ 357676268 359350413 361090302 362836719 364598215 366398960 368191749 370031595 371946603
3504C71946603J849800J854182K058714K195001K156168K068699K044409K069891K155572
$$ 371946603 373796403 375650585 377709299 379904300 382060468 384129167 386173576 388243467 390399039
3522.3C90399039K196193K176523K298772K481014K513796K513051K551406K521426
$$ 390399039 392595232 394771755 397070527 399551541 402065337 404578388 407129794 409651220
3538.6D09651220K505958K543241K653241K789289K757012K722085K924114K994985
$$ 409651220 412157178 414700419 417353660 420142949 422899961 425622046 428546160 431541145
3554.9D31541145K850771K885639K938927K716154K724379L521621L999353L533452
$$ 431541145 434391916 437277555 440216482 442932636 445657015 449178636 453177989 456711441
3571.3D56711441L204674L302842L419459L470510L445119L188372L092050L701478
$$ 456711441 459916115 463218957 466638416 470108926 473554045 476742417 479834467 483535945
3587.6D83535945M048407L515959L417105L805488L833115L749609L800690L527105
$$ 483535945 487584352 491100311 494517416 498322904 502156019 505905628 509706318 513233423
3603.9E13233423L230334L636956L974855L702700L422260L047586L315925M295409
$$ 513233423 516463757 520100713 524075568 527778268 531200528 534248114 537564039 541859448
3620.2E41859448M097521L125251K823531M256666N459607M220426L580331L708244
$$ 541859448 545956969 549082220 551905751 556162417 561622024 565842450 569422781 573131025
3636.5E73131025L575742L371894K927602K217412K220809L883720M927814L420412
$$ 573131025 576706767 580078661 583006263 585223675 587444484 591328204 596256018 599676430
3652.8E99676430K570570L327369L294707K530992K244055J827538J289725J811028
$$ 599676430 602247000 605574369 608869076 611400068 613644123 615471661 616761386 618572414
3669.2F18572414K439916J713276K341270L223718K080083J334548R28342L27527N03123
$$ 618572414 621012330 622725606 625066876 628290594 630370677 631705225 632633567 632961094 633464217
3687.5F33464217J465559J540423Q79109N63502N00023P18653J441181J671255R11891
$$ 633464217 634929776 636470199 637349308 637912810 638412833 639131486 640572667 642243922 643155813
3705.9F43155813M63248R82999J984120J863718P73847J82629K01284M15326N91039
$$ 643155813 643619061 644602060 646586180 648449898 649223745 649406374 649607658 650022984 650614023
3724.2F50614023P03216L60966k77281k98798N86986J534283J001895n15044q10265
$$ 650614023 651317239 651678205 651400924 651102126 651689112 653223395 654225290 653710246 652899981
3742.6F52899981P58528R04858j21653Q75533J569033M09364j32978M17292O75381
$$ 652899981 653658509 654563367 654441714 655317247 656886280 657295644 657162666 657579958 658255339
3760.9F58255339J07586j01387J20639M63665Q00967L69370k62797j96457L42667L96550
$$ 658255339 658362925 658261538 658382177 658845842 659646809 660016179 659753382 659556925 659899592 660296142
3781.3F60296142K0743J36494L63827K27690q7321m94361n36263l64900j91748O33896
$$ 660296142 660316885 660453379 660817206 661044896 660957575 660463214 659926951 659562051 659370303 660004199
3801.7F60004199O07252Q1122O54518M01437o66141q89540j27673P2956R3997R93371
$$ 660004199 660611451 660692573 661347091 661748528 661082387 660192847 660065174 660138130 660232127 661225498
3822.1F61225498N77509j81377k18332l63230l85821l82841j90496N73337Q12173M55916
$$ 661225498 661803007 661621630 661403298 661040068 660654247 660271406 660080910 660654247 661466420 661922336
3842.5F61922336K63571k77876j262486j707435R7871K432108R17852p42257q04961
$$ 661922336 662185907 661908031 660645545 658938110 659035981 661468089 662385941 661643684 660838723
3860.9F60838723k57373R3103k51770j26660O26027M84944J06513l33488n13255m7803
$$ 660838723 660581350 660674453 660422683 660296023 660922050 661406994 661513507 661180019 660666764 660618961
3881.3F60618961p8142J24514K74956k86996O3241M27365m08590r43303n93543L8743
$$ 660618961 660540819 660665333 660940289 660653293 660716534 661143899 660735309 659792006 659198463 659237206
3901.7F59237206P34329R47952L12627j97411l01361m95791m45366N2035J80483j33098
$$ 659237206 659971535 660919487 661232114 661034703 660733342 660237551 659792185 659844220 660024703 659891605
3922.1F59891605j30057r060k79069l03268J79171L11852k3782k64347k71320q0586
$$ 659891605 659761548 659752488 659473419 659170151 659349322 659661174 659637392 659373045 659101725 659021139
3942.5F59021139q404j66357j25408L7670M7565l2544j35124j42932j9193P2360Q94
$$ 659021139 659012735 658846378 658720970 658758640 658806205 658773661 658638537 658495605 658476412 658548772 658549666
3964.9F58549666j04785j04129q6129q8393m0412m0233j31011r5725L3795J7882j00434
$$ 658549666 658444881 658340752 658254623 658166230 658125818 658085585 657954574 657858849 657892644 657910526 657810092
3987.3F57810092j51038j02759k3603J2875n0188
$$ 657810092 657659054 657556295 657532692 657545567 657495379
3997.5F57495379
$$ 657495379
##END=$$ End of the data block
