##TITLE=$$ Begin of the data block
##JCAMP-DX=5.00 $$ ACD/SpecManager v 10.08
##SPECTROMETER/DATA SYSTEM=Alpha
##DATE=11 Jun 2014 19:36:16
##DATA TYPE=INFRARED SPECTRUM
##DATA CLASS=XYDATA
##ORIGIN=
##OWNER=
##NPOINTS=1765
##FIRSTX=399.75695801
##LASTX=3997.56933594
##MAXX=3997.56933594
##MINX=399.75695801
##MAXY=0.71988767
##MINY=0.04074014
##XFACTOR=1.0000000000
##YFACTOR=1.000000000000000e-9
##FIRSTY=0.30886087
##DELTAX=2.03957629
##XUNITS=1/CM
##YUNITS=ARBITRARY UNITS
##XYDATA=(X++(Y..Y))
399.8C08860868R079308Q956283Q965105Q953452Q747935Q518070Q355141P782072
$$ 308860868 317940176 326896459 335861564 344815016 353562951 362081021 370436162 378218234
416.1C78218234P899791Q423239P620126P004410O377160N484283N472660N916089
$$ 378218234 386118025 394541264 402161390 409165800 415542960 421027243 426499903 432415992
432.4D32415992N673111M968434M782468N143225N373508M800975L890485L546506
$$ 432415992 438089103 443057537 447840005 452983230 458356738 463157713 467048198 470594704
448.7D70594704L658176L604054K910048K172321K145559K608776K825051K315462
$$ 470594704 474252880 477856934 480766982 482939303 485084862 487693638 490518689 492834151
465D92834151J599878J640051K575726L562659L314853K501249K604842L332913L624141
$$ 492834151 494434029 496074080 498649806 502212465 505527318 508028567 510633409 513966322 517590463
483.4E17590463K972305J926422J828373K844095L198802K034366Q76487J091957K126694
$$ 517590463 520562768 522489190 524317563 527161658 530360460 532394826 533271313 534363270 536489964
501.7E36489964K221822J051724K38538O29962J226305R00150j61469p79450j40071
$$ 536489964 538711786 539763510 540002048 540632010 541858315 542758465 542596996 541817546 541677475
520.1E41677475R15885J049995K40028l91185K0683J005173J320302Q67009O42598
$$ 541677475 542593360 543643355 543883383 543492198 543512881 544518054 545838356 546705365 547347963
538.4E47347963J167774J984596J950741Q10146j31130J62482Q57652O29842m54128
$$ 547347963 548515737 550500333 552451074 553261220 553130090 553292572 554150224 554780066 554325938
556.8E54325938j107692m63725O25670P63119j52588r04322o51538P450J96338j33216
$$ 554325938 553218246 552754521 553380191 554143310 553990722 553086400 552434862 552442312 552638650 552505434
577.2E52505434j88590O43611J713634J852393J061618M54963P36236J269281J024246
$$ 552505434 552316844 552960455 554674089 556526482 557588100 558043063 558779299 560048580 561072826
595.6E61072826K8372q06331q34763n86212r40263j592994j529098o22213L77953P67172
$$ 561072826 561101198 560294867 559460104 558873892 557933629 556340635 554811537 554189324 554567277 555334449
616E55334449O23405P10606J209200J627087J510203R16601N79774J128316K019524
$$ 555334449 555957854 556668460 557877660 559504747 561014950 561931551 562511325 563639641 565659165
634.3E65659165K095223J363098Q71540J020372J248359R46045J36554n03182m75526
$$ 565659165 567754388 569117486 569989026 571009398 572257757 573203802 573340356 572837174 572361648
652.7E72361648j77205k71677p87914j159668q80897m67658r55522j205445O5148O04212
$$ 572361648 572184443 571912766 571124852 569965184 569084287 568616629 567661107 566455662 566520810 567125022
673.1E67125022O58274N73158J04130l93808m36127l52025p65026j672745k672791
$$ 567125022 567783296 568356454 568460584 568066776 567630649 567278624 566513598 564840853 562168062
691.4E62168062l517688m457593n806505o699264o836832p811129r864509j1535227
$$ 562168062 558650374 554192781 548386276 541687012 534850180 527039051 517174542 505639315
707.7E05639315j1847109r742945n363703j553774M62234L155142P629573J2485475
$$ 505639315 493792206 484049261 478685558 477131784 477594018 480749160 488378733 500864208
724E00864208J6352772J8268347J7975390J6072393J3405144J0654449Q047700N720675
$$ 500864208 517216980 535485327 553460717 569533110 582938254 593592703 601640403 607361078
740.4F07361078L903866K653599J859188J331508Q01802K95758R8407J24455R0241
$$ 607361078 611264944 613918543 615777731 617109239 617911041 618206799 618305206 618429661 618519902
758.7F18519902r1910l00706k43365J95324O66559Q07702O97196O19471O75797Q68082
$$ 618519902 618427992 618127286 617883921 618079245 618745804 619553506 620250702 620870173 621545970 622414052
779.1F22414052J075387R84312N68628J98603J23441J46150P570k34246l02017n483
$$ 622414052 623489439 624473751 625042379 625240982 625364423 625510573 625518143 625283897 624981880 624976397
799.5F24976397L69846L33250p9632l91900m20988l72410o23643j213610j597345j482249
$$ 624976397 625346243 625679493 625599861 625207961 624786973 624414563 623790920 622577310 620979965 619497716
819.9F19497716j337289j619876k223015k843320l123105l211975l783285m939020
$$ 619497716 618160427 616540551 614317536 611474216 608351111 605139136 601355851 596416831
836.2E96416831o070077p050038q471131j1247754j4052570j1993706o830871o825507
$$ 596416831 590346754 583296716 574825585 563577831 549525261 537531555 530700684 523875177
852.5E23875177j1045098j3578207j5214950j8767207k5027216l5275906n1124484
$$ 523875177 512830079 499251872 484036922 465269715 440242499 404966593 353842109
866.8C53842109o6085845o2969222l8676262j2401015O309927K4022221M2254403N6512535
$$ 353842109 287756264 224787042 186110780 173709765 180019692 204041913 246296316 302808851
883.1C02808851O4874083O5824926N7463050M3087482K9576004K0361781J4430165
$$ 302808851 367682934 433507860 490970910 534058392 563634396 583996177 598426342
897.4E98426342J0255814P561683O086350M971444L644526K350748J608908J496077
$$ 598426342 608682156 616243839 622330189 627301633 630946159 633296907 634905815 636401892
913.7F36401892J342237N36918n15818r21130n85854l22402o71029j148760j004994
$$ 636401892 637744129 638281047 637765229 636844099 636258245 635935843 635264814 634116054 633111060
932.1F33111060k94566K00152j1802m85539m69029L1173J19686o95526j815975k416432
$$ 633111060 632816494 633016646 633004844 632519305 632050276 632081449 632201135 631505609 629689634 627273202
952.5F27273202k422750k565384l362477m304290m610598m394769m440666n172908
$$ 627273202 624850452 622285068 618922591 614618301 610007703 605612934 601172268 595999360
968.8E95999360o112218o606817o795049p373273q617282r937108j0551989j0425389
$$ 595999360 589887142 583280325 576485276 569112003 560494721 550557613 540005624 529580235
985.1E29580235j0170996j0137915r997219r274811q144259p227868o871372o821186
$$ 529580235 519409239 509271324 499274105 489999294 481855035 474627167 467755795 460934609
1001.4D60934609o750673o807059p225424p916301q420706q275479p456482o321072
$$ 460934609 454183936 447376877 440151453 432235152 423814446 415538967 408082485 401761413
1017.7D01761413n116374l837078k436072r82106K01255Q17359J035154J228123J395971
$$ 401761413 396645039 392807961 390371889 389389783 389591038 390408397 391443551 392671674 394067645
1036.1C94067645J308709Q42244J77294k58327k51144K2412L62783R51499J982659
$$ 394067645 395376354 396218598 396395892 396137565 395886421 395908833 396271616 397223115 399205774
1054.5C99205774L176719M129618M582048M318595L396779J910001k17408k707481
$$ 399205774 402382493 406512111 411094159 415412754 418809533 420719534 420502126 417794645
1070.8D17794645m669666n225540m394680l016889j578778L32624K483576L995359
$$ 417794645 413124979 407899439 403504759 400487870 398909092 399241716 401725292 405720651
1087.1D05720651M896850N306601M836768L585696K163440R63181J42485j22875J93417
$$ 405720651 410617501 415924102 420760870 424346566 426510006 427473187 427615672 427492797 427686214
1105.4D27686214Q53211J541287J980632K108813K072066J912445J609861J278341
$$ 427686214 428539425 430080712 432061344 434170157 436242223 438154668 439764529 441042870
1121.8D41042870J048535R96918J115650J138091P54356m4077r93878j860708k562016
$$ 441042870 442091405 443088323 444203973 445342064 446096420 446052343 445058465 443197757 440635741
1140.1D40635741l060311l280938l106654k586931j954764j373678p45684J00255J179427
$$ 440635741 437575430 434294492 431187838 428600907 426646143 425272465 424526781 424627036 425806463
1158.5D25806463K385735L517181M392654M849106M799306M394472L876477L383577
$$ 425806463 428192198 431709379 436102033 440951139 445750445 450144917 454021394 457404971
1174.8D57404971K954573K580732K170205J597196Q14706m4793p81208j380444j939863
$$ 457404971 460359544 462940276 465110481 466707677 467522383 467477590 466696382 465315938 463376075
1193.1D63376075k412856k659112k648473k472877k248138k023518j847685j754105
$$ 463376075 460963219 458304107 455655634 453182757 450934619 448911101 447063416 445309311
1209.5D45309311j803756k055883k423465k806843l098160l274411l397524l476500
$$ 445309311 443505555 441449672 439026207 436219364 433121204 429846793 426449269 422972769
1225.8D22972769l499121l480822l410011l283203l120422k947331k841562k790183
$$ 422972769 419473648 415992826 412582815 409299612 406179190 403231859 400390297 397600114
1242.1C97600114k726018k627134k561689k565265k602994k645791k728849k855033
$$ 397600114 394874096 392246962 389685273 387120008 384517014 381871223 379142374 376287341
1258.4C76287341k921939k937197k907008k864212k912700l074408l205657l275752
$$ 376287341 373365402 370428205 367521197 364656985 361744285 358669877 355464220 352188468
1274.7C52188468l351480l450691l556312l578364l575534l647208l804565l981918
$$ 352188468 348836988 345386297 341829985 338251621 334676087 331028879 327224314 323242396
1291C23242396m172832m327505m455388m597008m733861m836857m844576m844159m858971
$$ 323242396 319069564 314742059 310286671 305689663 300955802 296118945 291274369 286430210 281571239
1309.4B81571239m914552m906565m755020m642427m652619m694879m816413n013988
$$ 281571239 276656687 271750122 266995102 262352675 257700056 253005177 248188764 243174776
1325.7B43174776n176648n328909n353883n258470n259618n509690n639777n359932
$$ 243174776 237998128 232669219 227315336 222056866 216797248 211287558 205647781 200287849
1342B00287849n183846n320162n491018n611047n727604n807579n781874n648643n733624
$$ 200287849 195104003 189783841 184292823 178681776 172954172 167146593 161364719 155716076 149982452
1360.4A49982452o027206n846918n422279n410537n330846n294956n462803n138099
$$ 149982452 143955246 138108328 132686049 127275512 121944666 116649710 111186907 106048808
1376.7A06048808m761294m688710m543208m336230m362658m226960l765203l769703
$$ 106048808 101287514 96598804 92055596 87719366 83356708 79129748 75364545 71594842
1393G1594842m042253l811643l521423l225528k915610k820629k469693k051756j762166
$$ 71594842 67552589 63740946 60219523 56993995 54078385 51257756 48788063 46736307 44974141
1411.4D4974141j446575j142975r37440o16025r0986K95542N32713O45153P45609Q27745
$$ 44974141 43527566 42384591 41447151 40831126 40740140 41035682 41568395 42213548 42959157 43786902
1431.8D3786902Q10847Q18152R13929Q21348O76762N60184M52786M13209L99989L62459
$$ 43786902 44597749 45415901 46329830 47151178 47827940 48388124 48840910 49254119 49654108 50016567
1452.2E0016567K71950K69335N05756O82142O50782P31152Q78941Q68302Q52879J115113
$$ 50016567 50288517 50557852 51063608 51745750 52396532 53127684 54006625 54874927 55727806 56842919
1472.6E6842919J465690J530006J550205J639575J793578J847625J956597K335072
$$ 56842919 58308609 59838615 61388820 63028395 64821973 66669598 68626195 70961267
1488.9G0961267K789035K767161K784207L367908L733591L529913L048026L218099
$$ 70961267 73750302 76517463 79301670 82669578 86403169 89933082 92981108 96199207
1505.2I6199207M609562M631110L895007L770948L852784M025057M014865M427164
$$ 96199207 100808769 105439879 109334886 113105834 116958618 120983675 124998540 129425704
1521.5A29425704M630968M314200M469052M225075M101157M673511M359707L736883
$$ 129425704 134056672 138370872 142839924 147064999 151166156 155839667 160199374 163936257
1537.8A63936257M873425N960912N531355N406663N296380N554467N803496N862891
$$ 163936257 168809682 174770594 180301949 185708612 191004992 196559459 202362955 208225846
1554.1B08225846N624056P184670R543299P214323O130159O299644O372303O651372
$$ 208225846 213849902 221034572 230577871 237792194 243922353 250221997 256594300 263245672
1570.5B63245672N664617M889160N612016N386412M513711M202157L992319L750712
$$ 263245672 268910289 273799449 279411465 284797877 289311588 293513745 297506064 301256776
1586.8C01256776L500998L223300K929389K700955K502054K320677K131373J958161
$$ 301256776 304757774 307981074 310910463 313611418 316113472 318434149 320565522 322523683
1603.1C22523683J747608J558185J393825J207292Q73804M68731M95195P07269M19200
$$ 322523683 324271291 325829476 327223301 328430593 329304397 329773128 330268323 330975592 331394792
1621.4C31394792J47521K96205L58552M15951M24475J62989K74002J140773J459986
$$ 331394792 331542313 331838518 332197070 332613021 333037496 333200485 333474487 334615260 336075246
1639.8C36075246J303763J106530J178265J833081J831055J667171K971262L496647
$$ 336075246 337379009 338485539 339663804 341496885 343327940 344995111 347966373 351463020
1656.1C51463020K983183K878040L270775L711790L428995L415197M132301M132509
$$ 351463020 354446203 357324243 360595018 364306808 367735803 371151000 375283301 379415810
1672.4C79415810M135072M534185M179895L554285L549814M988194N413711M645466
$$ 379415810 383550882 388085067 392264962 395819247 399369061 404357255 409770966 414416432
1688.8D14416432M553497M159570M184067M608482M643202N451173M985392M179060
$$ 414416432 418969929 423129499 427313566 431922048 436565250 442016423 447001815 451180875
1705.1D51180875M306913M008680L440947K916842K618105L172934L820449L396243
$$ 451180875 455487788 459496468 462937415 465854257 468472362 471645296 475465745 478861988
1721.4D78861988K922058K755165K432585K107679J850218K241790K993673K670318
$$ 478861988 481784046 484539211 486971796 489079475 490929693 493171483 496165156 498835474
1737.7D98835474K511412K794326K833783K715826K602041K825737L206789K891481
$$ 498835474 501346886 504141212 506974995 509690821 512292862 515118599 518325388 521216869
1754E21216869K487421K386392K138793K131104K175272J807213J410842J122117J197159
$$ 521216869 523704290 526090682 528229475 530360579 532535851 534343064 535753906 536876023 538073182
1772.4E38073182J411736R48787J35541n08368r43840j426458j827419k153635k681315
$$ 538073182 539484918 540433705 540569246 540060878 539117038 537690580 535863161 533709526 531028211
1790.7E31028211k627313j678884j074493p08044J18733J178861J947104K477408K996445
$$ 531028211 528400898 526722014 525647521 524939477 525058210 526237071 528184175 530661583 533658028
1809.1E33658028L627360M095852M245043M324138M273653L878057L460944L377497
$$ 533658028 537285388 541381240 545626283 549950421 554224074 558102131 561563075 564940572
1825.4E64940572L128946K957880L097952K796530K358198K230168K007127J503586
$$ 564940572 568069518 571027398 574125350 576921880 579280078 581510246 583517373 585020959
1841.7E85020959J433790J965821K095878J851916J607478J425683J410544J467407
$$ 585020959 586454749 588420570 590516448 592368364 593975842 595401525 596812069 598279476
1858E98279476J480997J358628J120806R01460J073897J599610J632631J325011J193822
$$ 598279476 599760473 601119101 602239907 603141367 604215264 605814874 607447505 608772516 609966338
1876.4F09966338J201570J179695J115084J064956R98080J024544J200080J150310
$$ 609966338 611167908 612347603 613462687 614527643 615525723 616550267 617750347 618900657
1892.7F18900657R69886J046718J147508J090408R54508Q70169Q76963R42468J022757
$$ 618900657 619870543 620917261 622064769 623155177 624109685 624979854 625856817 626799285 627822042
1911.1F27822042R57906P44700O93262R28461R79960R25422R63330R10282Q60453Q41498
$$ 627822042 628779948 629524648 630217910 631146371 632126331 633051753 634015083 634925365 635785818 636627316
1931.5F36627316P82907P26700P30872O70016O12438P44522Q36193P81059P58470P35044
$$ 636627316 637410223 638136923 638867795 639537811 640150249 640894771 641730964 642512023 643270493 644005537
1951.9F44005537O57320N88119N57423N99384O32823N63025N13315O75559Q60930Q48829
$$ 644005537 644662857 645250976 645808399 646407783 647040606 647603631 648116946 648792505 649653435 650502264
1972.3F50502264P34568O32048O07073O39021O55354N86688N02527M79042N42105O70254
$$ 650502264 651236832 651868880 652475953 653114974 653770328 654357016 654859543 655338585 655880690 656550944
1992.6F56550944O67810N25415M84944N63919N95570N30779M32551M23849M93943N12064
$$ 656550944 657218754 657744169 658229113 658793032 659388602 659919381 660351932 660775781 661269724 661781788
2013F61781788M32849L86894M47213N02765M98772M41968L77059L65198M40955M97997
$$ 661781788 662214637 662601531 663048744 663551509 664050281 664492249 664869308 665234506 665675461 666173458
2033.4F66173458M40538L61800L70562M55797N02706M49657L71039L66688M33027M84944
$$ 666173458 666613996 666975796 667346358 667802155 668304861 668754518 669125557 669492245 669925272 670410216
2053.8F70410216M39525L80277L96013M21703M35293M32909L99947L87132M43756M66228
$$ 670410216 670849741 671230018 671626031 672047734 672483027 672915936 673315883 673703015 674146771 674612999
2074.2F74612999M10974L69012L83139M22835M21226L64960L00943L00348L49522L89397
$$ 674612999 675023973 675392985 675776124 676198959 676620185 676985145 677286088 677586436 677935958 678325355
2094.6F78325355L91960L48270K91646K92301L27527K93911K22444J89960K24352K86401
$$ 678325355 678717315 679065585 679357231 679649532 679977059 680270970 680493414 680683374 680907726 681194127
2115F81194127L03745K46644J65582J65879K40863K69532K16007J99020K57611K95520
$$ 681194127 681497872 681744516 681910098 682075977 682316840 682586372 682802379 683001399 683259010 683554530
2135.4F83554530K58982K13325K16067K64406L28184L33607K78175K75254L45528L87430
$$ 683554530 683813512 684026837 684242904 684507310 684835494 685169101 685447276 685722530 686068058 686455488
2155.8F86455488M01259M15742M33445M56870M65929M52340M22835M28915M58896M77374
$$ 686455488 686856747 687272489 687705934 688162804 688628733 689081073 689503908 689932823 690391719 690869093
2176.2F90869093M94659M94480M60029M44472M64439M66585M44353M18424M28021M55261
$$ 690869093 691363752 691858232 692318261 692762733 693227172 693693757 694138110 694556534 694984555 695439816
2196.6F95439816M23431L48329L33667L61204L49701L36468L60906L80039L63350L50535
$$ 695439816 695863247 696211576 696545243 696906447 697256148 697592616 697953522 698333561 698696911 699047446
2217F99047446L50356L26753L04043L35455L55900L08275K71857K92956L30389L42250
$$ 699047446 699397802 699724555 700028598 700364053 700719953 701028228 701300085 701593041 701923430 702265680
2237.4G02265680L33071L21328L28005L22043K82884K78473L23236L31044L01719L12149
$$ 702265680 702598751 702920079 703248084 703570127 703853011 704131484 704454720 704785764 705087483 705399632
2257.8G05399632L14713K82347K91944L35693L32594L09706L03209L02314L01898L07560
$$ 705399632 705714345 705996692 706288636 706624329 706956923 707266629 707569838 707872152 708174050 708481610
2278.2G08481610L44753L32594K46048J80840J59145J40607R5129P1287J00434J16229
$$ 708481610 708826363 709158957 709405005 709585845 709744990 709885597 709980726 710052013 710152447 710268676
2298.6G10268676Q0228R716p3135r9659r2328j11043j04487r4652j64032k82586l18170
$$ 710268676 710348904 710358620 710285485 710185826 710093498 709982455 709877968 709783316 709619284 709336698 709018528
2321G09018528j96576m5180l3200p3552n364P4744P1824P8976P1466J23500N17667
$$ 709018528 708821952 708776772 708743572 708670020 708664656 708739400 708811224 708890200 708961666 709085166 709602833
2343.5G09602833J072645Q22186j85191r45747j037300p43568l57389J8477L06309
$$ 709602833 710675478 711497664 711312473 710366726 709329426 708585858 708228469 708246946 708553255
2361.8G08553255O58333R89020J103759J119911J105964J063884J000166R27806Q59975
$$ 708553255 709211588 710200608 711304367 712424278 713530242 714594126 715594292 716522098 717382073
2380.2G17382073P32959N46038L55303K26557J54615R0122N5909P0989P6890M1724
$$ 717382073 718115032 718661070 719016373 719242930 719397545 719487667 719543576 719614565 719691455 719733179
2400.6G19733179O020r060L2902Q7320L7313o1572p4267m0412k7478l7670j02103j73151
$$ 719733179 719739199 719730139 719763041 719850361 719887674 719826102 719751835 719711423 719683945 719646275 719544172 719371021
2425G19371021j94252j70469j39356j69813k64228l26693l23236l12209l37183m09484
$$ 719371021 719176769 719006300 718866944 718697131 718432903 718106210 717782974 717470765 717133582 716724098
2445.4G16724098m65513m81307n22614o57320q24034q97288r28104j014173j166165
$$ 716724098 716258585 715777278 715254664 714597344 713773310 712876022 711947918 710933745 709767580
2463.8G09767580j330316j459003j568317j710057j930893k179324k363444k475023
$$ 709767580 708437264 706978261 705409944 703699887 701768994 699589670 697226226 694751203
2480.1F94751203k562284k695799k849222k908349k883613k823293k713382k580583
$$ 694751203 692188919 689493120 686643898 683735549 680851936 678028643 675315261 672734678
2496.4F72734678k440691k236724k025902j940191j921475j847804j740694j674652
$$ 672734678 670293987 668057263 666031361 664091170 662169695 660321891 658581197 656906545
2512.7F56906545j618445j487732j247644r03666n09620j59085J43350M85062Q75771
$$ 656906545 655288100 653800368 652552724 651649058 651139438 650980353 651123703 651608765 652484536
2531.1F52484536J234889J489878J621127J679897J781583J941681K022088J969754
$$ 652484536 653719425 655209303 656830430 658510327 660291910 662233591 664255679 666225433
2547.4F66225433J916051J914382J840830J641870J407861J232803J116514J023651
$$ 666225433 668141484 670055866 671896696 673538566 674946427 676179230 677295744 678319395
2563.7F78319395R13858P47442O08981N70595N42045M45485L22699K43962K27452K36332
$$ 678319395 679233253 679980695 680589676 681160271 681702316 682147801 682470500 682714462 682941914 683178246
2584.1F83178246K14577J37806N7161O0021J42515J87278J39534Q7619J29044K52605
$$ 683178246 683392823 683530629 683587790 683647811 683790326 683977604 684117138 684204757 684333801 684586406
2604.5F84586406L40044L35515L29375M03464N46873O52790O42180O03199O41525P26461
$$ 684586406 684926450 685261965 685591340 685994804 686541677 687194467 687836647 688439846 689081371 689807832
2624.9F89807832P63774P28190O94931P19845P68185P57992O57976N48899N19335N59390
$$ 689807832 690571606 691299796 691994727 692714572 693482757 694240749 694898725 695447624 695966959 696526349
2645.3F96526349N47647M16935K79784K32696K32458K11120J26422l3677j31011q7857
$$ 696526349 697073996 697490931 697770715 698003411 698235869 698446989 698573411 698539734 698408723 698320866
2665.7F98320866n9724j41204k28047k34604k21968k36272k53022k56181k61903k75612
$$ 698320866 698261142 698119938 697891891 697657287 697435319 697199047 696946025 696689844 696427941 696152329
2686.1F96152329k81393k82586l18467l82543l67880k84672k90930l85165m19319l87907
$$ 696152329 695870936 695588350 695269883 694887340 694519460 694234788 693943858 693558693 693139374 692751467
2706.5F92751467l62277l69310m12107m43101m16100l79145m35114n29408n28515l97563
$$ 692751467 692389190 692019880 691607773 691164672 690748572 690369427 689934313 689404905 688876390 688478827
2726.9F88478827k77340l21627m29391m67003m34995l73005l60966m31478m92990m64201
$$ 688478827 688201487 687879860 687450469 686983466 686548471 686175466 685814500 685383022 684890032 684425831
2747.3F84425831l90470l78609m25458m59850m70280m70102n01216n56111n75364n56349
$$ 684425831 684035361 683656752 683231294 682771444 682301164 681831062 681329846 680773735 680198371 679642022
2767.7F79642022n53727o17147o82056o53326o12855o32286o52016o92486p84636q82447
$$ 679642022 679088295 678471148 677789092 677135766 676522911 675890625 675238609 674546123 673761487 672879040
2788.1F72879040r09090q74758r04500r90152j000286r53614r75013j054943j143753
$$ 672879040 671969950 671095192 670190692 669200540 668200254 667246640 666271627 665216684 664072931
2806.4F64072931j235783j263202j227557j262784j385391j490295j530349j554549
$$ 664072931 662837148 661573946 660346389 659083605 657698214 656207919 654677570 653123021
2822.7F53123021j635969j754164j876652k034247k204061k355814k577603k874553
$$ 653123021 651487052 649732888 647856236 645821989 643617928 641262114 638684511 635809958
2839.1F35809958l244519l843844m595101m934192m225075k722681j383483o56486
$$ 635809958 632565439 628721595 624126494 619192302 614967227 612244546 610861063 610204577
2855.4F10204577m74274o32882q92341j204967j552463j824081k005458k068519j898706
$$ 610204577 609730303 609097421 608205080 607000113 605447650 603623569 601618111 599549592 597650886
2873.7E97650886j598478j424551j399278j406372j408815j388967j342655j261890
$$ 597650886 596052408 594627857 593228579 591822207 590413392 589024425 587681770 586419880
2890.1E86419880j182079j161218j106679r94802r79960j078367j192450j382232j813889
$$ 586419880 585237801 584076583 582969904 581975102 580995142 579916775 578724325 577342093 575528204
2908.4E75528204k466619l101587l369212k999365k162338j268804n68509j09255J79589
$$ 575528204 573061585 569959998 566590786 563591421 561429083 560160279 559591770 559482515 559662104
2926.8E59662104M27961P43449J025498J207888J382172J519024J525820J444995J393139
$$ 559662104 560090065 560833514 561859012 563066900 564449072 565968096 567493916 568938911 570332050
2945.1E70332050J312554J069904P77244O37353O09815N93245O56307Q09431R59634
$$ 570332050 571644604 572714508 573491752 574129105 574738920 575332165 575988472 576797903 577757537
2963.5E77757537J123071J312554J435101J427412J368165J320303J181185J045525
$$ 577757537 578880608 580193162 581628263 583055675 584423840 585744143 586925328 587970853
2979.8E87970853J067519J033723Q33989O64591N51284M70578M93169M51744L16679
$$ 587970853 589038372 590072095 590906084 591570675 592121959 592592537 593085706 593537450 593854129
2998.1E93854129K50697K07186J63853R9004m8757j93059j92285o5982l577p8201k21670
$$ 593854129 594104826 594312012 594475865 594574869 594526112 594333053 594140768 594074786 594071209 593993008 593771338
3020.6E93771338m06384n57780o27935p20382q26418q47221q07583q60095j047373
$$ 593771338 593364954 592807174 592179239 591458857 590632439 589785218 588977635 588117540 587070167
3038.9E87070167j162589j123964j069188j091242j169205j226127j248777j235426
$$ 587070167 585907578 584783614 583714426 582623184 581453979 580227852 578979075 577743649
3055.3E77743649j170396j156032j255155j340508j318932j202166j091421j113891
$$ 577743649 576573253 575417221 574162066 572821558 571502626 570300460 569209039 568095148
3071.6E68095148j224518j313627j345992j287758j202524j212716j244307j243353
$$ 568095148 566870630 565557003 564211011 562923253 561720729 560508013 559263706 558020353
3087.9E58020353j260400j253604j251281j299441j360833j387239j360178j371145
$$ 558020353 556759953 555506349 554255068 552955627 551594794 550207555 548847377 547476232
3104.2E47476232j455307j476347j417995j474678j632154j641810j514972j452148
$$ 547476232 546020925 544544578 543126583 541651905 540019751 538377941 536862969 535410821
3120.5E35410821j514196j642108j704633j666010j660883j741290j809180j831472
$$ 535410821 533896625 532254517 530549884 528883874 527222991 525481701 523672521 521841049
3136.8E21841049j833677j831949j844883j840174j850545j933158k000749j995504
$$ 521841049 520007372 518175423 516330540 514490366 512639821 510706663 508705914 506710410
3153.2E06710410j995504j995027j954257j967013k071858k147764k113729k049208
$$ 506710410 504714906 502719879 500765622 498798609 496726751 494578987 492465258 490416050
3169.5D90416050k046168k090633k121866k111673k080500k095521k162814k196252
$$ 490416050 488369882 486279249 484157383 482045710 479965210 477869689 475706875 473510623
3185.8D73510623k154708k072245k044231k114921k163351k105474k029241k008289
$$ 473510623 471355915 469283670 467239439 465124518 462961167 460855693 458826452 456818163
3202.1D56818163k037286k073318k050400j966417j933157j993478k025097k008200
$$ 456818163 454780877 452707559 450657159 448690742 446757585 444764107 442739010 440730810
3218.4D40730810j980930j930386j919955j936317j891672j831383j830608j860260
$$ 440730810 438749880 436819494 434899539 432963222 431071550 429240167 427409559 425549299
3234.7D25549299j879067j878053j849055j814544j810640j809925j804322j817316
$$ 425549299 423670232 421792179 419943124 418128580 416317940 414508015 412703693 410886377
3251.1D10886377j825452j820177j800298j796007j811147j789272j770765j750856
$$ 410886377 409060925 407240748 405440450 403644443 401833296 400044024 398273259 396522403
3267.4C96522403j676530j624107j597166j544565j515925j504213j451194j383036
$$ 396522403 394845873 393221766 391624600 390080035 388564110 387059897 385608703 384225667
3283.7C84225667j344055j345903j352757j327366j295716j307010j333803j299977
$$ 384225667 382881612 381535709 380182952 378855586 377559870 376252860 374919057 373619080
3300C73619080j212448j134932j153052j237929j287758j331777j344085j294612j301676
$$ 373619080 372406632 371271700 370118648 368880719 367592961 366261184 364917099 363622487 362320811
3318.4C62320811j335711j326918j363904j438737j499623j527428j493842j400739
$$ 362320811 360985100 359658182 358294278 356855541 355355918 353828490 352334648 350933909
3334.7C50933909j326590j370222j415461j317412j204848j175493j151234j132935
$$ 350933909 349607319 348237097 346821636 345504224 344299376 343123883 341972649 340839714
3351C40839714j129389j102656j025677r27508r04917r20326q61257q00759q37594
$$ 340839714 339710325 338607669 337581992 336654484 335749567 334829241 333967984 333167225 332329631
3369.3C32329631r01550q72910p40856o19292n97030o56367o58571n63711m42326l32952
$$ 332329631 331428081 330555171 329814315 329195023 328597993 327941626 327283055 326719344 326277018 325944066
3389.7C25944066l35514m39555m55469l04222j47879j63615k69741k52276j30117l9160
$$ 325944066 325608552 325168997 324713528 324409306 324261427 324097812 323828071 323575795 323445678 323406518
3410.1C23406518J281J0610Q553O8992J47581J46985K23607M05371M70788M47601N60760
$$ 323406518 323407799 323418409 323426962 323495954 323643535 323790520 324014127 324419498 324890286 325337887 325898647
3432.6C25898647O55473N30392M21583N01841O18667O70731P64012Q70854R11564R31203
$$ 325898647 326554120 327084512 327506095 328007936 328626603 329297334 330061346 330932200 331843764 332774967
3453C32774967R96262J122683J200855J173913J190842J311302J382917J312703J229018
$$ 332774967 333771229 334893912 336094767 337268680 338459522 339770824 341153741 342466444 343695462
3471.3C43695462J258999J340866J470119J556277J525253J516670J599491J683086
$$ 343695462 344954461 346295327 347765446 349321723 350846976 352363646 353963137 355646223
3487.6C55646223J742571J766116J691252J686245J771212J787603J844614J956165
$$ 355646223 357388794 359154910 360846162 362532407 364303619 366091222 367935836 369892001
3504C69892001J919717J903295K044887K188861K204478K108216K091616K142072K202273
$$ 369892001 371811718 373715013 375759900 377948761 380153239 382261455 384353071 386495143 388697416
3522.3C88697416K225399K235710K364099K508968K521694K558380K635092K552420
$$ 388697416 390922815 393158525 395522624 398031592 400553286 403111666 405746758 408299178
3538.6D08299178K485245K561182K716452K829731K783477K772182K958536L062457
$$ 408299178 410784423 413345605 416062057 418891788 421675265 424447447 427405983 430468440
3554.9D30468440K997369K966106K903282K711147K789796L599077M056037L562688
$$ 430468440 433465809 436431915 439335197 442046344 444836140 448435217 452491254 456053942
3571.3D56053942L236950L334314L464609L564000L525734L235966L166318L816217
$$ 456053942 459290892 462625206 466089815 469653815 473179549 476415515 479581833 483398050
3587.6D83398050M193932L645331L477662L823042L888250L844320L860355L591835
$$ 483398050 487591982 491237313 494714975 498538017 502426267 506270587 510130942 513722777
3603.9E13722777L376305L747404L973782L734470L554999L236056L470480M356206
$$ 513722777 517099082 520846486 524820268 528554738 532109737 535345793 538816273 543172479
3620.2E43172479M113853L146648K896786M389763N576551M301071L628969L701448
$$ 543172479 547286332 550432980 553329766 557719529 563296080 567597151 571226120 574927568
3636.5E74927568L566027L449917L080249K346813K260685L886223N013287L514350
$$ 574927568 578493595 581943512 585023761 587370574 589631259 593517482 598530769 602045119
3652.8F02045119K598762L381729L401518K642155K321064J849294J326561J870513
$$ 602045119 604643881 608025610 611427128 614069283 616390347 618239641 619566202 621436715
3669.2F21436715K506673J772464K286076L124416K078235J418531J051307M26531
$$ 621436715 623943388 625715852 628001928 631126344 633204579 634623110 635674417 636100948
3685.5F36100948N40137J458407J548409Q80241N41866N21303P56800J424074J661777
$$ 636100948 636641085 638099492 639647901 640528142 641070008 641591311 642348111 643772185 645433962
3703.8F45433962R59814N30541J073718K094030J910806P57098J48714J83046M37498
$$ 645433962 646393776 646924317 647998035 650092065 652002871 652759969 652908683 653091729 653529227
3722.2F53529227O12914O91653L44693k84493k87354O22273J589894J032233n93483
$$ 653529227 654142141 654833794 655178487 654893994 654606640 655228913 656818807 657851040 657257557
3740.5F57257557r58502O74784R08494j34111Q38042J625776N52952r000M74572O76990
$$ 657257557 656299055 656973839 657882333 657748222 658586264 660212040 660764992 660755992 661230564 661907554
3760.9F61907554R2387j33991Q1479M54128Q12471L88741k40326j90615L35216M07458
$$ 661907554 661999941 661865950 661947429 662401557 663214028 663602769 663362443 663171828 663507044 663914502
3781.3F63914502O5863J78158L69489K42412m5180m47988n26011m24147k38359O41704
$$ 663914502 663980365 664158523 664528012 664770424 664725244 664277256 663751245 663327098 663088739 663730443
3801.7F63730443O12378Q4042O51360L84152o54519q31008q7142J2636l4451R15348
$$ 663730443 664342821 664426863 665078223 665462375 664807856 663976848 663889706 663902342 663867891 664783239
3822.1F64783239O04153r3937r0539k68936m30644m81784j93298N70237P40707M68016
$$ 664783239 665387392 665293455 665202916 664933980 664503336 664021552 663828254 664398491 665139198 665607214
3842.5F65607214L44396k32757j210570j644909M0591K258181Q46386p02202p57933
$$ 665607214 665951610 665718853 664508283 662863374 662903965 665162146 666008532 665306330 664548397
3860.9F64548397k46823J35899j83821j45078N72563M94599J15097l41595n21660n6386
$$ 664548397 664301574 664437473 664253652 664108574 664681137 665175736 665290833 664949238 664427578 664371192
3881.3F64371192m0411J30474J89126l21448J12593M97460l30805r23276o42717M2915
$$ 664371192 664330781 664461255 664650381 664328933 664441526 664938986 664608181 663684905 663042188 663085103
3901.7F63085103P73311R08732K59638j79648k55764m78327m56274L8922K00033j12474
$$ 663085103 663858414 664767146 665026784 664847136 664591372 664113045 663656771 663695693 663895726 663783252
3922.1F63783252j42514j312k38895k99454J65224L25561l3319l30746l57926q7977
$$ 663783252 663640738 663639426 663400531 663101077 663266301 663591862 663558543 663227797 662869871 662781894
3942.5F62781894N8294j35184r6380R9480N9604o9797j31488j00255o497M1485k8550
$$ 662781894 662840188 662705004 662608624 662708104 662767708 662697911 662566423 662466168 662459671 662501156 662472606
3964.9F62472606j18077j38402j20699q1718j0074J6451n9366q9645O139M6313o2824
$$ 662472606 662354529 662216127 662095428 662013710 662003636 662020087 661960721 661871076 661877215 661923528 661860704
3987.3F61860704j48236j06037k5511J9908k2590
$$ 661860704 661712468 661606431 661580920 661600828 661578238
3997.5F61578238
$$ 661578238
##END=$$ End of the data block
