##TITLE=$$ Begin of the data block
##JCAMP-DX=5.00 $$ ACD/SpecManager v 10.08
##SPECTROMETER/DATA SYSTEM=Alpha
##DATE=11 Jun 2014 19:36:16
##DATA TYPE=INFRARED SPECTRUM
##DATA CLASS=XYDATA
##ORIGIN=
##OWNER=
##NPOINTS=1765
##FIRSTX=399.75695801
##LASTX=3997.56933594
##MAXX=3997.56933594
##MINX=399.75695801
##MAXY=0.72340304
##MINY=0.04069421
##XFACTOR=1.0000000000
##YFACTOR=1.000000000000000e-9
##FIRSTY=0.30797431
##DELTAX=2.03957629
##XUNITS=1/CM
##YUNITS=ARBITRARY UNITS
##XYDATA=(X++(Y..Y))
399.8 307974309 317297876 326076716 334648252 343126595 351716787 360461354 368915260 376253784
416.1 376253784 383723706 392438501 400339454 407232851 413423419 418837816 424452603 430694908
432.4 430694908 436743498 441962808 446574628 451177865 456222326 461132854 465192944 468772173
448.7 468772173 472434968 476074517 478958607 480994076 482935339 485448867 488286316 490482569
465 490482569 491907388 493504018 496133715 499737591 503148377 505990267 508919239 512225866 515675545
483.4 515675545 518553138 520493507 522341251 524938405 527825236 529910743 531060398 532326579
499.7 532326579 534436762 536597192 537677407 537934124 538513780 539757252 540797889 540812910 540131390
518.1 540131390 539927781 540648162 541438580 541417539 540911317 541028857 542204678 543701708 544674039 545285642
538.4 545285642 546415627 548298597 550048769 550809264 550859272 551198006 552060425 552594841 552098095
556.8 552098095 551092565 550703943 551248252 551907182 551757038 550970435 550342917 550244510 550516963 550625443
577.2 550625443 550455272 550877750 552436113 554323375 555538952 556082666 556667387 557633996 558497429
595.6 558497429 558588564 557920098 557209194 556666553 555649936 553988636 552471519 551923573 552406549
613.9 552406549 553177714 553659320 554163158 555249631 556951284 558634460 559656560 560301006 561490834
632.3 561490834 563431144 565407574 566819727 567759931 568730175 569872558 570697486 570795298 570418000
650.6 570418000 570080757 569887698 569476247 568542898 567365110 566561460 566121757 565131366 563820541
669 563820541 563834131 564516723 565315425 565980613 566091239 565717459 565325320 565009713 564243615 562488079
689.4 562488079 559725642 556166410 551692307 545931935 539393127 532708347 524889588 514984667
705.7 514984667 503533065 491779059 482083887 476791829 475304931 475787371 478928894 486517131
722 486517131 498883754 515121579 533392549 551401258 567496002 580937266 591543436 599457443
738.3 599457443 605075538 608894885 611509681 613456070 614913762 615778208 616078258 616128743 616185009
756.7 616185009 616229355 616133392 615906715 615746498 615949452 616581678 617359042 618044257 618670166 619393289
777.1 619393289 620360255 621481836 622396648 622927368 623211563 623451710 623665810 623700380 623463511 623139858
797.5 623139858 623142660 623539031 623896778 623883009 623557627 623115957 622683346 622060776 620912790 619349658
817.9 619349658 617834449 616529286 615004122 612782300 609861434 606684387 603479207 599742949
834.2 599742949 594859421 588828564 581769526 573268056 562052369 548104823 536187172 529348016
850.5 529348016 522499561 511456907 497874945 482648939 463922352 439027250 403936118 353009492
866.8 353009492 287147254 224392250 185841829 173503920 179853365 203885108 246146500 302628666
883.1 302628666 367424071 433246136 490770429 533835948 563347638 583708823 598180115
897.4 598180115 608476460 616042674 622093320 627037585 630663216 632977784 634571910 636093080
913.7 636093080 637451112 637969375 637424529 636451840 635789096 635444343 634825170 633740783 632773399
932.1 632773399 632497132 632712185 632686913 632161021 631669879 631717801 631855428 631133437 629251719 626771688
952.5 626771688 624322414 621753037 618399620 614089429 609423995 604983866 600538433 595373750
968.8 595373750 589258492 582636118 575867474 568548679 559960246 550035059 539491773 529110610
985.1 529110610 519007683 508878112 498840630 489531636 481369108 474149883 467330992 460558921
1001.4 460558921 453822285 447041810 439847678 431952894 423573822 415353507 407955289 401688308
1017.7 401688308 396587014 392725497 390285015 389335901 389541686 390318274 391307652 392479926 393834561
1036.1 393834561 395120114 395901442 396034271 395814270 395617247 395648360 396014988 396982789 398963451
1054.5 398963451 402128071 406237036 410801798 415147871 418607801 420586854 420451522 417818606
1070.8 417818606 413131893 407800347 403313667 400231928 398565143 398807228 401243627 405221552
1087.1 405221552 410112441 415437430 420319706 423950553 426116318 427063495 427240908 427178472 427408367
1105.4 427408367 428301454 429872632 431840330 433935344 435995132 437876463 439491838 440825999
1121.8 440825999 441920131 442901403 443958819 445074081 445838034 445777595 444773614 442974538 440503269
1140.1 440503269 437489122 434216887 431104034 428494811 426510632 425159067 424488962 424619496 425757766
1158.5 425757766 428106606 431629747 436027855 440855950 445631564 450004041 453817695 457105607
1174.8 457105607 460012525 462606728 464817315 466439366 467238486 467171788 466351122 464899778 462932467
1193.1 462932467 460557640 457950085 455319107 452807873 450516433 448499024 446690530 444944918
1209.5 444944918 443113863 441049874 438634247 435855180 432805628 429557383 426158696 422683716
1225.8 422683716 419215679 415755033 412312448 409011722 405930251 403000563 400114536 397273034
1242.1 397273034 394523144 391907364 389390647 386858195 384224623 381501079 378727168 375898421
1258.4 375898421 373027533 370123386 367234886 364359468 361414015 358344257 355158061 351864398
1274.7 351864398 348486960 345036358 341501385 337941796 334363520 330706567 326892972 322896987
1291 322896987 318716407 314391494 309955180 305371016 300625741 295783043 290941596 286101311 281241655
1309.4 281241655 276317954 271395206 266627580 261999607 257365525 252660632 247832939 242822438
1325.7 242822438 237639084 232290179 226914465 221646398 216401562 210924849 205309808 199947804
1342 199947804 194762826 189442977 183917165 178266451 172559857 166802108 161030635 155368313 149627596
1360.4 149627596 143601179 137761891 132346362 126929596 121598892 116343506 110939689 105834223
1376.7 105834223 101075545 96383646 91838181 87489650 83108716 78877382 75129591 71401529
1393 71401529 67409515 63599929 60045920 56833673 53975590 51183630 48693866 46626907 44867825
1411.4 44867825 43417968 42266633 41333634 40747292 40694207 40994618 41487642 42092197 42849790 43740951
1431.8 43740951 44603318 45449872 46381261 47165599 47776029 48309579 48783347 49228732 49662832 50058067
1452.2 50058067 50320152 50545357 51063467 51789306 52442603 53143948 54015819 54896411 55744316 56857973
1472.6 56857973 58354259 59918512 61481420 63118562 64898409 66730224 68693146 71067207
1488.9 71067207 73897950 76668046 79441585 82817890 86566605 90108670 93161903 96381791
1505.2 96381791 101016849 105677016 109586760 113374531 117213733 121203654 125253588 129757151
1521.5 129757151 134411588 138720393 143185824 147423297 151552707 156231791 160564452 164276823
1537.8 164276823 169147134 175149292 180742711 186179176 191487908 197057888 202844620 208650857
1554.1 208650857 214216888 221390933 231011376 238296494 244437724 250709116 257058859 263735503
1570.5 263735503 269449413 274351299 279943347 285311937 289819956 294051021 298070937 301790506
1586.8 301790506 305217862 308359265 311238527 313943118 316450566 318724662 320787102 322713673
1603.1 322713673 324436396 325922638 327226669 328341484 329113334 329500377 329951614 330633551 331028670
1621.4 331028670 331126153 331341565 331648588 332048744 332454830 332605511 332876295 334014058 335502565
1639.8 335502565 336862296 337999672 339176625 341061622 342991769 344760478 347833216 351398975
1656.1 351398975 354449332 357401967 360745639 364530861 368021101 371493369 375667751 379826188
1672.4 379826188 384028643 388667047 392910063 396481007 400060534 405110449 410546303 415222049
1688.8 415222049 419870824 424115330 428320378 432907999 437562019 443108469 448181272 452414334
1705.1 452414334 456773967 460805535 464248300 467186928 469857693 473099262 476967871 480384141
1721.4 480384141 483339995 486152947 488641053 490788341 492641538 494868875 497887850 500585735
1737.7 500585735 503100872 505903840 508759558 511501968 514135540 516983747 520194948 523099005
1754 523099005 525608242 528016627 530186832 532347262 534521699 536310911 537724793 538856447 540060937
1772.4 540060937 541505992 542464435 542572260 542050898 541129231 539720893 537900567 535782278 533126771
1790.7 533126771 530463040 528739452 527654827 526961029 527099490 528284609 530225217 532685935 535679042
1809.1 535679042 539356649 543518007 547774613 552079022 556361437 560273111 563762546 567161739
1825.4 567161739 570306122 573281705 576400399 579193532 581538200 583780110 585793972 587277353
1841.7 587277353 588725150 590742171 592852116 594698668 596317530 597754359 599176228 600659251
1858 600659251 602144122 603506684 604632258 605529845 606603801 608212948 609863937 611200094 612398386
1876.4 612398386 613619089 614813864 615924895 616985977 617976964 618981540 620166242 621325552
1892.7 621325552 622333229 623423994 624588847 625672579 626633763 627522171 628396213 629340053 630382240
1911.1 630382240 631331563 632036030 632719278 633696377 634711444 635612190 636536539 637434602 638295472
1929.4 638295472 639144599 639948726 640683949 641409814 642090023 642729342 643504024 644355714 645137489 645898998
1949.8 645898998 646629214 647249699 647790968 648332596 648940742 649588585 650176048 650705576 651372850 652219474
1970.2 652219474 653060198 653789461 654425383 655051231 655718446 656400681 656984270 657455266 657910228 658434808
1990.6 658434808 659093678 659775794 660341561 660863876 661433458 662013650 662542760 662995338 663429677 663915813
2011 663915813 664414167 664831817 665220618 665673733 666163146 666660011 667118788 667500436 667871892 668324828
2031.4 668324828 668807507 669236600 669627964 670019448 670459747 670947969 671406567 671809196 672203302 672622442
2051.8 672622442 673076153 673531175 673933744 674288988 674681187 675163567 675649822 676059365 676437914 676861584
2072.2 676861584 677303493 677696049 678048670 678437293 678868473 679275095 679644227 679993033 680341601 680708289
2092.6 680708289 681107521 681486607 681792617 682076752 682394624 682730198 683024108 683268249 683524907 683826923
2113 683826923 684119761 684367180 684579551 684774756 684984565 685221910 685455203 685653210 685853899 686087132
2133.4 686087132 686353266 686624646 686861753 687095165 687374890 687696218 688012242 688301206 688613951 688989520
2153.8 688989520 689388931 689790964 690195799 690612078 691072404 691579223 692070246 692496896 692921817 693393409
2174.2 693393409 693878412 694347322 694809854 695293903 695804298 696311951 696799397 697247744 697634757 698018909
2194.6 698018909 698467433 698918045 699278176 699608147 699979007 700356364 700703144 701024055 701361954 701741815
2215 701741815 702140510 702511489 702839971 703151941 703497291 703868210 704210103 704524040 704839587 705176055
2235.4 705176055 705517828 705848157 706152797 706444561 706753850 707062364 707358956 707664132 707979918 708304346
2255.8 708304346 708636999 708947122 709235489 709538937 709870517 710205078 710533738 710850239 711151123 711457610
2276.1 711457610 711770058 712113202 712451100 712709785 712913990 713083744 713205755 713318825 713465452 713614881
2296.5 713614881 713732958 713803172 713802576 713755369 713709176 713647306 713550448 713441432 713319838 713148594 712884545
2319 712884545 712585926 712418616 712427497 712457120 712404191 712349355 712398827 712517619 712625861 712711513 712848663
2341.4 712848663 713361204 714415729 715179026 714954317 714056671 713104069 712403417 712086499 712194145
2359.8 712194145 712577879 713164091 714014828 715099514 716243923 717301369 718298912 719310105 720270634
2378.1 720270634 721090436 721735060 722213864 722551763 722788036 722953022 723051727 723119438 723207891 723304510
2398.5 723304510 723362088 723376215 723359287 723349810 723382771 723403037 723357260 723295569 723268449 723269522 723257959 723160565
2423 723160565 722982645 722798109 722643673 722506702 722330809 722057521 721718431 721386075 721064687 720714450
2443.4 720714450 720290244 719804943 719309926 718779683 718126297 717320383 716426313 715499461 714485765
2461.7 714485765 713301539 711963117 710502684 708923161 707199812 705261707 703085780 700719893
2478.1 700719893 698232591 695655227 692942023 690074205 687124491 684194088 681361318 678646028
2494.4 678646028 676039398 673588574 671368420 669335425 667380571 665471792 663629353 661868691
2510.7 661868691 660182834 658589542 657124996 655859590 654921412 654384017 654212713 654363215 654856384
2529 654856384 655716002 656937540 658467054 660155594 661898851 663733125 665691912 667696834 669653952
2547.4 669653952 671585083 673520982 675364137 676995456 678398073 679636717 680769324 681823432
2563.7 681823432 682778180 683550417 684141338 684678972 685225070 685702264 686036646 686253130 686438441 686660588
2584.1 686660588 686896026 687060893 687151790 687250853 687424958 687645912 687822759 687943101 688085139 688324571
2604.5 688324571 688640475 688953996 689285457 689710915 690242946 690856636 691498578 692126393 692794979 693555236
2624.9 693555236 694343805 695073605 695757151 696457148 697189152 697927296 698607802 699196756 699745476 700316727
2645.3 700316727 700870991 701290071 701564372 701796055 702014804 702190757 702294648 702259958 702127099 702037573
2665.7 702037573 701986492 701861620 701634586 701358199 701098323 700883806 700656891 700379729 700085700 699799836
2686.1 699799836 699535787 699288547 698995531 698613703 698219001 697903275 697608411 697227180 696808696 696437418
2706.5 696437418 696076274 695688367 695288658 694881260 694478989 694085360 693627834 693061769 692492366 692082882
2726.9 692082882 691812754 691499770 691078305 690605104 690147817 689769328 689443290 689054132 688562036 688062429
2747.3 688062429 687644005 687258482 686821580 686339378 685861230 685396314 684897065 684351563 683810949 683281004
2767.7 683281004 682714641 682071924 681366265 680693090 680089355 679483414 678829610 678094685 677264571 676382005
2788.1 676382005 675497830 674614012 673676312 672670603 671657205 670687735 669718564 668680072 667549610
2806.4 667549610 666324854 665059328 663792431 662463307 661026597 659511566 657959104 656376660
2822.7 656376660 654733717 652996004 651125014 649067521 646829903 644442141 641827941 638928831
2839.1 638928831 635684550 631833196 627210915 622251689 617966950 615158021 613740146 613081753
2855.4 613081753 612600625 611968517 611067712 609849930 608292878 606463015 604467154 602413118 600514531
2873.7 600514531 598911047 597470641 596033931 594567955 593117714 591753304 590446949 589166582
2890.1 589166582 587970912 586849928 585780919 584770679 583747327 582646668 581441283 580033422
2906.4 580033422 578225434 575810671 572751760 569386959 566364169 564183831 562902272 562289357
2922.7 562289357 562137544 562335253 562806785 563566625 564607680 565814555 567171097 568684697 570201397
2941 570201397 571642458 573059380 574390650 575478375 576268613 576894403 577489734 578093350 578759730
2959.4 578759730 579547405 580508530 581684947 583035827 584463537 585878074 587271214 588647127 589873374
2977.8 589873374 590907753 591908991 592902303 593771696 594480693 595029414 595477819 595927477 596320391
2996.1 596320391 596615851 596874595 597074509 597249687 597416103 597386658 597121418 596876025 596815169 596831679
3016.5 596831679 596732259 596437573 595981956 595434964 594839633 594141543 593311250 592429399 591573775 590679169
3036.9 590679169 589597821 588388681 587253392 586202383 585090637 583847642 582556009 581320882
3053.2 581320882 580122113 578917265 577688873 576392829 575058699 573751926 572525918 571384192
3069.5 571384192 570223689 568976998 567647457 566277564 564960063 563722372 562509120 561290562
3085.8 561290562 560049713 558767915 557468712 556154251 554801941 553414226 552010298 550614715
3102.2 550614715 549199760 547713816 546195447 544718027 543219030 541599989 539932549 538326442
3118.5 538326442 536787391 535243809 533606410 531890929 530167997 528435230 526674867 524888694
3134.8 524888694 523055315 521174073 519290268 517401040 515484273 513560593 511617839 509627640
3151.1 509627640 507594705 505543649 503527761 501545250 499530226 497449279 495304734 493144065
3167.4 493144065 491048038 489015281 486925721 484729469 482538015 480404764 478250146 476054221
3183.7 476054221 473860025 471699387 469598621 467503071 465326309 463120222 460999966 458942562
3200.1 458942562 456874818 454798460 452713966 450614810 448532909 446493000 444480151 442459404
3216.4 442459404 440416902 438413233 436499536 434608608 432660252 430690885 428761601 426865906
3232.7 426865906 424970537 423049718 421127528 419246495 417411506 415607959 413790792 411930621
3249 411930621 410080940 408274919 406469107 404636979 402806342 401017219 399257600 397490710 395759106
3267.4 395759106 394099951 392439604 390772164 389200568 387715757 386232138 384744525 383283973
3283.7 383283973 381852955 380442888 379075766 377753377 376447052 375149637 373835415 372517973
3300 372517973 371270955 370088041 368887544 367623866 366310686 364980578 363633633 362259090 360865772
3318.4 360865772 359446049 357992947 356544554 355104655 353635341 352142930 350610465 349069536
3334.7 349069536 347598493 346152902 344687402 343283296 342002094 340792894 339610398 338419199
3351 338419199 337195873 336011857 334944874 333945304 332915962 331901938 331002384 330152392 329231322
3369.3 329231322 328252524 327339977 326561093 325861931 325193673 324490488 323754817 323118627 322656751 322328269
3389.7 322328269 321965724 321456134 320952088 320645571 320487201 320261121 319904655 319586515 319401979 319314212
3410.1 319314212 319293618 319321394 319338173 319350660 319441587 319598556 319803327 320121527 320565015 321025878
3430.5 321025878 321551025 322190106 322730809 323118925 323551476 324141175 324873209 325713068 326609910 327541441
3450.9 327541441 328492343 329473883 330563694 331755042 332940996 334141582 335480660 336938292 338315338
3469.3 338315338 339544713 340824753 342233479 343721807 345253170 346783906 348328084 349938184
3485.6 349938184 351602435 353308856 355107218 356960267 358830482 360690385 362531453 364449024
3501.9 364449024 366441250 368380636 370334089 372435600 374678910 376960725 379171729 381319612
3518.2 381319612 383436829 385647029 387961298 390271664 392701089 395325184 397978306 400624961
3534.5 400624961 403331190 406001002 408623070 411306083 414116561 417015642 419891477 422788471
3550.9 422788471 425850868 428962648 432018429 435124218 438237488 441132993 444019467 447685063
3567.2 447685063 451840729 455522776 458887666 462398738 466054380 469749868 473393768 476791024
3583.5 476791024 480148524 484150827 488514721 492323875 495929748 499831051 503841460 507917285
3599.8 507917285 512066066 515890718 519373000 523225963 527425170 531381547 535085320 538452625
3616.1 538452625 542087138 546687543 551068366 554386020 557351589 561844528 567648888 572168469
3632.4 572168469 575967848 579852164 583628774 587284088 590480506 592850745 595158160 599155545
3648.8 599155545 604284883 607945263 610716879 614231229 617733538 620485306 622930288 624900162
3665.1 624900162 626319647 628271103 630824089 632587373 634916484 638215184 640478849 641989768
3681.4 641989768 643050015 643460989 643971384 645419836 647044241 648028672 648671448 649263084 650042951
3699.8 650042951 651518226 653258145 654234231 654693067 655672908 657760561 659782171 660683155 660926700
3718.1 660926700 661139905 661586821 662215233 662926257 663325012 663089812 662745833 663231850 664740384
3736.5 664740384 665820777 665368974 664551318 665295959 666201532 666025519 666844845 668494523 669054568
3754.8 669054568 668997347 669388294 670067668 670233548 670118213 670184970 670648396 671488941 671907127 671688378
3775.2 671688378 671505988 671844184 672273457 672355592 672515392 672847271 673067093 673032343 672590017 672063649
3795.6 672063649 671710193 671544492 672155380 672744155 672855556 673564374 674038887 673429251 672551692 672406852
3816 672406852 672437549 672397137 673271954 673897743 673828542 673739254 673492134 673096955 672589421 672279954 672795773
3838.4 672795773 673650146 674229562 674610794 674401462 673172414 671455741 671463430 673794210 674733639
3856.8 674733639 674082518 673318863 673017383 673093140 672892928 672783375 673389673 673883259 673989356 673658311
3877.2 673658311 673163772 673132122 673093915 673260033 673528910 673199415 673235714 673711300 673382103 672467113
3897.6 672467113 671891272 671971500 672685623 673573017 673903108 673768938 673514962 673080862 672644138 672634304
3918 672634304 672823429 672754943 672670007 672702014 672422588 672035217 672148764 672453046 672440112 672223151 671966612
3940.4 671966612 671844602 671828091 671690583 671603560 671678483 671715915 671655953 671567142 671499908 671490788 671532869
3962.9 671532869 671536863 671465814 671360195 671250284 671186864 671177685 671120524 671025097 671007633 671049654 671064138
3985.3 671064138 671015501 670922160 670824051 670778751 670825064 670836926
3997.5 670836926
##END=$$ End of the data block
