##TITLE=T4PT $$ Begin of the data block
##JCAMP-DX=5.00 $$ ACD/SpecManager v 10.08
##SPECTROMETER/DATA SYSTEM=Alpha
##DATE=12 Mar 2014 10:59:36
##DATA TYPE=INFRARED SPECTRUM
##DATA CLASS=XYDATA
##ORIGIN=
##OWNER=
##NPOINTS=1765
##FIRSTX=399.75695801
##LASTX=3997.56933594
##MAXX=3997.56933594
##MINX=399.75695801
##MAXY=0.79086661
##MINY=0.30628946
##XFACTOR=1.0000000000
##YFACTOR=1.000000000000000e-9
##FIRSTY=0.58046728
##DELTAX=2.03957629
##XUNITS=1/CM
##YUNITS=ARBITRARY UNITS
##XYDATA=(X++(Y..Y))
$$ plain form
399.8 580467284 585804641 590729773 593783855 596972704 601407588 604954362 606652141 608300328
416.1 608300328 611480892 614511967 615795910 617730260 620666027 622046232 621978700 622957706 624946773
434.4 624946773 625848472 626179516 627994955 630419314 631140590 631036639 632575274 634908199 635441720
452.8 635441720 634913623 635944545 637885094 638223052 637930691 639219582 640964270 640757918 639753044
471.1 639753044 640492797 641785741 641417742 640835166 642149389 643880606 643783391 643250465 644548237
489.5 644548237 646424770 646549642 646043122 647058845 648465872 648288906 647740722 648593366 649487972
507.9 649487972 648747742 647744894 648142040 648579419 647485733 646482348 647290170 648361564 647909820
526.2 647909820 647296429 648135304 649070621 648652196 648287892 649398565 650519311 650065780 649148524
$$ packed form
399.8E80467284N337357M925132L054082L188849M434884L546774J697779J648187
416.1F08300328L180564L031075J283943J934350K935767J380205o7532R79006J989067
434.4F24946773R01699L31044J815439K424359P21276j03951J538635K332925N33521
452.8F35441720n28097J030922J940549L37958k92361J288891J744688k06352j004874
471.1F39753044P39753J292944l67999n82576J314223J731217r7215n32926J297772
489.5F44548237J876533J24872n06520J015723J407027j76966n48184Q52644Q94606
507.9F49487972p40230j002848L97146M37379j093686j003385Q07822J071394m51744
526.2F47909820o13391Q38875R35317m18425l64304J110673J120746m53531r17256
$$ plain form
544.6 649148524 649268031 649521887 648498416 647094846 646722019 646637261 645750463 644963741 645369530 646042287
565 646042287 645615399 644648254 644397855 644434690 643756509 642996848 643354893 644350410 644690156 644692540 645678341
587.4 645678341 647219777 647787988 647620559 648091912 648926139 648770452 647875011 647569835 647585273 646620989
607.8 646620989 645131290 644685388 645138085 645145774 645003557 646227360 648509383 650158465 651001811
626.1 651001811 652428567 654607058 656255901 657273471 658917964 661216557 662711024 663138926 663957775
644.5 663957775 665501833 666313827 666052818 666156411 666961551 666928768 665632665 664749980 665016532 665097773
664.9 665097773 664025962 663707793 665425718 666770935 667111993 667790473 669460952 670765221 670974612
683.3 670974612 671337187 672440588 672861993 671828091 670507848 669344962 666933894 663748682 662225664
$$ packed form
544.6F49148524J19507K53856j023471j403570l72827q4758q86798p86722M05789O72757
565F46042287m26888r67145k50399L6835o78181p59661L58045R95517L39746K384R85801
587.4F45678341J541436N68211j67429M71353Q34227j55687q95441l05176J5438r64284
607.8F46620989j489699m45902M52697P689j42217J223803K282023J649082Q43346
626.1F51001811J426756K178491J648843J017570J644493K298593J494467M27902Q18849
644.5F63957775J544058Q11994k61009J03593Q05140l2783j296103q82685K66552Q1241
664.9F65097773j071811l18169J717925J345217L41058O78480J670479J304269K09391
683.3F70974612L62575J103401M21405j033902j320243j162886k411068l185212j523018
$$ plain form
701.6 662225664 661680818 659038365 653504193 646960318 642090559 640661657 641915798 644531667 648994923
720 648994923 655154288 661752284 668980360 677087963 684285879 688944340 691977322 694919825 697310209
738.3 697310209 698194325 698587418 699913919 701410711 701719403 701558650 702257097 703195870 703098357 702509761
758.7 702509761 702735484 703372121 703188002 702735603 703520179 705180824 706254363 706932843 708406508
777.1 708406508 710353494 711418748 711738467 712673843 714142919 714811325 714724243 715237975 716406345
795.4 716406345 716962218 716877759 717390001 718480825 718761265 718101144 717874050 718301892 718055964 716993809
815.8 716993809 716553807 716929436 716706932 715559244 714726448 714454591 713436484 711318135 709328949
834.2 709328949 707791209 705428720 701661706 697724223 694157243 689367175 683346629 677432477
$$ packed form
701.6F62225664n44846k642453n534172o543875m869759j428902J254141K615869M463256
720F48994923O159365O597996P228076Q107603P197916M658461L032982K942503K390384
738.3F97310209Q84116L93093J326501J496792L08692j60753O98447R38773r7513n88596
758.7G02509761K25723O36637j84119m52399P84576J660645J073539O78480J473665
777.1G08406508J946986J065254L19719R35376J469076O68406q7082N13732J168370
795.4G16406345N55873q4459N12242J090824K80440o60121k27094M27842k45928j062155
815.8G16993809m40002L75629k22504j147688q32796k71857j018107k118349j989186
834.2G09328949j537740k362489l767014l937483l566980m790068o020546n914152
$$ plain form
850.5 677432477 670473278 662338555 656314790 654183149 653629899 650570631 641716242 624060094
866.8 624060094 595216274 559415460 528048277 510612726 512318313 535361588 573180616 612712085
883.1 612712085 646077275 671785831 689571500 700804353 708388329 713893116 717599332 720467985
899.4 720467985 723529875 726292908 727801085 728519022 729438841 730068803 729330778 727635622 726055920
917.8 726055920 724381149 721904695 719175994 717251241 715994775 714663625 713579953 713612914 714449406
936.2 714449406 715048015 715395153 716150582 716990352 716900766 715873361 714698255 713327885 711050212
954.5 711050212 708008289 705025136 702114999 698656619 694806874 691329598 688184381 684628606
970.8 684628606 680552602 676422536 672083795 666846752 660701513 654480338 648715794 643132508
$$ packed form
850.5F77432477o959199q134723o023765k131641n53250l059268q854389j7656148
866.8F24060094k8843820l5800814l1367183j7435551J705587K3043275L7819028L9531469
883.1F12712085L3365190K5708556J7785669J1232853P583976N504787L706216K868653
899.4G20467985L061890K763033J508177P17937R19819O29962p38025j695156j579702
917.8G26055920j674771k476454k728701j924753j256466j331150j083672L2961Q36492
936.2G14449406N98609L47138P55429Q39770q9586j027405j175106j370370k277673
954.5G11050212l041923k983153k910137l458380l849745l477276l145217l555775
970.8F84628606m076004m130066m338741n237043o145239o221175n764544n583286
$$ plain form
987.1 643132508 637563109 632413566 627862632 623573720 619496346 616053522 613251865 610433459
1003.5 610433459 607179582 603621721 599741161 595335364 590756714 586798310 583676219 580902576
1019.8 580902576 578228951 576009095 574444890 573099375 571595669 570229232 569559038 569808304 570805490
1038.1 570805490 572234333 573675990 574507236 574311495 573342681 572129369 570893288 569739759 569079936
1056.5 569079936 569425344 570919394 573214591 575779915 578057706 579342365 579111695 577669561 575913727
1074.8 575913727 574402213 573050737 572163224 573231518 576653481 580750108 584660292 588708460
1091.2 588708460 592603803 595672607 597776532 599200070 600055695 600283444 600033402 599653244 599461496
1109.5 599461496 599708319 600612164 602209568 604122698 605792403 607043803 608189404 609563112 611147642
$$ packed form
987.1F43132508n569399n149543m550934m288912m077374l442824k801657k818406
1003.5F10433459l253877l557861l880560m405797m578650l958404l122091k773643
1019.8E80902576k673625k219856j564205j345515j503706j366437o70194K49266R97186
1038.1E70805490J428843J441657Q31246j95741r68814j213312j236081j153529o59823
1056.5E69079936L45408J494050K295197K565324K277791J284659k30670j442134j755834
1074.8E75913727j511514j351476q87513J068294L421963M096627L910184M048168
1091.2E88708460L895343L068804K103925J423538Q55625K27749k50042l80158j91748
1109.5E99461496K46823R03845J597404J913130J669705J251400J145601J373708J584530
$$ plain form
1127.9 611147642 612731934 614142120 615221143 615746140 615482867 614439428 612836659 610833824 608595550
1146.2 608595550 606432855 604608715 603140354 601957083 601140678 600845516 601159990 602322400 604786515
1164.6 604786515 608711243 613589704 618644357 623477221 628075421 632299900 635835946 638619423
1180.9 638619423 640827477 642403066 643103421 643023610 642512560 641665280 640340686 638611555 636799395
1199.3 636799395 635046780 633217216 631381273 629964411 629088819 628312230 627308369 626192808 625033438
1217.6 625033438 623704195 622206271 620731175 619336963 617871225 616277575 614729524 613409579
1233.9 613409579 612276256 611232817 610300779 609453261 608510554 607442260 606442750 605686188 605122805
1252.3 605122805 604554474 603973031 603476703 603013813 602478206 601975381 601617217 601294339 600873351 600411952
$$ packed form
1127.9F11147642J584292J410186J079023N24997k63273j043439j602769k002835k238274
1146.2F08595550k162695j824140j468361j183271q16405k95162L14474J162410K464115
1164.6F04786515L924728M878461N054653M832864M598200M224479L536046K783477
1180.9F38619423K208054J575589P00355p9811n11050q47280j324594j729131j812160
1199.3F36799395j752615j829564j835943j416862q75592p76589j003861j115561j159370
1217.6F25033438j329243j497924j475096j394212j465738j593650j548051j319945
1233.9F13409579j133323j043439r32038q47518r42707j068294r99510p56562n63383
1252.3F05122805n68331n81443m96328m62890n35607n02825l58164l22878m20988m61399
$$ plain form
1272.7 600411952 599998951 599499822 598780572 598094463 597887933 598069191 598127484 597825348 597290337 596587837
1293.1 596587837 595704556 594709039 593632460 592402160 590908587 589177251 587295055 585264981 582944036
1311.4 582944036 580419838 578030765 575945735 574083626 572312176 570542276 568564951 566140831
1327.8 566140831 563183784 559910595 556570053 553309977 550234079 547574639 545432329 543380260
1344.1 543380260 540973425 538062394 534676731 530807257 526602089 522369623 518281043 514116585
1360.4 514116585 509709060 505363226 501035511 496270746 491224021 486211032 481253475 476555735
1376.7 476555735 471801698 466594100 461114049 455627173 449830711 443643481 437424183 430356979
1393 430356979 421816379 412592113 402861506 392903626 382890910 372203767 361714512 351921678
$$ packed form
1272.7F00411952m13001m99129p19250o86109k06530J81258N8293l02136n35011p02500
1293.1E96587837q83281r95517j076579j230300j493573j731336j882196k030074k320945
1311.4E82944036k524198k389073k085030j862109j771450j769900j977325k424120
1327.8E66140831k957047l273189l340542l260076l075898k659440k142310k052069
1344.1E43380260k406835k911031l385663l869474m205168m232466m088580m164458
1360.4E14116585m407525m345834m327715m764765n046725n012989m957557m697740
1376.7D76555735m754037n207598n480051n486876n796462o187230o219298p067204
1393D30356979q540600r224266r730607r957880j0012716j0687143j0489255r792834
$$ plain form
1409.3 351921678 342417210 333474636 325506747 318258077 311983168 308186978 306561351 306289464
1425.7 306289464 307048738 308623940 310748875 313006341 315385371 317837119 319745362 321140915
1442 321140915 322208107 323007345 323694944 324355632 324962974 325425744 326003402 327229887 328689784
1460.3 328689784 329826236 330751568 331629038 332423121 333177298 334287614 335969955 337864757 339772940
1478.7 339772940 341722459 343893588 346265495 348925322 352245122 356307149 360371500 364586085
1495 364586085 369850427 375774562 381452650 386527359 392125458 400037050 407625645 413810581 419794798
1513.4 419794798 426015615 432727844 439523786 446825713 454031944 460466921 466897905 472703636
1529.7 472703636 478153288 484254092 489766657 494270205 500020683 506812930 512716591 518068969
$$ packed form
1409.3C51921678r504468q942574p967889p248670o274909l796190j625627k71887
1425.7C06289464P59274J575202K124935K257466K379030K451748J908243J395553
1442C21140915J067192P99238O87599O60688O07342M62770N77658J226485J459897
1460.3C28689784J136452R25332Q77470P94083P54177J110316J682341J894802J908183
1478.7C39772940J949519K171129K371907K659827L319800M062027M064351M214585
1495C64586085N264342N924135N678088N074709N598099P911592P588595O184936N984217
1513.4D19794798O220817O712229O795942P301927P206231O434977O430984N805731
1529.7D72703636N449652O100804N512565M503548N750478O792247N903661N352378
$$ plain form
1546 518068969 523049474 528179586 533371270 538266480 542602301 547839582 554547071 559152305 562582433
1564.3 562582433 566033065 569439888 572808266 575443864 577489436 579868972 582043171 583572030
1580.7 583572030 584847033 585960865 586658239 586911738 586929262 586791933 586335719 585544825 584654629
1599 584654629 583675086 582443655 580854475 579039812 577068567 574903548 572492361 569683433 566797733
1617.4 566797733 564585567 562410831 559866369 557641745 555730164 553966224 552542269 551311731
1633.7 551311731 550278008 549979508 550268114 550914884 551765740 552889287 554690778 556476474 558354199
1652 558354199 561520934 564652205 567282975 570071101 573228955 576613188 579705954 582932055 586754084
1670.4 586754084 590321124 593954325 598107755 601835966 604923964 608185709 612891376 617595851
$$ packed form
1546E18068969M980505N130112N191684M895210M335821N237281O707489M605234L430128
1564.3E62582433L450632L406823L368378K635598K045572K379536K174199J528859
1580.7E83572030J275003J113832O97374K53499J7524j37329m56214p90894q90196
1599E84654629r79543j231431j589180j814663j971245k165019k411187k808928k885700
1617.4E66797733k212166k174736k544462k224624j911581j763940j423955j230538
1633.7E51311731j033723k98500K88606O46770Q50856J123547J801491J785696J877725
1652E58354199L166735L131271K630770K788126L157854L384233L092766L226101L822029
1670.4E86754084L567040L633201M153430L728211L087998L261745M705667M704475
$$ plain form
1686.7 617595851 621310055 625127375 628858149 632805526 637191474 641716003 647281826 652144492
1703 652144492 656020761 660140574 664067984 667449594 670266807 672838271 675995231 679318428 681763291
1721.4 681763291 683814049 686006665 688077152 689809740 691232502 693143308 695589244 697359860
1737.7 697359860 698962927 701027393 703213751 705188692 707040191 709318697 712022424 714221537
1754 714221537 715974391 717809319 719625294 721375585 722887397 724159598 725441039 726540446 727503538
1772.4 727503538 728499711 729140937 729208708 728894770 728573143 728319168 727914989 727284133 726734579 726693571
1792.8 726693571 726801932 726645052 726652861 727344632 728480041 729602516 730851650 732509494 734462261
1811.1 734462261 736312926 738055587 739955425 741844833 743322670 744521618 745867789 747144520
$$ packed form
1686.7F17595851L714204L817320L730774L947377M385948M524529N565823M862666
1703F52144492L876269M119813L927410L381610K817213K571464L156960L323197K444863
1721.4F81763291K050758K192616K070487J732588J422762J910806K445936J770616
1737.7F97359860J603067K064466K186358J974941J851499K278506K703727K199113
1754G14221537J752854J834928J815975J750291J511812J272201J281441J099407R63092
1772.4G27503538R96173O41226O7771l13938l21627k53975m04179o30856n49554m1008
1792.8G26693571J08361j56880P809O91771J135409J122475J249134J657844J952767
1811.1G34462261J850665J742661J899838J889408J477837J198948J346171J276731
$$ plain form
1827.4 747144520 748151660 749183357 750284791 751293778 752088130 752664208 753208160 753976285 754830420
1845.8 754830420 755467832 756145418 756956458 757568836 757961869 758470237 759161651 759704292 759966910 760209978
1866.2 760209978 760762870 761501729 762031317 762499154 763084292 763549209 763791978 764115691 764644563 765054107
1886.6 765054107 765248656 765578032 766099334 766516447 766742051 767001510 767462492 767893910 768087506 768248141
1907 768248141 768620610 769031227 769196689 769251108 769509912 769916356 770125747 770280957 770645797 770996511
1927.4 770996511 771112084 771166325 771404266 771696866 771799207 771786213 771958709 772305369 772478819 772520602
1947.8 772520602 772721469 772992551 773098767 773139775 773335457 773606539 773707747 773678303 773794830 774099886
1968.2 774099886 774314523 774378657 774522603 774767160 774912596 774931312 775014341 775198221 775299668 775257647
$$ packed form
1827.4G47144520J007140J031697J101434J008987P94352N76078N43952P68125Q54135
1845.8G54830420O37412O77586Q11040O12378L93033N08368O91414N42641K62618K43068
1866.2G60209978N52892P38859N29588M67837N85138M64917K42769L23713N28872M09544
1886.6G65054107J94549L29376N21302M17113K25604K59459M60982M31418J93596J60635
1907G68248141L72469M10617J65462N4419K58804M06444K09391J55210L64840L50714
1927.4G70996511J15573N4241K37941K92600J02341j2994J72496L46660J73450M1783
1947.8G72520602K00867K71082J06216M1008J95682K71082J01208k9444J16527L05056
1968.2G74099886K14637O4134J43946K44557J45436J8716Q3029J83880J01447m2021
$$ plain form
1988.6 775257647 775259316 775408745 775514901 775478959 775474131 775582790 775660217 775627434 775601745 775661230 775687397
2011 775687397 775587440 775471568 775472403 775502086 775420308 775302351 775261104 775247037 775157392 775048554 775035620 775062680
2035.5 775062680 775008023 774925232 774930239 774970472 774953604 774916410 774957597 775050581 775086701 775091708 775166810 775281787
2060 775281787 775329173 775333822 775402904 775520861 775585353 775616527 775710583 775863528 775983512 776053965 776149571
2082.4 776149571 776279807 776383221 776449203 776530623 776625276 776682258 776705503 776751578 776836693 776914001 776964545
2104.8 776964545 777016521 777071834 777090192 777079940 777101636 777181745 777259469 777284682 777312398 777376950 777434409
2127.3 777434409 777451575 777461290 777508855 777586758 777661800 777732790 777836025 777978063 778102040 778191447 778295100
2149.7 778295100 778432667 778581083 778729618 778919339 779155612 779391944 779625356 779871941 780113876 780333579
$$ packed form
1988.6G75257647J669J49429J06156l5942m828J08659P7427l2783k5689N9485K6167
2011G75687397r9957j15872Q35K9683q1778j17957m1247j4067q9645j08838j2934K7060
2035.5G75062680n4657q2791N007M0233j6868l7194M1187R2984L6120N007P5102J14977
2060G75281787M7386M649O9082J17957O4492L1174R4056J52945J19984P0453R5606
2082.4G76149571J30236J03414O5982Q1420R4653N6982K3245M6075Q5115P7308N0544
2104.8G76964545N1976N5313J8358j0252K1696Q0109P7724K5213K7716O4552N7459
2127.3G77434409J7166R715M7565P7903P5042P0990J03235J42038J23977Q9407J03653
2149.7G78295100J37567J48416J48535J89721K36273K36332K33412K46585K41935K19703
$$ plain form
2170.1 780333579 780564487 780839384 781135201 781390786 781601429 781834006 782109141 782378197 782611549 782824278
2190.5 782824278 783031940 783222198 783393562 783586562 783801794 783989370 784132481 784269631 784420013 784553230
2210.9 784553230 784673095 784804046 784933746 785033762 785112441 785210788 785328090 785425127 785507083 785601556
2231.3 785601556 785697997 785784900 785890996 786033332 786151946 786213756 786295176 786427259 786546350 786637604
2251.7 786637604 786734819 786860347 787002087 787125647 787243485 787365496 787467659 787571013 787739336 787942052
2272.1 787942052 788075626 788171411 788300395 788406253 788455427 788509488 788578808 788615048 788608849 788597286 788604379
2294.5 788604379 788592875 788544655 788508058 788479388 788392007 788213551 787978053 787769735 787625790 787470102
2314.9 787470102 787225425 786917090 786626279 786410689 786257088 786095262 785888076 785715699 785640359 785575926
$$ packed form
2170.1G80333579K30908K74897K95817K55585K10643K32577K75135K69056K33352K12729
2190.5G82824278K07662J90258J71364J93000K15232J87576J43111J37150J50382J33217
2210.9G84553230J19865J30951J29700J00016P8679R8347J17302R7037Q1956R4473
2231.3G85601556R6441Q6903J06096J42336J18614O1810Q1420J32083J19091R1254
2251.7G86637604R7215J25528J41740J23560J17838J22011J02163J03354J68323K02716
2272.1G87942052J33574R5785J28984J05858M9174N4061O9320L6240o199j1563P093
2294.5G88604379j1504m8220l6597k8670q7381j78456k35498k08318j43945j55688
2314.9G87470102k44677l08335k90811k15590j53601j61826k07186j72377p5340o4433
$$ plain form
2335.3 785575926 785473168 785394251 785432100 785741150 786432445 786970675 786767066 785996974 785178304 784554482
2355.7 784554482 784125865 783982217 784144640 784522831 785093129 785835445 786644697 787407637 788080752 788703918
2376.1 788703918 789313793 789855599 790256083 790549636 790770113 790866613 790854037 790832341 790808737 790725052
2396.5 790725052 790593922 790495396 790467024 790434957 790343881 790246904 790170670 790054083 789892435 789758682 789663970
2418.9 789663970 789533794 789341569 789158106 789003372 788822055 788595259 788389802 788238406 788027406 787710786
2439.3 787710786 787425935 787224770 786988795 786677778 786389410 786137342 785816133 785416842 785025656 784647286
2459.7 784647286 784211397 783704758 783187270 782679915 782109380 781413436 780637920 779815495 778892517 777847588
2480.1 777847588 776772797 775744498 774691284 773550630 772400498 771310389 770253956 769245207
$$ packed form
2335.3G85575926j02758p8917L7849L09050O91295N38230k03609p70092q18670o23822
2355.7G84554482m28617j43648J62423L78191N70298P42316Q09252P62940O73115O23166
2376.1G88703918O09875N41806M00484K93553K20477R6500j2576k1696k3604q3685
2396.5G90725052j31130r8526k8372l2067r1076r6977p6234j16587j61648j33753r4712
2418.9G89663970j30176j92225j83463j54734j81317k26796k05457j51396k11000l16620
2439.3G87710786k84851k01165k35975l11017k88368k52068l21209l99291l91186l78370
2459.7G84647286m35889n06639n17488n07355n70535o95944p75516q22425r22978j044929
2480.1G77847588j074791j028299j053214j140654j150132j090109j056433j008749
$$ plain form
2496.4 769245207 768367887 767631590 766940236 766216516 765479386 764753997 763976634 763089418 762180686 761387348
2516.8 761387348 760740936 760218322 759863555 759730577 759761989 759883225 760132194 760567248 761131108 761691511
2537.2 761691511 762184441 762640595 763100863 763575852 764069438 764622211 765240908 765804827 766225696 766559482
2557.6 766559482 766846418 767043591 767179728 767360806 767559171 767648220 767651737 767675281 767702520 767652571 767538428
2580 767538428 767440319 767369568 767260790 767100275 766962588 766841710 766657174 766421795 766225040 766108692
2600.4 766108692 765985191 765787363 765598297 765489817 765400231 765272081 765160441 765101910 765052617 764985919
2620.8 764985919 764922142 764880419 764824569 764717102 764620364 764594316 764577508 764515340 764441073 764372051 764258683
2643.3 764258683 764077783 763884902 763726711 763557017 763321698 763060570 762838840 762630224 762356222 762040019
$$ packed form
2496.4G69245207q77320p36297o91354p23720p37130p25389p77363q87216r08732p93338
2516.8G61387348o46412n22614l54767j32978L1412J21236K48969M35054N63860N60403
2537.2G61691511M92930M56154M60268M74989M93586N52773O18697N63919M20869L33786
2557.6G66559482K86936J97173J36137J81078J98365Q9049L517K3544K7239m9949j14143
2580G67538428r8109p0751j08778j60515j37687j20878j84536k35379j96755j16348
2600.4G66108692j23501j97828j89066j08480q9586j28150j11640n8531m9293o6698
2620.8G64985919o3777m1723n5850j07467r6738k6048j6808o2168p4267o9022j13368
2643.3G64258683j80900j92881j58191j69694k35319k61128k21730k08616k74002l16203
$$ plain form
2663.7 762040019 761755824 761470556 761136889 760821342 760564268 760281861 759923100 759557545 759246349 758942008
2684.1 758942008 758587182 758200705 757820249 757449865 757086337 756731868 756379902 756014168 755608380 755177736
2704.5 755177736 754775643 754389167 753967166 753547192 753179073 752841592 752495408 752125323 751746356 751355112
2724.8 751355112 750973284 750639558 750342548 750043929 749731779 749429405 749131918 748827517 748519897 748232722
2745.2 748232722 747979999 747719944 747425675 747114599 746790469 746444881 746098638 745748281 745367885 744977236
2765.6 744977236 744592845 744204223 743810475 743411422 743016958 742630422 742209375 741715491 741185308 740671992
2786 740671992 740160167 739616573 739040315 738454401 737840354 737148643 736430764 735747874 735035658 734230578
2806.4 734230578 733380258 732540429 731674016 730727911 729725122 728709459 727661550 726546705 725389183
$$ packed form
2663.7G62040019k84195k85268l33667l15547k57074k82407l58761l65555l11196l04341
2684.1G58942008l54826l86477l80456l70384l63528l54469l51966l65734m05788m30644
2704.5G55177736m02093l86476m22001m19974l68119l37481l46184l70085l78967l91244
2724.8G51355112l81828l33726k97010k98619l12150l02374k97487l04401l07620k87175
2745.2G48232722k52723k60055k94269l11076l24130l45588l46243l50357l80396l90649
2765.6G44977236l84391l88622l93748l99053l94464l86536m21047m93884n30183n13316
2786G40671992n11825n43594n76258n85914o14047o91711p17879o82890p12216q05080
2806.4G34230578q50320q39829q66413r46105j002789j015663j047909j114845j157522
$$ plain form
2824.8 725389183 724211991 722951949 721553266 720064223 718490899 716742694 714779854 712580323
2841.1 712580323 710046291 707113802 703943729 701013088 698831201 697470903 696625829 696019650 695532024
2859.5 695532024 695026934 694292545 693273544 692118049 690914810 689652324 688447297 687463403 686607301
2877.8 686607301 685670972 684610844 683497548 682317078 680989206 679608822 678366244 677306175
2894.1 677306175 676403165 675681353 675151885 674703002 674142361 673371732 672379076 671083391 669412971
2912.5 669412971 667550206 665859282 664551497 663610101 663018048 662846446 663043022 663447559 664059043
2930.8 664059043 664929807 665956318 666983008 667937815 668854296 669791400 670745611 671692491 672591686
2949.2 672591686 673355043 673927546 674357414 674775660 675286949 675893247 676548064 677246690 678064883 679065585
$$ packed form
2824.8G25389183j177192j260042j398683j489043j573324j748205j962840k199531
2841.1G12580323k534032k932489l170073k930641k181887j360298q45074o06179m87626
2859.5F95532024n05090p34389j019001j155495j203239j262486j205027r83894q56102
2877.8F86607301r36329j060128j113296j180470j327872j380384j242578j060069
2894.1F77306175r03010p21812n29468m48883n60641p70629r92656j295685j670420
2912.5F69412971j862765j690924j307785r41396n92053j71602J96576M04537O11484
2930.8F64059043Q70764J026511J026690R54807R16481R37104R54211R46880Q99195
2949.2F72591686P63357N72503M29868M18246N11289O06298O54817O98626Q18193J000702
$$ plain form
2969.6 679065585 680228412 681524098 682911098 684259057 685485184 686659694 687828064 688907087
2985.9 688907087 689832211 690641880 691377938 692016482 692511439 692912698 693295419 693597794 693735957 693759978
3006.3 693759978 693750262 693685412 693512619 693281829 693092823 692908406 692584455 692095041 691555500 690999448
3026.7 690999448 690350711 689649105 689000428 688366354 687633038 686776280 685878754 685007751 684126616 683217406
3047.1 683217406 682349920 681503117 680552900 679531753 678561091 677608073 676615834 675635815 674725473
3065.5 674725473 673847198 672915637 671945453 671038568 670206666 669340909 668380678 667394996 666432977 665453911
3085.8 665453911 664475620 663540244 662589490 661588788 660605490 659659982 658684969 657627881 656518281
3104.2 656518281 655431211 654374063 653289437 652184546 651129723 650074005 648913026 647642791
$$ packed form
2969.6F79065585J162827J295686J387000J347959J226127J174510J168370J079023
2985.9F88907087R25124Q09669P36058O38544M94957M01259L82721L02375J38163K4021
3006.3F93759978r716o4850j72793k30790j89006j84417l23951m89414n39541n56052
3026.7F90999448o48737p01606o48677o34074p33316q56758q97526q71003q81135r09210
3047.1F83217406q67486q46803r50217j021147r70662r53018r92239r80019r10342
3065.5F74725473q78275r31561r70184r06885q31902q65757r60231r85682r62019r79066
3085.8F65453911r78291r35376r50754j000702r83298r45508r75013j057088j109600
3104.2F56518281j087070j057148j084626j104891j054823j055718j160979j270235
$$ plain form
3120.5 647642791 646311522 645010471 643765271 642498493 641187251 639863491 638544500 637246251
3136.8 637246251 635952830 634572864 633070827 631546438 630065322 628634870 627266407 625837088
3153.2 625837088 624233127 622568607 620952845 619366884 617782831 616182566 614565551 612932265
3169.5 612932265 611277401 609625697 607974887 606286645 604580283 602887273 601176739 599420428
3185.8 599420428 597667098 595963001 594256878 592484832 590674758 588884950 587122560 585361302
3202.1 585361302 583583355 581812680 580047727 578234434 576378524 574540854 572745204 570941389
3218.4 570941389 569081545 567206085 565354109 563501358 561689794 560014963 558442295 556833088
3234.7 556833088 555188000 553653121 552265763 550939143 549642682 548361957 547038555 545694828
$$ packed form
3120.5F47642791j331269j301051j245200j266778j311242j323760j318991j298249
3136.8F37246251j293421j379966j502037j524389j481116j430452j368463j429319
3153.2F25837088j603961j664520j615762j585961j584053j600265j617015j633286
3169.5F12932265j654864j651704j650810j688242j706362j693010j710534j756311
3185.8E99420428j753330j704097j706123j772046j810074j789808j762390j761258
3202.1E85361302j777947j770675j764953j813293j855910j837670j795650j803815
3218.4E70941389j859844j875460j851976j852751j811564j674831j572668j609207
3234.7E56833088j645088j534879j387358j326620j296461j280725j323402j343727
$$ plain form
3251.1 545694828 544380486 543064058 541690946 540255547 538805068 537377417 536006808 534731507
3267.4 534731507 533551633 532395840 531215549 530020237 528788567 527545035 526320398 525083125
3283.7 525083125 523861527 522692144 521539807 520342231 519044638 517644405 516205430 514814675
3300 514814675 513549745 512422800 511291087 509955525 508393466 506766021 505199075 503660321 502101183
3318.4 502101183 500517309 498870999 497137159 495272756 493255794 491195291 489160448 487160832
3334.7 487160832 485221654 483274132 481295258 479380190 477534860 475779265 474205375 472700894
3351 472700894 471103519 469487220 467939198 466434926 464918554 463373542 461894274 460487753 458984941
3369.3 458984941 457313985 455669969 454241216 452964514 451749235 450562447 449395090 448300570
$$ packed form
3251.1E45694828j314342j316428j373112j435399j450479j427651j370609j275301
3267.4E34731507j179874j155793j180291j195312j231670j243532j224637j237273
3283.7E25083125j221598j169383j152337j197576j297593j400233j438975j390755
3300E14814675j264930j126945j131713j335562j562059j627445j566946j538754j559138
3318.4E02101183j583874j646310j733840j864403k016962k060503k034843j999616
3334.7D87160832j939178j947522j978874j915068j845330j755595j573890j504481
3351D72700894j597375j616299j548022j504272j516372j545012j479268j406521j502812
3369.3D58984941j670956j644016j428753j276702j215279j186788j167357j094520
$$ plain form
3385.7 448300570 447351784 446549773 445683986 444556594 443369716 442452848 441735029 440841079 439735562
3404 439735562 438779265 438081175 437504888 436956942 436363459 435751528 435275376 434977412 434720844 434495747
3424.4 434495747 434434652 434532344 434629023 434733212 434933066 435071230 435004324 434919506 435051680 435384929
3444.8 435384929 435836732 436344594 436866820 437435001 438092977 438879043 439770281 440611690 441436112 442484230
3465.2 442484230 443705410 444764644 445549697 446330845 447325647 448533267 449774235 450882792 451990753
3483.6 451990753 453251541 454586774 455936164 457315266 458705813 460156709 461637914 463082314
3499.9 463082314 464574933 466094106 467526197 468992174 470616877 472382903 474182814 475882173
3516.2 475882173 477530569 479239225 481104344 483005971 484751672 486528099 488521278 490592182
$$ packed form
3385.7D48300570r48786q02011q65787j127392j186878r16868p17819q93950j105517
3404D39735562r56297o98090n76287n47946n93483o11931m76152k97964k56568k25097
3424.4D34495747o1095R7692R6679J04189J99854J38164o6906q4818J32174L33249
3444.8D35384929M51803N07862N22226N68181O57976P86066Q91238Q41409Q24422J048118
3465.2D42484230J221180J059234P85053P81148R94802J207620J240968J108557J107961
3483.6D51990753J260788J335233J349390J379102J390547J450896J481205J444400
3499.9D63082314J492619J519173J432091J465977J624703J766026J799911J699359
3516.2D75882173J648396J708656J865119J901627J745701J776427J993179K070904
$$ plain form
3532.5 490592182 492664605 494775593 496859431 498942792 501121759 503409624 505700529 507842422
3548.8 507842422 509953380 512284219 514720917 517114401 519583106 522085428 524325907 526486099
3565.1 526486099 529399872 532774627 535610199 538125396 540824354 543708384 546701550 549730778
3581.5 549730778 552577078 555360734 558717072 562332034 565342665 568261206 571597278 574982107
3597.8 574982107 578319013 581738889 584905744 587804377 591135681 594829679 598357320 601744592
3614.1 601744592 604771912 608094454 612344503 616075993 618559837 620678604 624447882 629521966
3630.4 629521966 633081377 635954857 639083326 642154038 645171881 647944331 650116265 652351737
3646.7 652351737 656316936 661204696 664192975 666251421 669394910 672585189 674906731 677012086
$$ packed form
3532.5D90592182K072423K110988K083838K083361K178967K287865K290905K141893
3548.8E07842422K110958K330839K436698K393484K468705K502322K240479K160192
3565.1E26486099K913773L374755K835572K515197K698958K884030K993166L029228
3581.5E49730778K846300K783656L356338L614962L010631K918541L336072L384829
3597.8E74982107L336906L419876L166855K898633L331304L693998L527641L387272
3614.1F01744592L027320L322542M250049L731490K483844K118767L769278N074084
3630.4F29521966L559411K873480L128469L070712L017843K772450K171934K235472
3646.7F52351737L965199M887760K988279K058446L143489L190279K321542K105355
$$ plain form
3663 677012086 678845286 680262327 682419658 685202062 686813712 688998163 692152977 694062829 695409119
3681.4 695409119 696602643 697380006 698643565 701015532 703043163 704089820 704849482 705534458 706300497
3699.8 706300497 707621872 708997846 709566891 709745407 710464716 712165773 713541508 713815391 713817179
3718.1 713817179 714057267 714517951 715068758 715707302 716013610 715781271 715786755 716704428 718256593 719086587
3738.5 719086587 718316436 717356265 718340337 719339013 718942940 719644785 721175551 721488059 721182466
3756.9 721182466 721437395 721999109 721973896 721825659 721985161 722448647 723147511 723397553 723160803 723068118
3777.3 723068118 723519027 723929286 723848164 723906338 724183440 724352896 724315107 723997235 723836541 723748267
3797.7 723748267 723548412 724198639 724683583 724551916 725121677 725392342 724641204 723900914 724176347 724413872
$$ packed form
3663F77012086J833200J417041K157331K782404J611650K184451L154814J909852J346290
3681.4F95409119J193524P77363J263559K371967K027631J046657P59662O84976P66039
3699.8G06300497J321375J375974N69045J78516P19309J701057J375735K73883J788
3718.1G13817179K40088M60684N50807O38544L06308k32339N484R17673J552165Q29994
3738.5G19086587p70151r60171R84072R98676l96073P01845J530766L12508l05593
3756.9G21182466K54929N61714k5213j48237J59502M63486O98864K50042k36750r2685
3777.3G23068118M50909M10259q1122N8174K77102J69456l7789l17872j60694q8274
3797.7G23748267j99855O50227M84944j31667N69761K70665p51138p40290K75433K37525
$$ plain form
3818 724413872 724361241 725261450 725643218 725278854 725066662 724845469 724671841 724473894 724475682 725060284
3838.4 725060284 725471139 725543201 725705862 725477755 724411309 722947717 723203480 725585043 726263523
3856.8 726263523 725399256 724631250 724445283 724636257 724382818 724205911 724733889 725034118 725079834 724722087
3877.2 724722087 724273324 724375010 724285722 724425852 724690795 724287808 724302471 724645913 724147737 723339260
3897.6 723339260 723077059 723326921 723956048 724546432 724448800 724033535 723729670 723342478 723088145 723260105
3918 723260105 723414123 723246098 723164916 723234773 722976983 722620726 722696900 722917855 722850561 722542644 722175777
3940.4 722175777 722072005 722149491 722047508 721977890 722037256 721997023 721861422 721708000 721552789 721465826
3960.8 721465826 721460402 721417367 721325099 721269190 721226871 721171796 721160054 721145689 721069038 721010566 720987499 720906436
$$ packed form
3818G24413872n2631R00209L81768l64364k12192k21193j73628j97947J788N84602
3838.4G25060284M10855P2062J62661k28107j066446j463592K55763K381563O78480
3856.8G26263523q64267p68006j85967J90974k53439j76907N27978L00229M5716l57747
3877.2G24722087m48763J01686q9288J40130K64943m02987J4663L43442m98176q08477
3897.6G23339260k62201K49862O29127N90384r7632m15265l03865l87192k54333J71960
3918G23260105J54018j68025q1182O9857k57790l56257P6174K20955o7294l07917l66867
3940.4G22175777j03772P7486j01983o9618N9366m0233j35601j53422j55211q6963
3960.8G21465826n424m3035r2268n5909m2319n5075j1742j4365p6651n8472k3067q1063
$$ plain form
3985.3 720906436 720802486 720759273 720712423 720626473 720557392 720491886
3997.5 720491886
$$ packed form
3985.3G20906436j03950m3213m6850q5950o9081o5506
3997.5G20491886
##END=$$ End of the data block
