##TITLE=T4PR $$ Begin of the data block
##JCAMP-DX=5.00 $$ ACD/SpecManager v 10.08
##SPECTROMETER/DATA SYSTEM=Alpha
##DATE=12 Mar 2014 10:59:36
##DATA TYPE=INFRARED SPECTRUM
##DATA CLASS=XYDATA
##ORIGIN=
##OWNER=
##NPOINTS=1765
##FIRSTX=399.75695801
##LASTX=3997.56933594
##MAXX=3997.56933594
##MINX=399.75695801
##MAXY=0.76436681
##MINY=0.37359339
##XFACTOR=1.0000000000
##YFACTOR=1.000000000000000e-9
##FIRSTY=0.59075350
##DELTAX=2.03957629
##XUNITS=1/CM
##YUNITS=ARBITRARY UNITS
##XYDATA=(X++(Y..Y))
399.8E90753496J952767K025068J595318J198113J151383J199365J096070P58349p7009
418.1F01652920m40061L22938N65529N3883l47734l64482m12107m21047P6771O27041
438.5F01313651M03583n8771L8267L33666O64831R80496M93586l71814n48660k21134
458.9F03027701J18137L03447K28286j57774m77731o55711q02576n44667q7023k6345
479.3F00925744k19465k0325K46883L4630m292L85762M09245M4584L9101O9916l04699
501.7F01607084l79979k94030p26223r72331o74724p69317j444042j402617n73873
520.1E94369948m26769p81536o15120k43843k08020k8789K52485K13742K34545L92019
540.5E93158662O6817o15120p58588o26624r03666r86218p81417j029909j246273o83546
$$ plain form
399.8 590753496 592706263 594731331 596326649 597524762 598676145 599875510 600971580 601729929 601652920
418.1 601652920 601212859 601535797 602101326 602155209 601807475 601442993 601030886 600609839 600686610 601313651
438.5 601313651 601717234 601658463 601696730 602030396 602695227 603675723 604169309 603797495 603248835 603027701
458.9 603027701 603145838 603449285 603677571 603519797 603042066 602386355 601583779 601039112 600952089 600925744
479.3 600925744 600706279 600685954 600932837 600967467 600963175 601348937 601758182 601802766 601841867 601911783 601607084
501.7 601607084 601227105 600933075 600206852 599234521 598559797 597790480 596346438 594943821 594369948
520.1 594369948 593943179 593161643 592546523 592302680 592094660 592065871 592318356 592532098 592766643 593158662
540.5 593158662 593225479 592610359 591851771 591225147 590321481 589335263 588553846 587523937 586277664 585594118
560.9E85594118k31266o05762r40442q73566j062393j294852r61244m94659l35335
579.2E78794599J04129R23514J202047J065254J143337J061856N56171K58625M19855
597.6E85529387K11656m11749n62787m46617o76275p28249k03193J26064R6202O06060
618E83540499J445949J706302J735628J907885J738191J361370J566827J940370J620114
636.3E98563135J200080J295030J208901Q11339Q77916J044572P01725M06087M25219
654.7F06534004J17660m03166l68774Q2791K87115l04877l27528J155794J443267J310467
675.1F09526753J461268J241386J061201J247466J020491M24027K16425J30415m81248
693.5F15848184j460255k305388j572907O08802J253545k58148k286791m149139l733516
$$ plain form
560.9 585594118 585362852 584757090 583816648 582943082 581880689 580585837 579624593 579129934 578794599
579.2 578794599 578898728 579822242 581024289 582089543 583232880 584294736 584850907 585109532 585529387
597.6 585529387 585741043 585329294 584766507 584319890 583643615 582915366 582712173 582838237 582934439 583540499
618 583540499 584986448 586692750 588428378 590336263 592074454 593435824 595002651 596943021 598563135
636.3 598563135 599763215 601058245 602267146 603078485 603956401 605000973 605702698 606108785 606534004
654.7 606534004 606651664 606248498 605879724 605962515 606249630 605944753 605617225 606773019 608216286 609526753
675.1 609526753 610988021 612229407 613290608 614538074 615558565 615982592 616199017 616329432 615848184
693.5 615848184 614387929 612082541 610509634 611118436 612371981 612113833 609827042 605677903 601944387
711.8F01944387M69804M437506M942596M357874M323840M389227M562259M404902L501773
730.2F37334168K519131J869380J142800N35130O36876R96769R49263Q54492R54688
748.5F47792697P07746J73866P2897J72376j32620k61724J00434J77264R4116P35223
768.9F49632275J619816J795232J836956K226531K131880J550197J454413J570106
785.2F63817406J125216P74980J098990J217544Q84474J025855J338661J018762P04766
803.6F73006654Q11875N74410M6849P9512K26617j55747k63929K01702K26140j92046
824F74562037j47283j3471n06878r40740q37981j117349j892686k246439j907588j605153
844.4F63346469k432644l895342n316675o664217o075561k885460O28173K846539L269672
$$ plain form
711.8 601944387 602414191 606851697 611794293 616152167 620476007 624865234 629427493 633832395 637334168
730.2 637334168 639853299 641722679 642865479 643400609 644037485 645034254 645983517 646838009 647792697
748.5 647792697 648500443 648674309 648747206 648919582 648786962 648525238 648625672 648802936 648897052 649632275
768.9 649632275 651252091 653047323 654884279 657110810 659242690 660792887 662247300 663817406
785.2 663817406 664942622 665717602 666816592 668034136 668918610 669944465 671283126 672301888 673006654
803.6 673006654 673818529 674392939 674439788 674519300 674745917 674590170 674326241 674527943 674754083 674562037
824 674562037 674414754 674401283 673894405 672953665 672115684 670998335 669105649 666859210 664951622 663346469
844.4 663346469 660913825 657018483 651701808 645037591 638962030 636076570 636704743 639551282 642820954
862.7F42820954J282215l508091j0346651j5720903j5048564p775187L389775J4744997
879.1F09838545K0825088J9310475J4049709Q942782N073786K811432J797259J339436
895.4F83988512J502156K029121K044677J628399J360774R35078J28210n72026j171827
913.7F91873074k127767l080189l409624l552497l916859l789843k932488k075017
930F66988790j230121J2994J058340J376391J493156J521110Q80242j77145r96054
948.4F70927703j860320l003538l824353m243553m863620n450308n464792n361855
964.7F36855364n447447n288840n005955n241216n883693o467104p162750p967293
981E88391066q239866p840991p345497o968439o465733n906284n432725m794180m035831
$$ plain form
862.7 642820954 644103169 640595078 630248427 614527524 599478960 591703773 595093548 609838545
879.1 609838545 630663633 649974108 664023817 672966599 678040385 680851817 682649076 683988512
895.4 683988512 685490668 687519789 689564466 691192865 692553639 693488717 693616927 693044901 691873074
913.7 691873074 689745307 686665118 683255494 679702997 675786138 671996295 669063807 666988790
930 666988790 665758669 665771663 666830003 668206394 669699550 671220660 672100902 671923757 670927703
948.4 670927703 669067383 666063845 662239492 657995939 653132319 647682011 642217219 636855364
964.7 636855364 631407917 626119077 621113122 615871906 609988213 603521109 596358359 588391066
981 588391066 580151200 572310209 564964712 557996273 551530540 545624256 540191531 535397351 531361520
999.4E31361520l623128l638148l833830m268885n022109n538225n340635m785032
1015.7D95311528m237622l560870k773762k096296j498997j015663q78632q80331m34428
1034.1D77934927M52727J225054J610160J614451J211077O04004J43647j78575m05431
1052.4D84212041k89768K59459J142383K345353L535271L958851L256082J718194j48803
1070.8D99989063j684875k287298j885235j064569L4004K317518M935563N800426N355537
1089.1E11510134M895568M402220L699839K984226K353728J752436J286745R49800
1105.4E33834696O13093M60804P93695J577914K420902K863288K754629K383947K195537
1123.8E49898505K367377K661407K771914K511919J884162J027287L1948j020074k020717
$$ plain form
999.4 531361520 527738392 524100244 520266414 515997529 510975420 505437195 500096560 495311528
1015.7 495311528 491073906 487513036 484739274 482642978 481143981 480128318 479249686 478369355 477934927
1034.1 477934927 478387654 479612708 481222868 482837319 484048396 484652400 484796047 484617472 484212041
1052.4 484212041 483922273 484181732 485324115 487669468 491204739 495163590 498419672 500137866 499989063
1070.8 499989063 498304188 496016890 494131655 493067086 493101090 495418608 500354171 506154597 511510134
1089.1 511510134 516405702 520807922 524507761 527491987 529845715 531598151 532884896 533834696
1105.4 533834696 534447789 534908593 535702288 537280202 539701104 542564392 545319021 547702968 549898505
1123.8 549898505 552265882 554927289 557699203 560211122 562095284 563122571 563154519 562134445 560113728
1142.2E60113728k703905k906978k805472k537787k058208j354873n77211K34187J277625
1160.5E46681106K697885M386366N966067O976008P225514O950557O518602N981863
1176.8E93383968N265772M462421L593147K586305J556277O73414q1122p29919j216531
1195.2F09493732j580297j879812k020120j960874j761734j400352r48906o81996p42734
1213.5E96516907r34839j053155j124620j200795j239359j250387j257896j248360
1229.9E87207496j195609j070440q69215o19709m67062Tm85599l95000k32339l7074
1250.3E81368387J95861L52800L97026M32253N52833P16686Q58903R94384J094223
1268.6E86963356J099884J099289J138150J092613R72331J008689J325846J603901
$$ plain form
1142.2 560113728 557409823 554502845 551697373 549159586 547101378 545746505 545169294 545403481 546681106
1160.5 546681106 549378991 553765357 559731424 566707432 573932946 580883503 587402105 593383968
1176.8 593383968 598649740 603112161 606705308 609291613 610847890 611521304 611440182 610710263 609493732
1195.2 609493732 607913435 606033623 604013503 602052629 600290895 598890543 597941637 597259641 596516907
1213.5 596516907 595582068 594528913 593404293 592203498 590964139 589713752 588455856 587207496
1229.9 587207496 586011887 584941447 584072232 583452523 582985461 582518399 582032800 581637800 581405461 581368387
1250.3 581368387 581564248 581917048 582314074 582746327 583299160 584015846 584874749 585869133 586963356
1268.6 586963356 588063240 589162529 590300679 591393292 592365623 593374312 594700158 596304059
1284.9E96304059J561344J289665R86278P56562O26266N10335L04759O8664j01804
1303.3F02306128k68400n16057p35164j002610j272559j284659j080870q13723o08027
1321.6E94724059o12259q81314j354039j905381k310694k460897k329707k052724j566231
1340E79250813q70586n64635q33034j391113j963019k426446k717256k734602k566397
1358.3E63183725k703190l044248k792179k541065k965689l159464l017842k839804
1374.7E40120244k275705j989484k221346k405405k367020k478301k607286k712429
1391E21063268l814637n329907n899251o382137o620974o810784p721126p723660p266640
1409.3D63494152p302642p028699o392956o450385o471574m229993k254784j354128
$$ plain form
1284.9 596304059 597865403 599155068 600141346 600897908 601524174 602034509 602339268 602407932 602306128
1303.3 602306128 602037728 601521671 600786507 599783897 598511338 597226679 596145809 595332086 594724059
1321.6 594724059 594111800 593230486 591876447 589971066 587660372 585199475 582869768 580817044 579250813
1340 579250813 578380227 577815592 576982558 575591445 573628426 571201980 568484724 565750122 563183725
1358.3 563183725 560480535 557436287 554644108 552103043 549137354 545977890 542960048 540120244
1374.7 540120244 537844539 535855055 533633709 531228304 528861284 526382983 523775697 521063268
1391 521063268 517248631 511918724 506019473 499637336 493016362 486205578 478484452 470760792 463494152
1409.3 463494152 456191510 449162811 442769855 436319470 429847896 425617903 423363119 422008991
1425.7D22008991n45054r031O38396J104802Q27044Q48144J243741R54687M55559J24693
1446D27651972r1404Q4072L95477L04818m22418j29431J563936J723141R17762Q72165
1466.4D32870090J532793J670480J783609K685905L406226L458292L246694L152222
1482.8D53806311L032952K761871K652466L154248L523589L199398K972305L438443
1499.1D78541583L897339L601164K670824K470136L748297M017950L534108L213167
1515.4E05694568L467798L810168M025101M336119M205108M015386L822863L218174
1531.7E36595285K839386L140867K695084J754939K610922L936947M157483L816605
1548E61547518L462374L275692L105045K635240J681805K528429L943086L309130K325535
$$ plain form
1425.7 422008991 421463937 421454906 422093302 423198104 424025148 424873292 426117033 427071720 427527279 427651972
1446 427651972 427560568 427644640 428040117 428344935 427922517 427793086 429357022 431080163 431997925 432870090
1466.4 432870090 434402883 436073363 437856972 440542877 443949103 447407395 450654089 453806311
1482.8 453806311 456839263 459601134 462253600 465407848 468931437 472130835 475103140 478541583
1499.1 478541583 482438922 486040086 488710910 491181046 494929343 498947293 502481401 505694568
1515.4 505694568 509162366 512972534 516997635 521333754 525538862 529554248 533377111 536595285
1531.7 536595285 539434671 542575538 545270622 547025561 549636483 553573430 557730913 561547518
1548 561547518 565009892 568285584 571390629 574025869 575707674 578236103 582179189 585488319 587813854
1566.4E87813854J434684J107395J561165Q71300l36826L98696R63926K93195k84373
1584.7E93823016o55771j054763j398087j626492j820683j856744j826525k030432
1601.1E81553519k273023k378941k550125k884686k866507k645492l568053m582048
1617.4E57804644k914369k335668l586173l436803k821982k556384j882017k227246
1633.7E36044002l482283j993417J4662L12269O6102n67079K14100J826584J036048
1652E33470988N32210K982617L572821K972484K710879L256380L591597L236234L470123
1670.4E59796333M114747M153073M352987M689634M436791L779411M140794N452753
1686.7E94916523N585312N477071N196989M699528M766524N018115N657017O028593
$$ plain form
1566.4 587813854 589248538 590355933 591917098 592788398 592451572 592850268 593814194 594107389 593823016
1584.7 593823016 593167245 592112482 590714395 589087903 587267220 585410476 583583951 581553519
1601.1 581553519 579280496 576901555 574351430 571466744 568600237 565954745 562386692 557804644
1617.4 557804644 554890275 552554607 548968434 545531631 542709649 540153265 538271248 536044002
1633.7 536044002 532561719 530568302 530582964 530895233 530961335 530394256 530608356 532434940 533470988
1652 533470988 534003198 536985815 540558636 543531120 546241999 549498379 553089976 556326210 559796333
1670.4 559796333 563911080 568064153 572417140 577106774 581543565 585322976 589463770 594916523
1686.7 594916523 600501835 605978906 611175895 615875423 620641947 625660062 631317079 637345672
1703F37345672N469024N094349M878462M400730L689944K794862K283871L155768L710270
1721.4F72822952L098965K630532K449453K218246J813948J053393J804352K794743
1737.7F90686584K257645K010464K298951K246321K015769J878798K398312K878070
1754G08670914K427340J971483J765132J511633J830876J793444J189649P03037K95997
1772.4G22159505P60257J094282L62932k74598j93775j60038p7844K80261Q2135K6167
1792.8G24059284R52959J357317R40442P93934J254260J576007J407325J126170J154423
1811.1G34622121J439392J449466J200199J155794J126528P45058N40137O99639M97997
1829.5G43476331O81818J190424R29475N82039O92308M71651k46346J07170J002252
$$ plain form
1703 637345672 642814696 647909045 652787507 657188237 660878181 663673043 665956914 669112682 672822952
1721.4 672822952 675921917 678552449 681001902 683220148 685034096 686087489 687891841 690686584
1737.7 690686584 692944229 694954693 697253644 699499965 701515734 703394532 705792844 708670914
1754 708670914 711098254 713069737 714834869 716346502 718177378 719970822 721160471 721863508 722159505
1772.4 722159505 722919762 724014044 724376976 724102378 723908603 723748565 723670721 723950982 724033117 724059284
1792.8 724059284 725012243 726369560 727310002 728103936 729358196 730934203 732341528 733467698 734622121
1811.1 734622121 736061513 737510979 738711178 739866972 740993500 741738558 742278695 742978334 743476331
1829.5 743476331 744158149 745348573 746278048 746860087 747552395 748024046 747777700 747884870 748887122
1847.8G48887122R39428O30856N33342M86136L83198L39151M15206M42981J33693k53558
1868.2G52937555J81794Q38697P38204M11391K94984K48849K73824L30150K66969K8908
1888.6G56551325J03772M05908L13520K50280L42250K68042K01762K39432J43229M888
1909G58824408J52469L58760K03133j64449m5538K21490J26005K51770L66807J61409
1929.4G60456264O5386J12236R5606Q4996P1347j35899j42217J97888K98738J65344
1949.8G61269689Q9287J01209R2804K4677K0325R1910O6340n5790J0312J82033J52647
1972.3G62045443P2002O1572Q702j7643M2379M5061l4630p9632j41382j49608L3439
1994.7G61885703J12891k206p8916q3566q0049j03474j20341j05203j01387j86980
$$ plain form
1847.8 748887122 749826550 750457406 750990748 751476884 751860082 752199233 752614439 753057420 753191113 752937555
1868.2 752937555 753119349 753958046 754696250 755107641 755402625 755651474 755925298 756255448 756522417 756551325
1888.6 756551325 756655097 757061005 757374525 757624805 757967055 758235097 758436859 758676291 758819520 758824408
1909 758824408 758976877 759335637 759538770 759374321 759328783 759550273 759676278 759928048 760294855 760456264
1929.4 760456264 760521650 760633886 760729492 760814488 760885835 760749936 760607719 760805607 761104345 761269689
1949.8 761269689 761358976 761460185 761552989 761577666 761597991 761689901 761756241 761700451 761710763 761892796 762045443
1972.3 762045443 762117445 762179017 762187719 762170076 762212455 762257516 762222886 762143254 762001872 761852264 761885703
1994.7 761885703 761998594 761996388 761917472 761833906 761753857 761650383 761530042 761424839 761323452 761136472
2015.1G61136472k64644j72019q1420j29640j82212j84059j96874j95921j73866j80900
2035.5G59374917j77801j51813j33932j00851q4400r4712p5638o3241p3313o1632m1425
2057.9G58316159m5180o1214q7380p3612K6583O8307K4856P15l3379o2048k4379K5094
2082.4G58074522L3140J0729j9550k7716j3411J9967L5584J609l1888k4855p391k2054
2106.9G58028686m5538m0054l4809l8386j8537k4974n2810k3424J4066q583l1352k2590
2131.3G57701695l6001n1618n185P0929N8413P15K3484N9724M2915M3631R0659J15811
2155.8G58115172J22726J46985J53900J45793J84238K16066J63615J46687K19166K14577
2176.2G59828925J20998J35660K07662J75596J61171K15411J81257J02342J30891J75894
$$ plain form
2015.1 761136472 760871828 760699809 760618389 760488749 760306537 760122478 759925604 759729683 759555817 759374917
2035.5 759374917 759197116 759045303 758911371 758810520 758726120 758631408 758555770 758492529 758419216 758357584 758316159
2057.9 758316159 758270979 758209765 758122385 758048773 758075356 758143663 758168519 758169234 758135855 758073807 758049428 758074522
2082.4 758074522 758107662 758118391 758098841 758071125 758057714 758077681 758113265 758114874 758082986 758058131 758050740 758028686
2106.9 758028686 757983148 757943094 757908285 757869899 757851362 757826388 757773578 757750154 757764220 757755637 757724285 757701695
2131.3 757701695 757665694 757614076 757608891 757679820 757738233 757738948 757762432 757822156 757865071 757908702 757999361 758115172
2155.8 758115172 758237898 758384883 758538783 758684576 758868814 759084880 759248495 759395182 759614348 759828925
2176.2 759828925 759949923 760085583 760293245 760468841 760630012 760845423 761026680 761129022 761259913 761435807
2196.6G61435807J33455J14202J52111J28925P1406J05441J57893R5665K1339N6505
2217G62472749P3552K4795M3691J02162P8619L1948N2332N2393j431K6644R8228L8922
2241.5G63094604k6941O7174J26481L2187L278Q0705O3598p75M3631R2566L0815O199
2265.9G63613522Q3208R9301O3479J01030J25587N8115L5584J00076Q6904k5630p2182
2288.4G64268994m2796l9339m5121l4391n7459q9884l6717k0146j30415j91510j73926
2310.8G63407290j88708j85967j49786k22028l88860m25518k27630j22607l08871l86655
2331.2G60800660j90616j13845k17855k94864l75032n47588k28286R83775J458466
2349.6G61274815M40299q39531j167238r72033o97195l92735j46926P2062K48015L33846
$$ plain form
2196.6 761435807 761569262 761683464 761835575 761964500 762035906 762141347 762299240 762394905 762416244 762472749
2217 762472749 762546301 762571096 762614787 762716949 762795568 762827516 762879848 762932241 762930810 762957454 763055682 763094604
2241.5 763094604 763067663 763134837 763261318 763293505 763296783 763377488 763441086 763440311 763483942 763576508 763607323 763613522
2265.9 763613522 763696730 763796031 763859510 763960540 764086127 764144242 764179826 764279902 764366806 764341176 764268994
2288.4 764268994 764226198 764186859 764141738 764107347 764049888 763960004 763923287 763903141 763772726 763581216 763407290
2310.8 763407290 763218582 763032615 762882829 762660801 762271941 761846423 761618793 761496186 761187315 760800660
2331.2 760800660 760610044 760496199 760278344 759983480 759608448 759060860 758832574 759816349 761274815
2349.6 761274815 761715114 760875583 759708345 758736312 758039117 757646382 757499456 757571518 757819533 758153379
2370G58153379L72767M44711N36978O03378O50406O14583M56929K38777L7074p1407
2390.4G62037575q5056q9287j25766j47164j42455j37389j28448j49488k07186k23517
2410.8G60601819j96994j78456j78218k07126k26200k32815k37525k15411k16425k63512
2431.2G58449137k90811k79128k85983l17097l11852k93731l05534l09527l01599l27468
2451.5G55426407l75271l78966l73781m06802m21583l97921l99351m65930n30004n62549
2471.9G51114249o09636o82116p34031p58469p98702q12173p80702p83741q21471p83444
2492.3G43549764o70910n97179n35607m53889m21644m07457l78191m14968n41806o62089
2512.7G38466024p07090p05003o30677m66824k84016j35481m3511L3855J21534J86264
$$ plain form
2370 758153379 758526146 758970857 759507835 760111213 760761619 761376202 761833131 762071908 762108982 762037575
2390.4 762037575 761952519 761863232 761737466 761590302 761447847 761310458 761182010 761032522 760825336 760601819
2410.8 760601819 760404825 760226369 760048151 759841025 759614825 759382010 759144485 758929074 758712649 758449137
2431.2 758449137 758158326 757879198 757593215 757276118 756964266 756670535 756365001 756055474 755753875 755426407
2451.5 755426407 755051136 754672170 754298389 753891587 753470004 753072083 752672732 752206802 751676798 751114249
2471.9 751114249 750504613 749822497 749088466 748329997 747531295 746719122 745938420 745154679 744333208 743549764
2492.3 743549764 742878854 742281675 741746068 741292179 740870535 740463078 740084887 739669919 739128113 738466024
2512.7 738466024 737758934 737053931 736423254 735956430 735672414 735536933 735493422 735527277 735648811 735835075
2533.1G35835075K23637K12550J25945K920o6101n5194r120R1553K13206K17795J28627
2555.6G36920893P5340M1664j1384j2637J8120k3484r1851q7023q2790j56582k01523
2578G36388743j72377j69754k17437k47598k61784k77579k55227k24471k64764l35753
2598.4G33961999l34978k97606k97546l07977l14415l30329l50475l56615l46362l46661
2618.8G30679035l41356l02553l10421l68893l78549l57509l49402l53873l37362l18468
2639.2G27260649l44753l57211l51429l74555l94047m03523m26531m41789m36366m26114
2659.6G23304331m24146m13776m07755m34220m49955m38035m30465m41432m68015m79997
2680G18916535m64499m54247m55558m58777m88222n26785n04077m60863m73738m86552
$$ plain form
2533.1 735835075 736058712 736271262 736397207 736400127 736334026 736278832 736269712 736361265 736574471 736792266 736920893
2555.6 736920893 736996233 737037897 737026513 737013876 737031996 737008512 736916661 736829638 736746848 736590266 736388743
2578 736388743 736216366 736046612 735829175 735581577 735319793 735042214 734786987 734562516 734297752 733961999
2598.4 733961999 733627021 733329415 733031869 732723892 732409477 732079148 731728673 731372058 731025696 730679035
2618.8 730679035 730337679 730035126 729724705 729355812 728977263 728619754 728270352 727916479 727579117 727260649
2639.2 727260649 726915896 726558685 726207256 725832701 725438654 725035131 724608600 724166811 723730445 723304331
2659.6 723304331 722880185 722466409 722058654 721624434 721174479 720736444 720305979 719864547 719396532 718916535
2680 718916535 718452036 717997789 717542231 717083454 716595232 716068447 715564370 715103507 714629769 714143217
2700.4G14143217m87566n12541n12004m76539m88281n31197n19216m91142m77493m52578
2720.8G09194660m51624m78983m79579m70281m76777m67778m12583l57568l82722m14788
2741.2G04801977l85583l58462l68238l92496m04239m03166m05252m23491m47333m70817
2761.6G00742900m78983m67598m68552m92573n01394m89175n13018n31315n21243n80967
2782F95698082o68287o67929o27816o50883o97434p19964p62642q03470q22962q64446
2802.3F88412249r37462j004338j014710j032888j124204j193642j213610j246810
2818.7F79644585j296401j367987j458108j532078j591265j678467j804530j940489
2835F66975260k116204k383172k745867l194690l690540l978730l644883k649784j528919
$$ plain form
2700.4 714143217 713655651 713143110 712631106 712154567 711666286 711135089 710615873 710124731 709647238 709194660
2720.8 709194660 708743036 708264053 707784474 707314193 706837416 706369638 705957055 705599487 705216765 704801977
2741.2 704801977 704416394 704057932 703689694 703297198 702892959 702489793 702084541 701661050 701213717 700742900
2761.6 700742900 700263917 699796319 699327767 698835194 698333800 697844625 697331607 696800292 696279049 695698082
2782 695698082 695029795 694361866 693734050 693083167 692385733 691665769 690903127 690099657 689276695 688412249
2802.3 688412249 687474787 686470449 685455739 684422851 683298647 682105005 680891395 679644585
2818.7 679644585 678348184 676980197 675522089 673990011 672398746 670720279 668915749 666975260
2835 666975260 664859056 662475884 659730017 656535327 652844787 648866057 645221174 642571390 641042471
2853.3F41042471q06332n11229m64916o08444q99077j237511j500428j624286j603902
2871.7F31786346j448869j309574j319051j365483j413285j561344j713633j753211
2888F19901896j723052j658976j557052j402497j224458j054764r17077r27389j155257
2906.4F08281374j505673j901805k316475k566457k439618j976907j374245p65979
2922.7E93434215k19465K17080N50449Q25167J067042J275778J421631J486241J497031
2941F01555169J495242J489579J457811J364410J201093R95994Q22961Q07285R22859
2959.4F12112403J053452J160682J234054J332462J523793J781702J944065J910746
2975.7F24053359J797140J682520J535952J403868J323998J201868J061797R64105
$$ plain form
2853.3 641042471 640236139 639724910 639259994 638651550 637752473 636514962 635014534 633390248 631786346
2871.7 631786346 630337477 629027903 627708852 626343369 624930084 623368740 621655107 619901896
2888 619901896 618178844 616519868 614962816 613560319 612335861 611281097 610364020 609436631 608281374
2906.4 608281374 606775701 604873896 602557421 599990964 597551346 595574439 594200194 593434215
2922.7 593434215 593214750 593431830 593982279 594807446 595874488 597150266 598571897 600058138 601555169
2941 601555169 603050411 604539990 605997801 607362211 608563304 609559298 610382259 611189544 612112403
2959.4 612112403 613165855 614326537 615560591 616893053 618416846 620198548 622142613 624053359
2975.7 624053359 625850499 627533019 629068971 630472839 631796837 632998705 634060502 635024607
2992F35024607Q11875O24239M87149L49224J75834K8014o4731j56522k49028l10123
3012.4F36720538l75151m32253m81904n75662o83367p74205q36074q71539r26614r72390
3032.8F29791379j003683j047432j080334j112342j153648j218915j296818j300395
3049.1F20577812j251519j275956j329065j311421j290440j298905j282751j259566
3065.5F10278189j267493j294374j301467j252652j169383j147568j236201j322567
3081.8F00286484j330078j323759j309395j285792j313865j371324j371443j318932
3098.1E89661896j328170j396835j400292j345932j339317j408219j434505j372039
3114.4E78636587j374543j479328j618325j739979j737237j615107j523733j578629
$$ plain form
2992 635024607 635836482 636460721 636947870 637297094 637472928 637500942 637436211 637279689 637030661 636720538
3012.4 636720538 636345387 635913134 635431230 634855568 634172201 633397996 632561922 631690383 630763769 629791379
3032.8 629791379 628787696 627740264 626659930 625547588 624393940 623175025 621878207 620577812
3049.1 620577812 619326293 618050337 616721272 615409851 614119411 612820506 611537755 610278189
3065.5 610278189 609010696 607716322 606414855 605162203 603992820 602845252 601609051 600286484
3081.8 600286484 598956406 597632647 596323252 595037460 593723595 592352271 590980828 589661896
3098.1 589661896 588333726 586936891 585536599 584190667 582851350 581443131 580008626 578636587
3114.4 578636587 577262044 575782716 574164391 572424412 570687175 569072068 567548335 565969706
3130.7E65969706j700342j698613j571477j536250j714408j874566j824975j734078
3147E52314997j698554j657843j717985j889050j959205j908541j848638j847684j883030
3165.4E35904467j885652j883686j886845j886010j892686j910448j885474j837313
3181.7E20836353j883626j923501j850784j821935j876295j887858j886129j913369
3198E05792856j891196j817047j789153j807898j831800j849562j850843j835585j777082
3216.4D89342690j769633j830607j817227j768499j779288j768768j636177j503140
3232.7D75469351j577646j709103j634598j461297j392931j397610j382649j432627
3249D63480890j510173j465142j408935j473486j545012j514435j454592j390487j262456
$$ plain form
3130.7 565969706 564269364 562570751 560999274 559463024 557748616 555874050 554049075 552314997
3147 552314997 550616443 548958600 547240615 545351565 543392360 541483819 539635181 537787497 535904467
3165.4 535904467 534018815 532135129 530248284 528362274 526469588 524559140 522673666 520836353
3181.7 520836353 518952727 517029226 515178442 513356507 511480212 509592354 507706225 505792856
3198 505792856 503901660 502084613 500295460 498487562 496655762 494806200 492955357 491119772 489342690
3216.4 489342690 487573057 485742450 483925223 482156724 480377436 478608668 476972491 475469351
3232.7 475469351 473891705 472182602 470548004 469086707 467693776 466296166 464913517 463480890
3249 463480890 461970717 460505575 459096640 457623154 456078142 454563707 453109115 451718628 450456172
3267.4D50456172j107931j099050j209378j228929j159757j094699j085609j123190
3283.7D41347629j141489j100719j031160j019746j079589j169384j252860j235246
3300D32317436j056820q68857r10074j140475j291901j282871j233876j246511j286239
3318.4D21999812j302004j324683j377821j502782j623512j638382j615823j548886
3334.7D10065919j416415j362264j425773j452088j392812j254946j037240r88453
3351C99735928j169056j231372j068414r37849j006097j088023r61005q19892r63122
3369.3C90491098j236409j263976j047730q67933q04276q36670q64118p70420n77450
3387.7C82222116l83496m92126q42929q97169n85169l48031n66393r30161q60035n53757
$$ plain form
3267.4 450456172 449348241 448249191 447039813 445810884 444651127 443556428 442470819 441347629
3283.7 441347629 440206140 439105421 438074261 437054515 435974926 434805542 433552682 432317436
3300 432317436 431260616 430391759 429481685 428341210 427049309 425766438 424532562 423286051 421999812
3318.4 421999812 420697808 419373125 417995304 416492522 414869010 413230628 411614805 410065919
3334.7 410065919 408649504 407287240 405861467 404409379 403016567 401761621 400724381 399735928
3351 399735928 398566872 397335500 396267086 395329237 394323140 393235117 392274112 391454220 390491098
3369.3 390491098 389254689 387990713 386942983 386075050 385270774 384434104 383569986 382799566 382222116
3387.7 382222116 381838620 381346494 380503565 379606396 379021227 378673196 378106803 377176642 376316607 375762850
3408.1C75762850l74377l15577l48031l55750k60443k24352k24620o6310J42872K25067
3428.5C73961329J42843J38283K83748K06232m6522q3655J35064L31134L15159K99097
3448.9C75682712M46975N52624N82636O66946P48813O58691O25491R11802J123458
3467.2C82000148R03040N22823M84168P42912J040489J134246Q85398Q01146J041472
3485.6C89555842J090616J011997J119018J206547J208633J254231J330346J240521
3501.9C99017751J021385J072169J222014J277834J506061J620650J411974J331538
3518.2D09481376J487911J643360J598507J419812J387746J616001J903861J974613
3534.5D22513187J801431J708299J928926K085655J865626J607656J845241K082437
$$ plain form
3408.1 375762850 375388473 375072896 374724865 374369115 374108672 373884320 373659700 373593390 373736262 373961329
3428.5 373961329 374104172 374242455 374526203 374732435 374685913 374602258 374737322 375068456 375383615 375682712
3448.9 375682712 376129687 376682311 377264947 377931893 378680706 379339397 379964888 380876690 382000148
3467.2 382000148 382903188 383426011 383910179 384653091 385693580 386827826 387713224 388514370 389555842
3485.6 389555842 390646458 391658455 392777473 393984020 395192653 396446884 397777230 399017751
3501.9 399017751 400039136 401111305 402333319 403611153 405117214 406737864 408149838 409481376
3518.2 409481376 410969287 412612647 414211154 415630966 417018712 418634713 420538574 422513187
3534.5 422513187 424314618 426022917 427951843 430037498 431903124 433510780 435356021 437438458
3550.9D37438458J992643K126485K330989K318293K316862K351463J930266J511992
3567.2D54317451K304792L150970K969175K647370K666593K799749L002972L151118
3583.5D77010190K666474J847684K528429L558517L222585K874940L232241L309518
3599.8E00250578L263056L556431L325045K651751K786457L267527L498494L721238
3616.1E26320577L152847K899408L912926M469991L712535J824796K216935M338861
3632.4E52848876M378438L771960L566802L452241L623843L709853K746284J258910
3648.8E79357207K156734M462481M227221K932489L275633L487229K925456K946972
3665.1F05771422K707839J166463J291991K562046Q91685Q22485K924978K961874K504349
$$ plain form
3550.9 437438458 439431101 441557586 443888575 446206868 448523730 450875193 452805459 454317451
3567.2 454317451 456622243 459773213 462742388 465389758 468056351 470856100 473859072 477010190
3583.5 477010190 479676664 481524348 484052777 487611294 490833879 493708819 496941060 500250578
3599.8 500250578 503513634 507070065 510395110 513046861 515833318 519100845 522599339 526320577
3616.1 526320577 529473424 532372832 536285758 540755749 544468284 546293080 548510015 552848876
3632.4 552848876 557227314 560999274 564566076 568018317 571642160 575352013 578098297 579357207
3648.8 579357207 581513941 585976422 590203643 593136132 596411765 599898994 602824450 605771422
3665.1 605771422 608479261 609645724 610937715 613499761 614391446 615213931 618138909 621100783 623605132
3683.4F23605132K115190N40733j126945k861J750768J929581J602530J258672Q90731
3701.8F32563531J536966K332687J694501J20401p19845Q77618K189875J587272N91814
3720.1F42774820J42277Q3327K26617J011967J185835k6882j109302o25372J327276
3738.5F44990563K616048Q42631j938224L8445J447559q19743l13282K055168J820147
3756.9F50739312K80500K86996J066148N56171N7817j93358j41918Q24272J202047
3775.2F54677987M86791m37259j44840M40657J98245K50757M66347M90487L40998k62022
3795.6F56508148o6221j63138j372278O1691P74801l73960P07746J710951M15921j345276
3816F56858385m47095k57015j035452P42853J181543M81903K50936m3273J60694l98100
$$ plain form
3683.4 623605132 625720322 626261055 625134110 625131249 626882017 628811598 630414128 631672800 632563531
3701.8 632563531 634100497 636433184 638127685 638248086 637528241 638405859 640595734 642183006 642774820
3720.1 642774820 642917097 643000424 643227041 644239008 645424843 645397961 644288659 643663287 644990563
3738.5 644990563 647606611 648449242 646511018 646549463 647997022 647177279 646863997 648919165 650739312
3756.9 650739312 651019812 651306808 652372956 652929127 652986944 652793586 652651668 653475940 654677987
3775.2 654677987 655164778 654727519 654582679 655023336 655221581 655472338 655938685 656429172 656770170 656508148
3795.6 656508148 656441927 656278789 654906511 654968202 655743003 655369043 656076789 657787740 658203661 656858385
3816 656858385 656411290 656154275 655118823 655861676 657043219 657525122 657776058 657732785 657893479 657495379
3836.4F57495379j455187m70877O28233P04110J070499J448631N00977l073096l563464
3854.8F53285205J283169K562046J089692l67403n88059L01659l35872j038015J788
3873.1F56194210O51717J020551J22130o40631J80185l09587j49250N30184n62966
3891.5F57036543l33488J007318M97103q01802j146674r24110m3512J062930R48906
3909.8F57303214L18170O8307m01557p64727k47419K07483r2566j19865K42293o2942
3930.2F56450391m94778j14084L01779K00271j25587m68552k31027Q8274j80423j89841
3950.6F55236423J05739J17540K682m3094j28806j23858K9623L1531j03771j63377
3971F54960632j31845o4135k1040q2016j05322O676O1572j5855j04308j08361p9990
$$ plain form
3836.4 657495379 656040192 655569315 656197548 656901658 657972157 659420788 659921765 656848669 653285205
3854.8 653285205 654568374 657130420 658220112 657852709 657264650 657566309 657230437 656192422 656194210
3873.1 656194210 656845927 657866478 657988608 657347977 657528162 657218575 657069325 657599509 657036543
3891.5 657036543 656703055 657710373 658207476 657405674 656259000 655334890 655291378 656354308 657303214
3909.8 657303214 657621384 657689691 657288134 656523407 656275988 656483471 656390905 656271040 656513333 656450391
3930.2 656450391 655955613 655841529 656143308 656343579 656217992 655749440 655518413 655606687 655426264 655236423
3950.6 655236423 655342162 655459702 655462384 655419290 655290484 655166626 655196249 655227780 655124009 654960632
3971 654960632 654828787 654764652 654743612 654661596 654556274 654562950 654624522 654608667 654504359 654395998 654316008
3993.4F54316008q3387n5253
3997.5F54177368
$$ plain form
3993.4 654316008 654232621 654177368
3997.5 654177368
##END=$$ End of the data block
