##TITLE=T4PP $$ Begin of the data block
##JCAMP-DX=5.00 $$ ACD/SpecManager v 10.08
##SPECTROMETER/DATA SYSTEM=Alpha
##DATE=12 Mar 2014 10:59:36
##DATA TYPE=INFRARED SPECTRUM
##DATA CLASS=XYDATA
##ORIGIN=
##OWNER=
##NPOINTS=1765
##FIRSTX=399.75695801
##LASTX=3997.56933594
##MAXX=3997.56933594
##MINX=399.75695801
##MAXY=0.68774533
##MINY=0.01493354
##XFACTOR=1.0000000000
##YFACTOR=1.000000000000000e-9
##FIRSTY=0.19300608
##DELTAX=2.03957629
##XUNITS=1/CM
##YUNITS=ARBITRARY UNITS
##XYDATA=(X++(Y..Y))
399.8A93006083R328872R462387R726107R900003J0416091J0527864R667009Q991569
416.1B71025985J0597677J1763900R505093Q617669Q970649Q133709P506132Q000523
432.4C44121337P927447O820441O486445O978453O668716N920470O049335N973965
448.7C96946609M967660M649907N065113M905969M452855M683554M738122L710747
465D34120536L269881L999799L980756L180206L353238L975540L371716K575904L184408
483.4D65011984L606618K572804K153486L002346K890080J938343K187461K847343
499.7D86210465K415270J875013K249032K328039J540988J446426K136648J913071
516E02114952J158416J415908J914621J537263J239717J754761J952231J405239J192212
$$ plain form
399.8 193006083 202334955 211797342 221523449 231423452 241839543 252367407 262034416 271025985
416.1 271025985 281623662 293387562 302892655 311510324 320480973 328614682 336120814 344121337
432.4 344121337 352048784 358869225 365355670 372334123 379002839 384923309 390972644 396946609
448.7 396946609 401914269 406564176 411629289 416535258 420988113 425671667 430409789 434120536
465 434120536 437390417 441390216 445370972 448551178 451904416 455879956 459251672 461827576 465011984
483.4 465011984 468618602 471191406 473344892 476347238 479237318 481175661 483363122 486210465
499.7 486210465 488625735 490500748 492749780 495077819 496618807 498065233 500201881 502114952
516 502114952 503273368 504689276 506603897 508141160 509380877 511135638 513087869 514493108 515685320
534.4E15685320J614153J594186R85146R34660J285553R60648L64006M99785P94232
552.7E24717689K75611k65538J32084O59406N29826N79476J168728J101672L81947
571.1E29280901L98040P65443K95758j60277M92156J059711M55677J17481P58350P90417
591.5E34253657j788O8128O90698J5319j148701r93252o87837j456797j583815k31028
611.9E28924584N65946J35482M13954J498997J475811Q55744J120508J355469P22587
630.2E37069082P83623K015054K389133J545131J462221K024531J392305K59877L25918
648.6E49266875O24537j94609q16703l65257l04699r45508q28743k91944j129687j717031
669E43297231K87652J000762J86265m97580l76224l47317j056313j587093j623511
$$ plain form
534.4 515685320 517299473 518893659 519878805 520813465 522099018 523059666 523423672 523923457 524717689
552.7 524717689 524993300 524727762 524859846 525519252 526049078 526628554 527797282 528898954 529280901
571.1 529280901 529678941 530444384 530740142 530579865 531072021 532131732 532587409 532704890 533463240 534253657
591.5 534253657 534251869 534319997 535010695 535026014 533877313 532884061 532196224 530739427 529155612 528924584
611.9 528924584 529490530 529626012 530039966 531538963 533014774 533870518 534991026 536346495 537069082
630.2 537069082 537852705 539867759 542256892 543802023 545264244 547288775 548681080 548940957 549266875
648.6 549266875 549891412 549696803 548880100 548514843 548210144 547264636 546435893 546143949 545014262 543297231
669 543297231 543584883 544585645 544771910 544274330 543898106 543550789 542494476 540907383 539283872
687.3E39283872k326072l781557m944622o096006q051335r578526r922296j1262268
703.7D83321190j4121950j5888423j4827728j1389464p764876n931854m633427q91894
720D07871574N622059J3208568K0075411K4313062K5213361K3829580K0940899J6641915
736.3E57716429J2076736Q893311O702840M371882K658307K240420J812398P15315
752.6E97187638K39671O58750M31180m50015m31895O8247l43263r04381m09901P092
773E96053123o44564r17852j86920r2924q93712r16839k91287n90027j317084j012802
793.4E89189112n41746j118303j502156r10997q91149j785160j925110j434744j839101
811.7E77240646k620161k450466k146542k815843l372490l089726l256619m301429
$$ plain form
687.3 539283872 536957800 533176243 528231621 522135615 514084280 504505754 494583458 483321190
703.7 483321190 469199240 453310817 438483089 427093625 419328749 413396895 408763468 407871574
720 407871574 413493633 426702201 446777612 471090674 496304035 520133615 541074514 557716429
736.3 557716429 569793165 578686476 585389316 589761198 592419505 594659925 596472323 597187638
752.6 597187638 597427309 598086059 598517239 598067224 597635329 597703576 597360313 596455932 596046031 596053123
773 596053123 595408559 594490707 594303787 594210863 593317151 592400312 592109025 591518998 590201914 589189112
793.4 589189112 588647366 587529063 586026907 585115910 584224761 582439601 580514491 579079747 577240646
811.7 577240646 574620485 572170019 570023477 567207634 563835144 560745418 557488799 553187370
828.1E53187370m917025n027473n845249p104814p786453q695185j1219323j5376389
844.4D87215459j8260836j4477432o817877n768031j2180060j8878848k3500293k7925015
860.7C59407067l4211427m3822109n5769757o1317339m9077995k4565973m733205P389382
877I3298644J9423254L3799968M8138261O0657591O8619489O7020804N5467338M0836483
893.3D87261832K9180705K1147013J5680075J2193918R735525P503509N802453M850089
909.6E93355119L871143K593160J755297J411557P09474j85907m14014l12387o92428
928F02091014j118540r23336p47740j160741j414955j130044j197934j775921j909315
946.4E90712488j674891k003729k568185k529920k451419l031314l506720l349245
$$ plain form
828.1 553187370 548270345 543242872 537397623 530292809 522506356 513811171 502591848 487215459
844.4 487215459 468954623 454477191 447659314 441891283 429711223 410832375 387332082 359407067
860.7 359407067 325195640 281373531 225603774 164286435 115208440 90642467 85909262 93298644
877 93298644 112721898 146521866 194660127 255317718 323937207 390958011 446425349 487261832
893.3 487261832 516442537 537589550 553269625 565463543 575199068 582702577 588505030 593355119
909.6 593355119 597226262 599819422 601574719 602986276 603695750 603509843 603095829 602783442 602091014
928 602091014 600972474 600049138 599301398 598140657 596725702 595595658 594397724 592621803 590712488
946.4 590712488 589037597 587033868 584465683 581935763 579484344 576453030 572946310 569597065
962.7E69597065l450512m095138m329204m138172m531920n300402n552888n673886
979E32524943o302654o780744o481588o087899o093681n861938n169809m836589n000651
997.3D79909390m980266m897296n366355o077916o331533o329715o459892o319821
1013.7D33146596n596966m789233m161507l380000k485544j932829j639069j111120
1030D08050328n01453k89411m27872o76572j183540j978606k565175k634942k482713
1048.3C95310044k249479j602411n79655K63154O91742R39965Q98033K86192o26057
1066.7C93331528j450002k268017l172993l843189m053652m093319l956318k741665
1083C67752373n98639J211643K647549M065633M819125M254877K757758J289606L84331
$$ plain form
962.7 569597065 566146553 562051415 557722211 553584039 549052119 543751717 538198829 532524943
979 532524943 526222289 519441545 512959957 506872058 500778377 494916439 489746630 484910041 479909390
997.3 479909390 474929124 470031828 464665473 458587557 452256024 445926309 439466417 433146596
1013.7 433146596 427549630 422760397 418598890 415218890 412733346 410800517 409161448 408050328
1030 408050328 407548875 407259464 406831592 406155020 404971480 402992874 400427699 397792757 395310044
1048.3 395310044 393060565 391458154 390878499 391141653 391833395 392773360 393671393 393957585 393331528
1066.7 393331528 391881526 389613509 386440516 382597327 378543675 374450356 370494038 367752373
1083 367752373 367153734 368365377 371012926 375078559 379897684 384152561 386910319 388199925 388584256
1101.4C88584256l308L994L17633O78092P73102O03288L07292k02000q14348j139075
1121.8C89108926j183957j347273j620055j653313j584232j814336k195477k348125
1138.1C75362158k332241k302229k071172j532316j063436r20117q60244p29889o61463
1156.4C62889051o09904k98321K17259N80191O92666O91712N94616M15206M01586O42389
1176.8C66216451P68930N03152N0068m23193j030534j705051k174228k450437k726256
1195.2C57028902k899379k808839k620667k577812k597660k563864k656757k974987
1211.5C35328937l288448l454447l609389l770858l828615l812999l853321l900081
1227.8C05810779l829807l716051l689498l695697l627538l589660l652156l680229
$$ plain form
1101.4 388584256 388580948 388584942 388902575 389580667 390353769 390957057 391264349 391062349 390248001 389108926
1121.8 389108926 387924969 386577696 384957641 383304328 381720096 379905760 377710283 375362158
1138.1 375362158 373029917 370727688 368656516 367124200 366060764 365140647 364280403 363550514 362889051
1156.4 362889051 362279147 361980826 362198085 362778276 363470942 364162654 364757270 365172476 365574062 366216451
1176.8 366216451 366985381 367488533 367538601 367115408 366084874 364379823 362205595 359755158 357028902
1195.2 357028902 354129523 351320684 348700017 346122205 343524545 340960681 338303924 335328937
1211.5 335328937 332040489 328586042 324976653 321205795 317377180 313564181 309710860 305810779
1227.8 305810779 301980972 298264921 294575423 290879726 287252188 283662528 280010372 276330143
1244.1B76330143l598481l562182l639609l699332l679365l661454l705889l727928
1260.4B47055903l675163l643810l693745l712878l724828l806487l867879l853917
1276.8B17077196l866583l962130m023298m023791m061639m161254m213139m224718
1293.1A84540644m268855m322066m316971m285515m292979m296616m273594m196181
1309.4A50287867m126475m068449l954172l897712l928512l887862l841683l881276
1325.7A18701726l907852l863416l724873l572643l569558l800616l953181l730469
1342H8579118l481850l452420l473468l440686l365993l294505l211044l070172l023315
1360.4E8765665l086347k917614k625834k562289k472199k387799k390221k187833
$$ plain form
1244.1 276330143 272731662 269169480 265529871 261830539 258151174 254489720 250783831 247055903
1260.4 247055903 243380740 239736930 236043185 232330307 228605479 224798992 220931113 217077196
1276.8 217077196 213210613 209248483 205225185 201201394 197139755 192978501 188765362 184540644
1293.1 184540644 180271789 175949723 171632752 167347237 163054258 158757642 154484048 150287867
1309.4 150287867 146161392 142092943 138138771 134241059 130312547 126424685 122583002 118701726
1325.7 118701726 114793874 110930458 107205585 103632942 100063384 96262768 92309587 88579118
1342 88579118 85097268 81644848 78171380 74730694 71364701 68070196 64859152 61788980 58765665
1360.4 58765665 55679318 52761704 50135870 47573581 45101382 42713583 40323362 38135529
1376.7C8135529j993671j937457j843676j735261j722527j622303j409203j396218
1393B4475213j471668j352234j239395j122324r75972r01229p42419n80417m53897
1411.4A5635658l19698k16259j52137j4022J73990K77182L39762L71460M16249M52206
1431.8A6964391M22889L89854M53697M46681L59949K86888K50060K47300K40633K24728
1452.2B0287070J50484Q7194K18950L89898L58027L18806L70100L90740L51612M25395
1472.6B3348276O45458P45816P70672Q04163Q76541R09410R44551J070740J277800
1490.9C1393427J321897J303818J526051J737069J727853J515016J484428K074256
1507.2D4083815K355088K165105K086263K076186K139431K186086K417948K555013
$$ plain form
1376.7 38135529 36141858 34204401 32360725 30625464 28902937 27280634 25871431 24475213
1393 24475213 23003545 21651311 20411916 19289592 18313620 17412391 16669972 16089555 15635658
1411.4 15635658 15315960 15099701 14947564 14933542 15107532 15384714 15724476 16095936 16512185 16964391
1431.8 16964391 17387280 17777134 18230831 18677512 19037461 19324349 19574409 19821709 20062342 20287070
1452.2 20287070 20437554 20524748 20743698 21133596 21491623 21810429 22180529 22571269 22922881 23348276
1472.6 23348276 23993734 24739550 25510222 26314385 27190926 28100336 29044887 30115627 31393427
1490.9 31393427 32715324 34019142 35545193 37282262 39010115 40525131 42009559 44083815
1507.2 44083815 46438903 48604008 50690271 52766457 54905888 57091974 59509922 62064935
1523.6F2064935K432670K539806K473235K394319K624407K516672K233587K710648
1539.9H1990279L313065L240876L223076L190793L358059L534593L637239L600694
1556.2A09088674M556284O130024N087272M562243M728571M835293N103260M610375
1572.5A48701996M163444M571199M414275L906548L735781L583238L429889L285557
1588.8A79791927L117636K930865K802327K661705K491847K368241K316058K198041
1605.1B00678647K022475J921653J851783J642346J352414J413450J659542J556293
1621.4B14098603J406863J490220J557827J586736J579180J446620J499220J969502
1637.8B26634771K254113K266124K135277K153471K623618K629548K467856L224730
$$ plain form
1523.6 62064935 64497605 67037411 69510646 71904965 74529372 77046044 79279631 81990279
1539.9 81990279 85303344 88544220 91767296 94958089 98316148 101850741 105487980 109088674
1556.2 109088674 113644958 119774982 124862254 129424497 134153068 138988361 144091621 148701996
1572.5 148701996 152865440 157436639 161850914 165757462 169493243 173076481 176506370 179791927
1588.8 179791927 182909563 185840428 188642755 191304460 193796307 196164548 198480606 200678647
1605.1 200678647 202701122 204622775 206474558 208116904 209469318 210882768 212542310 214098603
1621.4 214098603 215505466 216995686 218553513 220140249 221719429 223166049 224665269 226634771
1637.8 226634771 228888884 231155008 233290285 235443756 238067374 240696922 243164778 246389508
1654.1B46389508L545121L235533L119052L307640L582240L367781L240198L644139
1670.4B73431212L733396L715813L941566L876418L591746L425300M082799M488617
1686.7C04286867M153580M098236L851176L812581M033774M113734M767090M687548
1703C37804586M200816M237026M126996L835916L437787L121078L372521L807068L616094
1721.4C71559888L345519L269017L071785K853215K616584K662569L113628L067285
1737.7C95559490K913385K958477K889901K719581K593339K629310K853274K869696
1754D17986453K688139K535761K366662K400428K509743K256632J889139J623660J485139
1772.4D37741756J507342J227618N37872k21044q45015j503438k021074k315283k968103
$$ plain form
1654.1 246389508 249934629 253170162 256289214 259596854 263179094 266546875 269787073 273431212
1670.4 273431212 277164608 280880421 284821987 288698405 292290151 295715451 299798250 304286867
1686.7 304286867 308440447 312538683 316389859 320202440 324236214 328349948 333117038 337804586
1703 337804586 342005402 346242428 350369424 354205340 357643127 360764205 364136726 367943794 371559888
1721.4 371559888 374905407 378174424 381246209 384099424 386716008 389378577 392492205 395559490
1737.7 395559490 398472875 401431352 404321253 407040834 409634173 412263483 415116757 417986453
1754 417986453 420674592 423210353 425577015 427977443 430487186 432743818 434632957 436256617 437741756
1772.4 437741756 439249098 440476716 441014588 440793544 439948529 438445091 436424017 434108734 431140631
1790.7D31140631l289192k371282j619816j352518o42360M68910J373589K092421K885014
1809.1D28685397L750324M425377M841953N129665N191744M959822M688024M546136
1825.4D66218442M151880L811568L866047L676206L203690K913594K739698K349466
1841.7D92930591K073765K380818K610654K374708K116502K041161K030730J926482
1858E10485411J857280J880348J796007J520694J407027J786828K005219J807094J658916
1876.4E26204824J650572J579523J511872J534403J480579J340091J402855J554132
1892.7E38258851J481056J420915J443803J426876J360476J316070J296580J259327
1909E49263954J270950J307547J257598J101256J117051J227319J280486J323581J224935
$$ plain form
1790.7 431140631 427851439 425480157 423860341 422507823 421865463 422334373 423707962 425800383 428685397
1809.1 428685397 432435721 436861098 441703051 446832716 452024460 456984282 461672306 466218442
1825.4 466218442 470370322 474181890 478047937 481724143 484927833 487841427 490581125 492930591
1841.7 492930591 495004356 497385174 499995828 502370536 504487038 506528199 508558929 510485411
1858 510485411 512342691 514223039 516019046 517539740 518946767 520733595 522738814 524545908 526204824
1876.4 526204824 527855396 529434919 530946791 532481194 533961773 535301864 536704719 538258851
1892.7 538258851 539739907 541160822 542604625 544031501 545391977 546708047 548004627 549263954
1909 549263954 550534904 551842451 553100049 554201305 555318356 556545675 557826161 559149742 560374677
1927.4E60374677J119375J134098J128674J067280J068831J034617R21786R81689J174509
1945.7E70005536J177192J024365R20892R29594R34780Q22067P70748Q52823Q71301
1964.1E78309298P98583R11414J112938J086056R75848R85503J009941R10580Q38339
1982.5E86938500Q96871R29654Q14259P25806Q37862R32038Q29578P73072Q53181Q32319
2002.8E95363140P31766P39575Q09431P55071O86110P44164P73966O95348O93559Q14855
2023.2F02806985P81715O12319O34312P91550P42912O17862O95706P71641O49631N88596
2043.6F09693229P44343P86006O15657N78523P28011P23600N99444O56843P63416O56903
2064F16545975N39243O61135P40707N99980N59748P10785P00533N40495N84960P36833
$$ plain form
1927.4 560374677 561494052 562628150 563756824 564824104 565892935 566927552 567849338 568831027 570005536
1945.7 570005536 571182728 572207093 573127985 574057579 574992359 575814426 576585174 577437997 578309298
1964.1 578309298 579107881 580019295 581132233 582218289 583194137 584179640 585189581 586100161 586938500
1982.5 586938500 587835371 588765025 589579284 590305090 591142952 592074990 592904568 593677640 594530821 595363140
2002.8 595363140 596094906 596834481 597643912 598398983 599085093 599829257 600603223 601298571 601992130 602806985
2023.2 602806985 603588700 604201019 604835331 605626881 606369793 606987655 607683361 608455002 609104633 609693229
2043.6 609693229 610437572 611223578 611839235 612417758 613145769 613869369 614468813 615125656 615889072 616545975
2064 616545975 617085218 617746353 618487060 619087040 619646788 620357573 621058106 621598601 622183561 622920394
2084.4F22920394O57201M85182N62369O82176N54382M50492N91934O35087M47095M05431
2104.8F28391743N56409N48065L83377M14312N41866M36544K96235M05371N05150L65018
2125.2F32844090K92659M56274N14149L41535L11732M73500M61161L09408L69429N29826
2145.6F36903763M50313L26753M43697N72085M96447M61638N94318O31034N13733N33342
2166F41927123O89805O76393N56648N91278O82652O13511N26726O15001P01546O27220
2186.4F48207903N61297O16491O22868N26667N16593O10531N75244M65512M87507N39005
2206.8F53729618M91798M30703M78089N28454M62771M10795M65751N00977M42803M10676
2227.2F58352435M80353M96865M04596M02749M93943M93527M11868M28975N03540M57048
$$ plain form
2084.4 622920394 623577595 624062777 624625146 625307322 625861704 626312196 626904130 627539217 627986312 628391743
2104.8 628391743 628948152 629496217 629879594 630293906 630835772 631272316 631568551 631973922 632479072 632844090
2125.2 632844090 633136749 633593023 634107172 634448707 634760439 635233939 635695100 636004508 636373937 636903763
2145.6 636903763 637354076 637680829 638124526 638696611 639193058 639654696 640249014 640880048 641393781 641927123
2166 641927123 642616928 643293321 643849969 644441247 645123899 645737410 646264136 646879137 647580683 648207903
2186.4 648207903 648769200 649385691 650008559 650535226 651051819 651662350 652237594 652703106 653190613 653729618
2206.8 653729618 654221416 654652119 655130208 655658662 656121433 656532228 656997979 657498956 657941759 658352435
2227.2 658352435 658832788 659329653 659734249 660136998 660630941 661124468 661536336 661965311 662468851 662925899
2247.6F62925899L63588L94047M71294M42385M15921M67718M77493M14252M02808M58956
2268F67234361M55141L97921M06146M67658M29511L41535L74794M24087L22103K31922
2288.4F71085179K75016K78592J92404J77383K71976K64764J08182L7432P5757K6823
2308.8F72793508n1141J1205Q5414m7922k61903k64525j03414K563J549m6611l9458
2331.2F72079265N6505J28866J32024O5982P7784L97027R58562J224398P07805k02655
2351.6F75625563q16405q94249o60658j88767L13401O17623Q63493J130759J252592
2370F77243352J225531J211286J223623J181245J103401J011134Q41975N74231L53396
2388.3F85969174K75373K22326J29938J17421J79052J67251J07765J04368J22428Q2731
$$ plain form
2247.6 662925899 663289487 663683534 664154828 664597213 665013134 665480852 665958345 666372597 666775405 667234361
2268 667234361 667689502 668087423 668493569 668961227 669390738 669732273 670107067 670531154 670853257 671085179
2288.4 671085179 671360195 671638787 671831191 672008574 672280550 672545314 672653496 672690928 672766685 672793508
2308.8 672793508 672742367 672753572 672838986 672791064 672529161 672264636 672161222 672163785 672165334 672118723 672079265
2331.2 672079265 672135770 672264636 672396660 672462642 672540426 672937453 673896015 675120413 675828218 675625563
2351.6 675625563 674809158 673914909 673254251 673065484 673378885 673996508 674860001 675990760 677243352
2370 677243352 678468883 679680169 680903792 682085037 683188438 684199572 685041547 685615778 685969174
2388.3 685969174 686244547 686466873 686596811 686714232 686893284 687060535 687168300 687272668 687395096 687477827
2408.7F87477827M3690O3718P6949M5419K1636J6094k9326q3387r2387r2089j25289
2431.2F87322855j55509j84953k51949l09825l43024l86715m32253m70221n59151o94871
2451.5F83534384p94947q74102j006544j164198j297534j454353j654267j844228k014815
2469.9F71429396k266884k590716k811551k946079l179371l473997l650845l747463
2486.2F46762490l861308l886640l725350l520667l358543l107310k772092k556980
2502.5F19973600k491713k380788k228081k221585k306163k248585k030015j801431
2518.9F02265239j511634j031160n42521j74523K93315Q69572J299619J608491J995206
2537.2F05071604K376199K553761K631903K811253K970040K906501K764106K717197
$$ plain form
2408.7 687477827 687521517 687585235 687662184 687707603 687729239 687745333 687716007 687632620 687540233 687448144 687322855
2431.2 687322855 687167346 686982393 686730444 686420619 686077595 685690880 685258627 684788406 684229255 683534384
2451.5 683534384 682739437 681865335 680858791 679694593 678397059 676942706 675288439 673444211 671429396
2469.9 671429396 669162512 666571796 663760245 660814166 657634795 654160798 650509953 646762490
2486.2 646762490 642901182 639014542 635289192 631768525 628409982 625302672 622530580 619973600
2502.5 619973600 617481887 615101099 612873018 610651433 608345270 606096685 604066670 602265239
2518.9 602265239 600753605 599722445 599179924 599005401 599298716 600168288 601467907 603076398 605071604
2537.2 605071604 607447803 610001564 612633467 615444720 618414760 621321261 624085367 626802564
2553.5F26802564K567887K201021J928508J857460J681864J375854J227736J187444
2569.8F40830338R74119P18176P04467P36058N56886M00067M58121M88460L30150K25425
2590.2F46422267L03745L17097K21372K74419M10557L57270K88308M69387O57081O32227
2610.6F50353730O27875Q09729R88364J001835J026750J189649J263440J195907J222074
2629F59679353J324952J290440J199723J255452J309932J196563J104951J153588J120031
2647.3F70634985R15825P75338P59899O57499M57764L53932L30567K26736Q4460Q0347
2667.7F75277352J19090J2875r5665n6804l0219j27852j69218j04368j19328k05994
2688.1F74499869k06768j51277j96516k93494k61306j71483k40207l44455k59220j72973
$$ plain form
2553.5 626802564 629370451 631571472 633499980 635357440 637039304 638415158 639642894 640830338
2569.8 640830338 641804457 642522633 643227100 643963158 644520044 644920111 645378232 645866692 646196842 646422267
2590.2 646422267 646726012 647043109 647264481 647538900 647949457 648306727 648595035 649064422 649721503 650353730
2610.6 650353730 650981605 651791334 652779698 653781533 654808283 655997932 657261372 658457279 659679353
2629 659679353 661004305 662294745 663494468 664749920 666059852 667256415 668361366 669514954 670634985
2647.3 670634985 671550810 672326148 673086047 673743546 674201310 674555242 674885809 675112545 675197005 675277352
2667.7 675277352 675396442 675409317 675313652 675256848 675226629 675098777 674929559 674825191 674705863 674499869
2688.1 674499869 674293101 674141824 673945308 673651814 673390508 673219025 672978818 672634363 672375143 672202170
2708.5F72202170k97845l97086l04043k55585l64184m09007l21984l26455m00722l38614
2728.9F68786645k47598l24726m41015l89635l12507l91364m55499l88622l85285m65810
2749.3F64984584m30823l24010l75986n37396n46336m58241m97698n93186n58495n20647
2769.7F60141766o64711p60078o06656n39661p15852p55608o51538p56562r52422r12965
2790.1F52825713p88748q66354j010060j002788r46522j015008j101553j094520j152754
2808.5F43847406j287699j293540j240909j349807j510322j529872j525283j631260
2824.8F32478714j760840j826585j885235k028942k220154k386034k519547k718986
2841.1F15132391l108441l613830l907144l571153k675652j844287j451194j355589
$$ plain form
2708.5 672202170 671904325 671507239 671203196 670947611 670583427 670174420 669852436 669525981 669125259 668786645
2728.9 668786645 668539047 668214321 667773306 667383671 667071164 666679800 666224301 665835679 665450394 664984584
2749.3 664984584 664553761 664229751 663853765 663316369 662770033 662311792 661814094 661220908 660662413 660141766
2769.7 660141766 659477055 658716977 658110321 657570660 656854808 656099200 655447662 654691100 653738678 652825713
2790.1 652825713 652036965 651170611 650160551 649157763 648211241 647196233 646094680 645000160 643847406
2808.5 643847406 642559707 641266167 640025258 638675451 637165129 635635257 634109974 632478714
2824.8 632478714 630717874 628891289 627006054 624977112 622756958 620370924 617851377 615132391
2841.1 615132391 612023950 608410120 604502976 600931823 598256171 596411884 594960690 593605101
2857.4E93605101j336038j394808j604438j855612k005756k076566k061367j851559
2873.7E79418957j539111j359403j310527j275182j243532j217007j165152j071930
2890.1E69237113r96113r84073r32693p84516o94573p35700q06511r03427j152337
2908.4E61247170j582027j992225k093077j798570j275182p31110l18885o0618J11341
2926.8E51506817K93076N58436P51496P66277P97510Q82805Q31723O96659O45220O07669
2947.2E58337688M27902J64449L4392J8537k0802k0384R9539K72692M17768N47112
2967.6E60278893O58154O81698O42300O16670N64754M78983M62234M83691L91126K43008
2987.9E65501511J55091J27316J70290K07603K53916L55065L77536L55601M19617M27544
$$ plain form
2857.4 593605101 592269063 590874255 589269817 587414205 585408449 583331883 581270516 579418957
2873.7 579418957 577879846 576520443 575209916 573934734 572691202 571474195 570309043 569237113
2890.1 569237113 568241000 567256927 566324234 565539718 564845145 564109445 563302934 562399507 561247170
2908.4 561247170 559665143 557672918 555579841 553781271 552506089 551774979 551456094 551395476 551506817
2926.8 551506817 551799893 552358329 553109825 553876102 554673612 555556417 556388140 557084799 557730019 558337688
2947.2 558337688 558765590 558930039 558964431 558982968 558962166 558941782 559041321 559314013 559731781 560278893
2967.6 560278893 560937047 561618745 562261045 562877715 563442469 563921452 564383686 564867377 565258503 565501511
2987.9 565501511 565656602 565783918 565954208 566161811 566415727 566770792 567148328 567503929 567923546 568351090
3008.3E68351090L01540K63393L67462M29392L74377K48730Q0347r1552k00451k54035
3028.7E69870293l19302m01556m31538m90546o63817p72596p22110o52969o95765q12292
3049.1E63907802q39829p98405q31782q84951q93950r02593r44436j013517r74357
3067.5E55823982q09372p60436r05037j069605j123905j034498r12309q90374q89778
3085.8E47428668r11653r84192r57251r12845j029432j148105j094281j009524j049936
3104.2E38331449j139045j146555j095354j140893j250684j262903j199842j120031
3120.5E28976142j067519j126408j265884j321137j261115j242995j325846j424968
3136.8E18940270j429379j361311j364946j407742j423061j528979j649379j550138
$$ plain form
3008.3 568351090 568652630 568916023 569283485 569712877 570087254 570335984 570416331 570324779 570124328 569870293
3028.7 569870293 569550991 569149435 568717897 568227351 567563534 566790938 566068828 565415859 564720094 563907802
3049.1 563907802 563067973 562269568 561437786 560552835 559658885 558756292 557811856 556798339 555823982
3067.5 555823982 555014610 554254174 553349137 552279532 551155627 550121129 549208820 548318446 547428668
3085.8 547428668 546517015 545532823 544575572 543662727 542633295 541485190 540390909 539381385 538331449
3104.2 538331449 537192404 536045849 534950495 533809602 532558918 531296015 530096173 528976142
3120.5 528976142 527908623 526782215 525516331 524195194 522934079 521691084 520365238 518940270
3136.8 518940270 517510891 516149580 514784634 513376892 511953831 510424852 508775473 507225335
3153.2E07225335j406074j481116j603782j590311j581461j670748j720190j685321
3169.5D94486332j670331j695782j706242j681835j672029j725763j782745j798630
3185.8D80752975j794666j760096j719921j724512j746982j743198j734823j758456
3202.1D66770321j784772j757264j716524j727283j760155j753956j718909j726567
3218.4D52824891j750887j721382j690388j713961j744211j772195j779884j719236
3234.7D38932747j678557j695871j691103j695484j726150j683206j628995j659870
3251.1D25473511j700789j695007j664221j656413j669049j671314j663983j625687
3267.4D12127048j565814j542926j547873j508325j433820j420319j456320j461864
$$ plain form
3153.2 507225335 505819261 504338145 502734363 501144052 499562591 497891843 496171653 494486332
3169.5 494486332 492816001 491120219 489413977 487732142 486060113 484334350 482551605 480752975
3185.8 480752975 478958309 477198213 475478292 473753780 472006798 470263600 468528777 466770321
3202.1 466770321 464985549 463228285 461511761 459784478 458024323 456270367 454551458 452824891
3218.4 452824891 451074004 449352622 447662234 445948273 444204062 442431867 440651983 438932747
3234.7 438932747 437254190 435558319 433867216 432171732 430445582 428762376 427133381 425473511
3251.1 425473511 423772722 422077715 420413494 418757081 417088032 415416718 413752735 412127048
3267.4 412127048 410561234 409018308 407470435 405962110 404528290 403107971 401651651 400189787
3283.7D00189787j444071j440466j438677j408011j379281j369685j351625j359492
3300C88998479j412124j443118j440704j447111j448542j462489j512259j557023j615107
3318.4C75660002j683891j719147j766711j840621j872272j862853j891822j952499
3334.7C61070186j969367j940191j921177j897723j842349j835049j871347j830816
3351C45962167j752883j784653j814544j720876j670152j736164j774490j698791j591474
3369.3C30418140j520545j462847j410454j328856j202106j129866j123518j074940
3385.7C20165008r51498q17746p33406p32034p71523p11739n52028m53413m76151m91411
3406.1C13474059m22925l20464k41965j95801j44244q5026m2021K1130J57386K92838
$$ plain form
3283.7 400189787 398745716 397305250 395866573 394458562 393079281 391709596 390357971 388998479
3300 388998479 387586355 386143237 384702533 383255422 381806880 380344391 378832132 377275109 375660002
3318.4 375660002 373976111 372256964 370490253 368649632 366777360 364914507 363022685 361070186
3334.7 361070186 359100819 357160628 355239451 353341728 351499379 349664330 347792983 345962167
3351 345962167 344209284 342424631 340610087 338889211 337219059 335482895 333708405 332009614 330418140
3369.3 330418140 328897595 327434748 326024294 324695438 323493332 322363466 321239948 320165008
3385.7 320165008 319213510 318395764 317662358 316930324 316158801 315447062 314895034 314441621 313965470 313474059
3406.1 313474059 313051134 312730670 312488705 312292904 312148660 312063634 312021613 312042743 312200129 312492967
3426.5C12492967L66866M14193N49674O96897O86765O84619P98434Q88914R37253J026392
3446.8C19542974J130045J227796J307338J371235J458466J533568J518637J518696
3463.2C30608755J618445J689285J707971J701445J706213J774251J907706J978636
3479.5C44692707J916945J880765J956046K054721K134263K171338K115428K102405
3495.8C61024618K184659K253026K264619K284050K348363K390117K395421K483875
3512.1C79628748K613753K610832K579332K602845K645642K679199K728462K829104
3528.4D00917917K942503K982169K962590K988368L055781L125608L134072L118127
3544.7D25227135L169656L275454L317803L375262L466279L471851L504664L572613
$$ plain form
3426.5 312492967 312859833 313274026 313823700 314520597 315207362 315891981 316690415 317579329 318516582 319542974
3446.8 319542974 320673019 321900815 323208153 324579388 326037854 327571422 329090059 330608755
3463.2 330608755 332227200 333916485 335624456 337325901 339032114 340806365 342714071 344692707
3479.5 344692707 346609652 348490417 350446463 352501184 354635447 356806785 358922213 361024618
3495.8 361024618 363209277 365462303 367726922 370010972 372359335 374749452 377144873 379628748
3512.1 379628748 382242501 384853333 387432665 390035510 392681152 395360351 398088813 400917917
3528.4 400917917 403860420 406842589 409805179 412793547 415849328 418974936 422109008 425227135
3544.7 425227135 428396791 431672245 434990048 438365310 441831589 445303440 448808104 452380717
3561.1D52380717L522217L439933L697336M155159M274785M126192M065096M139572
3577.4D83801007M235834M294396M232823M165858M337848M641175M651844M566610
3593.7E18927395M572332M617334M701078M752099M631758M413724M433036M561960
3610E55610716M558862M542887M458904M376650M506707M489482M151880L767491L751874
3628.4E94215453M188716M271209M053831L807307L608286L452182L207505K867400
3644.7F23671889K532900K530455L017485L268838K962292K578318K477348K428948
3661F45468473K199471J863480J446724J100540J185954J349211J152813J292646J721084
3679.4F58780396J704335J428366J142800Q31783O51300R88900J392424J366318J076936
$$ plain form
3561.1 452380717 455902934 459342867 463040203 467195362 471470147 475596339 479661435 483801007
3577.4 483801007 488036841 492331237 496564060 500729918 505067766 509708941 514360785 518927395
3593.7 518927395 523499727 528117061 532818139 537570238 542201996 546615720 551048756 555610716
3610 555610716 560169578 564712465 569171369 573548019 578054726 582544208 586696088 590463579 594215453
3628.4 594215453 598404169 602675378 606729209 610536516 614144802 617596984 620804489 623671889
3644.7 623671889 626204789 628735244 631752729 635021567 637983859 640562177 643039525 645468473
3661 645468473 647667944 649531424 650978148 652078688 653264642 654613853 655766666 657059312 658780396
3679.4 658780396 660484731 661913097 663055897 663887680 664538980 665527880 666920304 668286622 669363558
3697.7F69363558P20322N09620O32227P51316N36025K36213K32994O30200Q39413N52713
3718.1F75004601J87397R1494J23322J31964K83957L01480q5711l23594J11997O68347
3738.5F76495254P32243K32518l68178J6451M46856J30117K10702P01487P05183L64840
3758.9F79667473K38836L07440J39296m589Q2374K09450L22223K59697P8321n0902
3779.3F81249619o795P4803O5387J29878J79172J07050o7830l26276l42012j96814
3799.7F80866182k46465N6922K77162Q9585K23995K82407o3003m27007l42906k54452
3820.1F80462420j81973L88682N05507J63674n6147j84357k07663l25918m06742j2696
3840.5F80144787L31402L39567K85209J18851l19183r76801p12633M44711O55651K04920
$$ plain form
3697.7 669363558 670083880 670593500 671225727 671977043 672513068 672749281 672982275 673612475 674451888 675004601
3718.1 675004601 675191998 675283492 675406814 675538778 675822735 676124215 676038504 675714910 675826907 676495254
3738.5 676495254 677227497 677460015 677091837 677108288 677555144 677685261 677895963 678597450 679302633 679667473
3758.9 679667473 679906309 680213749 680353045 680348456 680430830 680640280 680962503 681222200 681300521 681249619
3779.3 681249619 681242824 681317627 681383014 681512892 681692064 681799114 681731284 681405008 681062996 680866182
3799.7 680866182 680619717 680676639 680953801 681043386 681267381 681549788 681486785 681059778 680716872 680462420
3820.1 680462420 680280447 680669129 681174636 681338310 681282163 681097806 680890143 680564225 680157483 680144787
3840.5 680144787 680476189 680815756 681100965 681219816 680900633 679923832 679211199 679655910 680311561 680516481
3860.9F80516481j61051j84715m7028j65343k48909N9664K96354K87414r2864l60787
3881.3F79899216o6161m5360j30653k8312j40250j6212K22683o0559n25057n37813
3901.7F78571522j68919K26855M33683L43681J07407j13547l01599l17991j44541n7995
3922.1F78578556j08421n9903J0192j26004k09629m2796P8141P510j36554k09510j06514
3944.5F77675068l6358j05620o7353J3649k4020n7817l8266m4107m1247j0133k5630
3966.9F77238166n0544n2154p1347p2420j8000K2292J3053k6345q7977r6798k9683
3989.4F76768243j371n1200p1406J907
3997.5F76646173
$$ plain form
3860.9 680516481 680355430 680170715 680123687 679958344 679709435 679769099 680065453 680352867 680260003 679899216
3881.3 679899216 679833055 679787695 679657042 679628730 679488480 679472268 679694951 679634392 679109335 678571522
3901.7 678571522 678402603 678629458 679063141 679406822 679514229 679400682 679099083 678781092 678636551 678578556
3922.1 678578556 678470135 678410232 678420424 678294420 678084791 678041995 678120136 678127646 677991092 677781582 677675068
3944.5 677675068 677638710 677533090 677465737 677479386 677455366 677397549 677359283 677315176 677273929 677263796 677238166
3966.9 677238166 677187622 677135468 677064121 676991701 676973701 676995993 677009046 676982701 676894724 676797926 676768243
3989.4 676768243 676766872 676715672 676644266 676646173
3997.5 676646173
##END=$$ End of the data block
