##TITLE=T4PF $$ Begin of the data block
##JCAMP-DX=5.00 $$ ACD/SpecManager v 10.08
##SPECTROMETER/DATA SYSTEM=Alpha
##DATE=11 Mar 2014 10:52:32
##DATA TYPE=INFRARED SPECTRUM
##DATA CLASS=XYDATA
##ORIGIN=
##OWNER=
##NPOINTS=1765
##FIRSTX=399.75695801
##LASTX=3997.56933594
##MAXX=3997.56933594
##MINX=399.75695801
##MAXY=0.79507470
##MINY=0.25107291
##XFACTOR=1.0000000000
##YFACTOR=1.000000000000000e-9
##FIRSTY=0.53106779
##DELTAX=2.03957629
##XUNITS=1/CM
##YUNITS=ARBITRARY UNITS
##XYDATA=(X++(Y..Y))
399.8E31067789O105959N176425M695117M478813M249930M315317M477083L686667
$$ 531067789 537173748 542350173 547045290 551524103 555774033 560089350 564566433 568253100
416.1E68253100K980649L699661L801882L076911K800524K675116K267301J885772
$$ 568253100 571233749 574933410 578735292 581812203 584612727 587287843 589555144 591440916
432.4E91440916J747906J784206K173304K474427K112091J717329J981437J842499
$$ 591440916 593188822 594973028 597146332 599620759 601732850 603450179 605431616 607274115
448.7F07274115J233637J302123J379133J019239J130879J390159R07958N05209Q01861
$$ 607274115 608507752 609809875 611189008 612208247 613339126 614729285 615637243 616142452 616944313
467.1F16944313P86006M95494P93338Q45492N35249R66251J369000Q42511N15342Q62479
$$ 616944313 617730319 618225813 619019151 619864643 620399892 621366143 622735143 623577654 624092996 624955475
487.5F24955475Q44658O72817Q95917P76887N01573Q11220R02474M04119K90692L12865
$$ 624955475 625800133 626472950 627368867 628145754 628647327 629458547 630361021 630765140 631055832 631368697
507.9F31368697j07289k56836m3452l13401o22451k33949l1888k25067O1452N02467
$$ 631368697 631261408 631004572 630961120 630647719 630025268 629791319 629759431 629534364 629595816 630098283
528.3F30098283M80593O26325Q85368O09695L46303M37081K89858j04428j74403q7321
$$ 630098283 630578876 631205201 632090569 632700264 633046567 633483648 633773506 633669078 633494675 633407354
548.6F33407354l14653n01930m56870n58972n57482k68341k03788k98560k52425k41518
$$ 633407354 633092701 632590771 632133901 631574929 631017447 630749106 630545318 630246758 629994333 629752815
569F29752815l66271m21524l28898k64526j67846J61767M30524M58002O17206O80685
$$ 629752815 629386544 628965020 628636122 628371596 628203750 628365517 628796041 629254043 629871249 630551934
589.4F30551934M28796L39747M49538K85327N6446K06470J98126j11878k1279K29240
$$ 630551934 630980730 631320477 631770015 632055342 632111788 632318258 632516384 632404506 632383227 632612467
609.8F32612467R9182K52306P64609R08255J153052J801372J937926J573443J628339
$$ 632612467 632711649 632963955 633728564 634636819 635789871 637591243 639529169 641102612 642730951
628.2F42730951J721919J511156J710177K049029J773000J526236J683593J394868
$$ 642730951 644452870 645964026 647674203 649723232 651496232 653022468 654706061 656100929
644.5F56100929Q99672R92835R50694L83913K93255M65513O8903j39475J65701O6638
$$ 656100929 657000601 657993436 658944130 659328043 659621298 660086811 660155714 660016239 660181940 660248578
664.9F60248578k50042M27783J034438Q50022J067221J288593R24051P54535Q80778
$$ 660248578 659998536 660426319 661460757 662310779 663378000 664666593 665590644 666345179 667225957
683.3F67225957M49777p7248j42038m84407j226187j694440k283216k966166k986848
$$ 667225957 667675734 667598486 667456448 666972041 665745854 664051414 661768198 658802032 655815184
701.6F55815184l218949m489481n607903n595207m540503k434791n0485J461685K867758
$$ 655815184 652596235 648106754 642498851 636903644 632363141 629928350 629877865 631339550 634207308
720F34207308N330384P913947R237886R426593Q871437P332861N411029M143119L144025
$$ 634207308 639537692 647451639 656689525 666116118 674987555 682320416 687731445 691874564 695018589
738.3F95018589K051592J552880J470924R72628N35369O08981M88877J88053K75731
$$ 695018589 697070181 698623061 700093985 701066613 701601982 702210963 702699840 702887893 703163624
756.7G03163624L32713M4942J16408M85241M55976M60446Q33630Q58188O11603Q23796
$$ 703163624 703496337 703541279 703657687 704142928 704598904 705059350 705892980 706751168 707362771 708186567
777.1G08186567J009285P23362O88017Q69929N73993K78831M39703L93331N4658J23739
$$ 708186567 709195852 709919214 710607231 711477160 712051153 712329984 712769687 713163018 713217676 713341415
797.5G13341415K67148q5592k72453j36793l98755o74963m19795l91901o81877n27799
$$ 713341415 713608563 713522971 713250518 713113725 712714970 712040007 711620212 711228311 710546434 710018635
817.9G10018635l61145o65128p63357o23226r30011j285493j319409j631796k134860
$$ 710018635 709657490 708992362 708229005 707605779 706675768 705390275 704070866 702439070 700304210
836.2G00304210k223849k536774l630042m920304n758643m785836k676785k935707
$$ 700304210 698080361 695543587 691913545 686993241 681234598 676448762 673771977 670836270
852.5F70836270n374491o722927o919504q413911j2346804j9077122l0411124m3618202
$$ 670836270 665461779 658738852 651819348 643405437 631058633 611981511 581570387 537952185
868.9E37952185m6284288l2516987j2409329P071853K7016550M2451650M6823621M2906165
$$ 537952185 491667897 459150910 446741581 453813434 480829984 523281634 570105255 613011420
885.2F13011420L5821438K6753127J7675460J1230170P279575M814029L562689K767861
$$ 613011420 648832858 675585985 693261445 704491615 711771190 716585219 720147908 722915769
901.5G22915769J897394J453162J416206J136899P73311O26266K26259m09127p22467
$$ 722915769 724813163 726266325 727682531 728819430 729592741 730219007 730445266 730036139 729313672
919.8G29313672r54569j384258j459539j245856j325250j297831r12071p97212q95619
$$ 729313672 728359103 726974845 725515306 724269450 722944200 721646369 720734298 719937086 719041467
938.2G19041467o90699o07729r62496j195907j331210j836181k286613k405405k747655
$$ 719041467 718350768 717743039 716780543 715584636 714253426 712417245 710130632 707725227 704977572
956.6G04977572l222823l321111l436506l785968l830791l766715m055440m286409
$$ 704977572 701754749 698433638 694997132 691211164 687380373 683613658 679558218 675271809
972.9F75271809m297018m612684n094290n222023n237102n313098n090714m677892
$$ 675271809 670974791 666362107 661267817 656045794 650808692 645495594 640404880 635726988
989.2F35726988m439413m149616l710747l489434l449917l354371l480673l955841
$$ 635726988 631287575 627137959 623427212 619937778 616487861 613133490 609652817 605696976
1005.5F05696976m385590m708290n052686n120456m769803m337668l822088l075063
$$ 605696976 601311386 596603096 591550410 586429954 581660151 577322483 573500395 570425332
1021.8E70425332k375424j823128j193106n60760j44542K09809N06043M35949N3465
$$ 570425332 568049908 566226780 565033674 564472914 564328372 564538181 565044224 565480173 565533638
1040.2E65533638l98397r28522j403391j500905j240909q41975k61307M76718J058996
$$ 565533638 565135241 564206719 562803328 561302423 560061514 559219539 558958232 559434950 560493946
1058.5E60493946J481056J853884J914262J429558N36263n23090j469255j902818j716257
$$ 560493946 561975002 563828886 565743148 567172706 567708969 567185879 565716624 563813806 562097549
1076.9E62097549j215517m74155P92265K165258K988636L533066L981292L934383L352762
$$ 562097549 560882032 560407877 561200142 563365400 566354036 569887102 573868394 577802777 581155539
1095.2E81155539K596139J869321J284004R78291Q80360Q30233Q86679J076043J270294
$$ 581155539 583751678 585620999 586905003 587883294 588763654 589593887 590480566 591556609 592826903
1113.6E92826903J394272J368701J175463R71735Q86977Q56578P76231O39856L72529
$$ 592826903 594221175 595589876 596765339 597737074 598624051 599480629 600256860 600896716 601269245
1132F01269245j23262o82056j142621j525879j749516j706421j486123j248598j054287
$$ 601269245 601145983 600463927 599321306 597795427 596045911 594339490 592853367 591604769 590550482
1150.3E90550482r00507p80701o12855k52307L15845J023114J842976K630770L155768
$$ 590550482 589649975 588869274 588256419 588004112 588319957 589343071 591186047 593816817 596972585
1168.7E96972585L411531L562212L634632L535747L219486K685785J964271J167297
$$ 596972585 600384116 603946328 607580960 611116707 614336193 617021978 618986249 620153546
1185F20153546L81947m24564j177669j757383k228439k579093k694368k619684k448201
$$ 620153546 620535493 620110929 618933260 617175877 614947438 612368345 609673977 607054293 604606092
1203.3F04606092k145827j775503j526833j408100j364529j488209j704871j765132
$$ 604606092 602460265 600684762 599157929 597749829 596385300 594897091 593192220 591427088
1219.7E91427088j761079j852512j913011j889468j911461j951516j878857j765490
$$ 591427088 589666009 587813497 585900486 584011018 582099557 580148041 578269184 576503694
1236E76503694j702011j635789j539708j433849j249909j100243j115918j172304j176596
$$ 576503694 574801683 573165894 571626186 570192337 568942428 567842185 566726267 565553963 564377367
1254.3E64377367j212000j272261j207531j105845j056194j009763r79185j032471
$$ 564377367 563165367 561893106 560685575 559579730 558523536 557513773 556534588 555502117
1270.6E55502117j092017j112103j203955j314997j302481j208127j182019j182795
$$ 555502117 554410100 553297997 552094042 550779045 549476564 548268437 547086418 545903623
1287E45903623j213491j299083j419664j557648j737952j944542k094149k249241k442003
$$ 545903623 544690132 543391049 541971385 540413737 538675785 536731243 534637094 532387853 529945850
1305.3E29945850k630591k753258k908647l058553l097653l079057l023922k925933
$$ 529945850 527315259 524562001 521653354 518594801 515497148 512418091 509394169 506468236
1321.6E06468236k897560k996147l131479l357887l574222l697545l816992m047215
$$ 506468236 503570676 500574529 497443050 494085163 490510941 486813396 482996404 478949189
1338D78949189m137635l920466l837615m048467m332870m543602m752398m953235n055309
$$ 478949189 474811554 470891088 467053473 463005006 458672136 454128534 449376136 444422901 439367592
1356.3D39367592n050689n236506n565316n451411n214512n385131n480110n596608
$$ 439367592 434316903 429080397 423515081 418063670 412849158 407464027 401983917 396387309
1372.6C96387309n864859n637765n472094n708962n815089n698055n837470n989343
$$ 396387309 390522450 384884685 379412591 373703629 367888540 362190485 356353015 350363672
1388.9C50363672n871117o506861p569074p788450p858246p732153p442773p624447
$$ 350363672 344492555 337985694 330416620 322628170 314769924 307037771 299594998 291970551
1405.3B91970551p206559o499052o120265n612969m896045m353642l596396j979261
$$ 291970551 284763992 278264940 272144675 266531706 261635661 257282019 253685623 251706362
1421.6B51706362o33449K44797Q89688J396716J777321J846314J932889K124727J816421
$$ 251706362 251072913 251317710 252207398 253604114 255381435 257227749 259160638 261285365 263101786
1439.9B63101786J444996J203269J009643R45568R17434Q07286O10888P19428J415968
$$ 263101786 264546782 265750051 266759694 267705262 268622696 269429982 270040870 270760298 272176266
1458.3B72176266J695215J468540J542896J839637J871497J942724K583831L147006
$$ 272176266 273871481 275340021 276882917 278722554 280594051 282536775 285120606 288267612
1474.6B88267612L072054K956450K981960L088087L054619L184170L750711M345984
$$ 288267612 291339666 294296116 297278076 300366163 303420782 306604952 310355663 314701647
1490.9C14701647M133194M052431M882425N423337N109787M393518M619986O544113
$$ 314701647 318834841 322887272 327769697 333193034 338302821 342696339 347316325 353860438
1507.2C53860438O419450N234897M991412N053282N319089N387664N947113N966097
$$ 353860438 360279888 365514785 370506197 375559479 380878568 386266232 392213345 398179442
1523.6C98179442N263179N295813M857660M499495M986018M504948L605038M754007
$$ 398179442 403442621 408738434 413596094 418095589 423081607 427586555 431191593 435945600
1539.9D35945600N991251N388379N054325M871189N029112N092919M998595M636019
$$ 435945600 441936851 447325230 452379555 457250744 462279856 467372775 472371370 477007389
1556.2D77007389N707771P616281N578935M294306M216671M160762M262328L473997
$$ 477007389 482715160 490331441 495910376 500204682 504421353 508582115 512844443 516318440
1572.5E16318440K769113L142357K936900K293467J995504J664698J241863R19402
$$ 516318440 519087553 522229910 525166810 527460277 529455781 531120479 532362342 533281744
1588.8E33281744N66899J78516r3758l45468o75619j007497j259208j590550j884639
$$ 533281744 533848643 534027159 533933401 533587933 532912314 531904817 530645609 529055059 527170420
1607.2E27170420k096474k320767k608478l063619l183544k380967k129972k453923
$$ 527170420 525073946 522753179 520144701 517081082 513897538 511516571 509386599 506932676
1623.5E06932676k316892k029121j668275j324355j306951r79215P7545O33240Q07703
$$ 506932676 504615784 502586663 500918388 499594033 498287082 497307867 497385412 498018652 498826355
1641.8D98826355R50843J465678K350628K098799K201796L972232L837645K991319
$$ 498826355 499777198 501242876 503593504 505692303 507894099 511866331 515703976 518695295
1658.2E18695295L041744L656089M097462L543258L530562M356682M132032M073680
$$ 518695295 521737039 525393128 529490590 533033848 536564410 540921092 545053124 549126804
1674.5E49126804M622877M219174L511906L709614N419254N446851M410327M510462
$$ 549126804 553749681 557968855 561480761 565190375 570609629 576056480 580466807 584977269
1690.8E84977269M172087M298866M900098N063354O071032N374372M484415M650712
$$ 584977269 589149356 593448222 598348320 603411674 609482706 614857078 619341493 623992205
1707.1F23992205M115045L431678K897441K563119L066838L387272K628267K161622
$$ 623992205 628107250 631538928 634436369 636999488 640066326 643453598 646081865 648243487
1723.4F48243487K152622J914322J607895J401961J835048K382278J982332J967668
$$ 648243487 650396109 652310431 653918326 655320287 657155335 659537613 661519945 663487613
1739.7F63487613K263606K318501K412558K517283K895176L347934K952337K491593
$$ 663487613 665751219 668069720 670482278 672999561 675894737 679242671 682195008 684686601
1756.1F84686601K419830K234220K179325K016484J658976J406193J219452J441478
$$ 684686601 687106431 689340651 691519976 693536460 695195436 696601629 697821081 699262559
1772.4F99262559J619876J126647O36875M22180J76311j74642m18901p07984j077593
$$ 699262559 700882435 702009082 702645957 703068137 703244448 703069806 702650905 701942921 700865328
1790.7G00865328r16421m59313m15922k98798K94984Q90374J180589J456559J765310
$$ 700865328 699948907 699489594 699073672 698774874 699069858 699960232 701140821 702597380 704362690
1809.1G04362690K091289K361894K384007K256751K181112K032459J781941J671850
$$ 704362690 706453979 708815873 711199880 713456631 715637743 717670202 719452143 721123993
1825.4G21123993J537383J470804J583934J481116J250565J110017R70781P74682P99596
$$ 721123993 722661376 724132180 725716114 727197230 728447795 729557812 730528593 731303275 732102871
1843.8G32102871J090765J142025R94325Q62300Q11338Q07822P35522P21454P39753
$$ 732102871 733193636 734335661 735329986 736192286 737003624 737811446 738546968 739268422 740008175
1862.1G40008175N84185L59536N03540R13977R19164P24673O49273N99206N71549N82874
$$ 740008175 740592360 740951896 741455436 742369413 743288577 744013250 744662523 745261729 745833278 746416152
1882.5G46416152N38587M38333M56690N80132N59748N30123N99385N47349M78029M83156
$$ 746416152 746954739 747393072 747849762 748429894 748989642 749519765 750119150 750666499 751144528 751627684
1902.9G51627684M53770M04298M39882M99249M20332K79069K96950M34995M10914M15445
$$ 751627684 752081454 752485752 752925634 753424883 753845215 754124284 754421234 754856229 755267143 755682588
1923.3G55682588M98592M21048L36826L35335L15368L13104L31819K28941J53840K91645
$$ 755682588 756181180 756602228 756939054 757274389 757589757 757902861 758234680 758463621 758617461 758909106
1943.7G58909106L87371L28541K94685K67863J89901J64807K09331K23815J85967J68860
$$ 758909106 759296477 759625018 759919703 760187566 760377467 760542274 760751605 760975420 761161387 761330247
1964.1G61330247J90556K50459K94864K78473K39730K24471K44260K34067J97232J82092
$$ 761330247 761520803 761771262 762066126 762344599 762584329 762808800 763053060 763287127 763484359 763666451
1984.5G63666451J71721J22964J05560J82331K22444J98365J98721J65999J08004J16885
$$ 763666451 763838172 763961136 764066696 764249027 764471471 764669836 764868557 765034556 765142560 765259445
2004.9G65259445J28329J02162J06931J38342R9838N8055J00612J19984J02163J14560
$$ 765259445 765387774 765489936 765596867 765735209 765835047 765893102 765993714 766113698 766215861 766330421
2025.3G66330421J28329J04308J10686J48952J26779P1108Q0705J43528J76549J77562
$$ 766330421 766458750 766563058 766673744 766822696 766949475 767020583 767101288 767244816 767421365 767598927
2045.7G67598927J66357J51455J55866J77622J69635J55031J73867J73450J56224J91569
$$ 767598927 767765284 767916739 768072605 768250227 768419862 768574893 768748760 768922210 769078434 769270003
2066.1G69270003K31385J89066J60277K17438K52843K17080K01046K17259K14160K11596
$$ 769270003 769501388 769690454 769850731 770068169 770321012 770538092 770739138 770956397 771170557 771382153
2086.5G71382153K14696K09153K08795K19226J88231J41442J56522J90973J80602J57356
$$ 771382153 771596849 771806002 772014797 772234023 772422254 772563696 772720218 772911191 773091793 773249149
2106.9G73249149J60456J48177J28448J43051J35184J02102J25945J51813J06156P8142
$$ 773249149 773409605 773557782 773686230 773829281 773964465 774066567 774192512 774344325 774450481 774528623
2127.3G74528623J18374J46747J26779J17302J23322J30713J56820J82569J73867J60455
$$ 774528623 774646997 774793744 774920523 775037825 775161147 775291860 775448680 775631249 775805116 775965571
2147.7G75965571J85073K13981K17616K33352K60115K38776K27571K77280K92421K65181
$$ 775965571 776150644 776364625 776582241 776815593 777075708 777314484 777542055 777819335 778111756 778376937
2168G78376937K89321L24666K91944K78294L01063K80321K75731L19779K98917K30908
$$ 778376937 778666258 778990924 779282868 779561162 779862225 780142546 780418277 780738056 781036973 781267881
2188.4G81267881K30551K56837K50399K42233K38955K23756K15769J94668J47283J47224
$$ 781267881 781498432 781755269 782005668 782247901 782486856 782710612 782926381 783121049 783268332 783415556
2208.8G83415556J93655J92225J59979J55509J46985J20222J09733J37507J54973J31368
$$ 783415556 783609211 783801436 783961415 784116924 784263909 784384131 784493864 784631371 784786344 784917712
2229.2G84917712J24097J41621J37746J40131J55806J29461J14024J36852J29640J18435
$$ 784917712 785041809 785183430 785321176 785461307 785617113 785746574 785860598 785997450 786127090 786245525
2249.6G86245525J51038J54734J00374Q7976J21236J37031J53065J73211J45018J09613
$$ 786245525 786396563 786551297 786651671 786739647 786860883 786997914 787150979 787324190 787469208 787578821
2270G87578821J32859J61648J42991J06573J13070J35184J08421P5459J03653J34825
$$ 787578821 787711680 787873328 788016319 788122892 788235962 788371146 788479567 788555026 788658679 788793504
2290.4G88793504J04726O9737O9082P6830P1645N0068J8716p689j2875J7285N9486
$$ 788793504 788898230 788967967 789037049 789113879 789185524 789235592 789254308 789246619 789233744 789251029 789310515
2312.9G89310515M6432k1100o1989l8624M2498R6262K5034l1173N3405J05441J5438
$$ 789310515 789356947 789335847 789273858 789235234 789277732 789373994 789399028 789367855 789421260 789526701 789542139
2335.3G89542139m1604L1828J47820L17752N07474L35098j05381l65675l48568j89900
$$ 789542139 789500535 789532363 789680183 789997935 790505409 790840507 790735126 790369451 790020883 789830983
2355.7G89830983l994J43588K32100K74658L53694M41969M82619M97996M96030M79341
$$ 789830983 789826989 789970577 790202677 790477335 790831029 791272998 791755617 792253613 792749643 793228984
2376.1G93228984M08113L08752K61605K41279J79530J09732Q1181O3539K6643J2994
$$ 793228984 793637097 793945849 794207454 794448733 794628263 794737995 794819176 794882715 794909358 794922352
2396.5G94922352L6061L5584P450Q345L4869K7775K265k5332n7459l8385j2457m3154
$$ 794922352 794958413 794993997 795001447 795009792 795044661 795072436 795074701 795049369 794991910 794953525 794941068 794897914
2421G94897914p2360p2718p5996p5280p1764r0719j23381j39356j56343j76966j61827
$$ 794897914 794825554 794752836 794676840 794601560 794529796 794439077 794315696 794176340 794019997 793843031 793681204
2443.4G93681204j59859k15352k67446k75671k70784k97070l54767m03285m43041m87566
$$ 793681204 793521345 793305993 793038547 792762876 792492092 792195022 791840255 791436970 790993929 790506363
2463.8G90506363n33044n94259o55293p04229p77602q76367r56595j030982j124263
$$ 790506363 789973319 789379060 788723767 788019538 787241936 786365569 785408974 784377992 783253729
2482.1G83253729j212835j266777j280189j288652j289130j248955j188219j121342
$$ 783253729 782040894 780774117 779493928 778205276 776916146 775667191 774478972 773357630
2498.5G73357630j049817j011073r90093r38833q94487q89063q82148q32975p64549
$$ 773357630 772307813 771296740 770306647 769367814 768473327 767584264 766702116 765869141 765104592
2516.8G65104592o66857m91261k94626j41740J5557K21848M15087N51999O61015P30634
$$ 765104592 764437735 763946474 763651848 763510108 763525665 763747513 764162600 764714599 765375614 766106248
2537.2G66106248P66158Q18729Q66473Q56996Q36730Q35716P68006O60360N90742N02884
$$ 766106248 766872406 767691135 768557608 769414604 770251334 771087050 771855056 772515416 773106158 773609042
2557.6G73609042M17531L84330L45529K77578K27154K01106J40428O5744N7221N8174
$$ 773609042 774026573 774410903 774756432 775034010 775261164 775462270 775602698 775668442 775725663 775783837
2578G75783837J4722j0073j7583m7744p7426q6963q3447o6280m6015m5180p3493p6890
$$ 775783837 775798559 775788486 775770903 775723159 775645733 775558770 775475323 775409043 775363028 775317848 775244355 775167465
2602.5G75167465k9146O735K3901M6134O7830R8050J27256J32084J11461J15335J52468
$$ 775167465 775138319 775145054 775168955 775215089 775282919 775380969 775508225 775640309 775751770 775867105 776019573
2624.9G76019573J59383J48773J42992J12235P9513P9930Q4281O5565N2392O3360M5240
$$ 776019573 776178956 776327729 776470721 776582956 776662469 776742399 776826680 776892245 776944637 777007997 777053237
2647.3G77053237n543n1976j06811j49727j57058j67906k06471k19524k05397k27213
$$ 777053237 777047694 776995718 776888907 776739180 776582122 776414216 776207745 775988221 775782824 775555611
2667.7G75555611k56479k39790k14994k33709k74063k95877k94507k91347k73705k55882
$$ 775555611 775299132 775059342 774844348 774610639 774336576 774040699 773746192 773454845 773181140 772925258
2688.1G72925258k78235l01778l08395l32474l46959l19481l11971l34858l41595l44216
$$ 772925258 772647023 772345245 772036850 771704376 771357417 771037936 770725965 770391107 770049512 769705296
2708.5G69705296l58165l74377l82423l91006l92735l89159m01676m08292l55780k99930
$$ 769705296 769347131 768972754 768590331 768199325 767806590 767417431 767015755 766607463 766251683 765951753
2728.9G65951753l06070k97725k69413k99573l40164l16560k83182k83360k93017l12507
$$ 765951753 765645683 765347958 765078545 764778972 764438808 764122248 763839066 763555706 763262689 762950182
2749.3G62950182l37005l30388l16143l62039l97146l56853l56614m17769m16517m09902
$$ 762950182 762613177 762282789 761966646 761604607 761207461 760850608 760493994 760076225 759659708 759249806
2769.7G59249806m96387n33640m65394m62651n14149n04315n40793o41883o51955o06239
$$ 759249806 758753419 758219779 757754385 757291734 756777585 756273270 755732477 755090594 754438639 753832400
2790.1G53832400o40571p08580p31528p41541p45297p32899p60734q59260r27091r09984
$$ 753832400 753191829 752483249 751751721 751010180 750264883 749531984 748771250 747911990 746984899 746074915
2810.5G46074915r17852r64284j005650j080751j146972j169682j232504j340092j411259
$$ 746074915 745157063 744192779 743187129 742106378 740959406 739789724 738557220 737217128 735805869
2828.9G35805869j495719j666844j855194k082527k426624k828300l313899l920555
$$ 735805869 734310150 732643306 730788112 728705585 726278961 723450661 720136762 716216207
2845.2G16216207m307926l985822k996564j870513r88841m85122l49403m14550o15120
$$ 716216207 711908281 707922459 704925895 703055382 702066541 701581419 701232016 700817466 700202346
2863.5G00202346r70006j302421j403868j318694j116156p92682n57423o08742p87378
$$ 700202346 699232340 697929919 696526051 695207357 694091201 693298519 692741096 692132354 691344976
2881.9F91344976q90970r82046j104057j161277j193464j253068j232148j147747j145064
$$ 691344976 690454006 689471960 688367903 687206626 686013162 684760094 683527946 682380199 681235135
2900.2F81235135j175523j179218j304925j622081k021968k396464k627314k556502
$$ 681235135 680059612 678880394 677575469 675953388 673931420 671534956 668907642 666351140
2916.6F66351140k172173j637876j062631m45783J43647O29365J084209J494348J740455
$$ 666351140 664178967 662541091 661478460 661032677 661176324 661805689 662889898 664384246 666124701
2934.9F66124701J880527J980007J897216J664936J485109J293779R49681N51760K85566
$$ 666124701 668005228 669985235 671882451 673547387 675032496 676326275 677275956 677827716 678113282
2953.3F78113282J73390J89840L28005M93407O42479P92264Q96752R65119J088023
$$ 678113282 678286672 678476512 678804517 679297924 679940403 680732667 681629419 682594538 683682561
2971.6F83682561J253724J378894J456320J556456J672507J672566J524031J327872
$$ 683682561 684936285 686315179 687771499 689327955 691000462 692673028 694197059 695524931
2987.9F95524931J137435J013041R25243P38084N59449M73738L48985K01106J08362
$$ 695524931 696662366 697675407 698600650 699338734 699898183 700371921 700720906 700922012 701030374
3006.3G01030374K0921n8890l7312L6478L9697j8180j23799k90989m20511m83513n40018
$$ 701030374 701051295 700992405 700955093 700991571 701031268 701013088 700889289 700598300 700177789 699694276 699154258
3028.7F99154258n63801n70237n98371o64294p62105q27491q25703p98405q01026q26121
$$ 699154258 698590457 698020220 697421849 696757555 695995450 695167959 694342256 693543851 692742825 691916704
3049.1F91916704q53658q96811r29773r10759q96752r25064r26316q95381q38816p70151
$$ 691916704 691063046 690166235 689236462 688325703 687428951 686503887 685577571 684682190 683843374 683073223
3069.5F83073223p80762q39710q58128q38280q25047q46088q68082q67069q44836q25286
$$ 683073223 682292461 681452751 680594623 679756343 678931296 678085208 677217126 676350057 675505221 674679935
3089.9F74679935q39055q58843q55625q74221r30011r58502r50575r64106j006841
$$ 674679935 673840880 672982037 672126412 671252191 670322180 669363678 668413103 667448997 666442156
3108.3F66442156j021803j009047j018583j060248j110494j174688j255453j271605
$$ 666442156 665420353 664411306 663392723 662332475 661221981 660047293 658791840 657520235
3124.6F57520235j217187j187801j225591j310050j373828j374125j353026j384377
$$ 657520235 656303048 655115247 653889656 652579606 651205778 649831653 648478627 647094250
3140.9F47094250j459360j511753j521230j498461j472651j523078j633644j675606
$$ 647094250 645634890 644123137 642601907 641103446 639630795 638107717 636474073 634798467
3157.2F34798467j653254j641810j655698j678168j709581j762032j803100j832068
$$ 634798467 633145213 631503403 629847705 628169537 626459956 624697924 622894824 621062756
3173.5F21062756j828969j786470j792848j834870j842260j841068j868189j888335
$$ 621062756 619233787 617447317 615654469 613819599 611977339 610136271 608268082 606379747
3189.9F06379747j861095j861930j906335j898766j868665j882494j900434j856446
$$ 606379747 604518652 602656722 600750387 598851621 596982956 595100462 593200028 591343582
3206.2E91343582j823664j874328j909911j897693j861334j822114j829326j851261
$$ 591343582 589519918 587645590 585735679 583837986 581976652 580154538 578325212 576473951
3222.5E76473951j860559j877427j866698j789808j721919j769841j830279j796902
$$ 576473951 574613392 572735965 570869267 569079459 567357540 565587699 563757420 561960518
3238.8E61960518j776158j759410j665891j625895j678467j672327j632870j633167
$$ 561960518 560184360 558424950 556759059 555133164 553454697 551782370 550149500 548516333
3255.1E48516333j659393j696825j695454j638770j547456j488805j473248j468062
$$ 548516333 546856940 545160115 543464661 541825891 540278435 538789630 537316382 535848320
3271.4E35848320j491368j496434j469136j454413j442969j436531j445115j437545
$$ 535848320 534356952 532860518 531391382 529936969 528494000 527057469 525612354 524174809
3287.8E24174809j405119j401604j466453j534760j544356j525879j494229j469791
$$ 524174809 522769690 521368086 519901633 518366873 516822517 515296638 513802409 512332618
3304.1E12332618j525938j650930j744747j806676j849473j847803j878798j967609
$$ 512332618 510806680 509155750 507411003 505604327 503754854 501907051 500028253 498060644
3320.4D98060644j997501j984835k077490k228468k279461k259731k244860k214849
$$ 498060644 496063143 494078308 492000818 489772350 487492889 485233158 482988298 480773449
3336.7D80773449k228141k328902k383054k363473k314389k215385k220660k357275
$$ 480773449 478545308 476216406 473833352 471469879 469155490 466940105 464719445 462362170
3353D62362170k399623k329022k262682k274423k320081k242983k133012k173692k277046
$$ 462362170 459962547 457633525 455370843 453096420 450776339 448533356 446400344 444226652 441949606
3371.4D41949606k240181k069443j935542j858980j816392j773625j661062j462281
$$ 441949606 439709425 437639982 435704440 433845460 432029068 430255443 428594381 427132100
3387.7D27132100j255453j294970j529008j526922j224041j002103j136393j341909
$$ 427132100 425876647 424581677 423052669 421525747 420301706 419299603 418163210 416821301
3404D16821301j225263r69440q58158q63075q75085q36313p26313o12407n22674l74317
$$ 416821301 415596038 414626598 413768440 412905365 412030280 411193967 410467654 409855247 409332573 408958256
3424.4D08958256j88231n8770m0383O1363K76268K37405M500O5327L65377N29736O38842
$$ 408958256 408770025 408711255 408670872 408732235 409008503 409245908 409250408 409315735 409681112 410210848 410849690
3446.8D10849690P47174P95514Q66234R73284J085908J163512J135498J142562J379758
$$ 410849690 411596864 412392378 413258612 414231896 415317804 416481316 417616814 418759376 420139134
3465.2D20139134J595974J419753J077711J072735J343280J596510J665146J545727
$$ 420139134 421735108 423154861 424232572 425305307 426648587 428245097 429910243 431455970
3481.5D31455970J479327J564622J651794J718700J781225J795233J849830J871377
$$ 431455970 432935297 434499919 436151713 437870413 439651638 441446871 443296701 445168078
3497.8D45168078J843274J896143J893848J793295J881987K114534K221108K166539
$$ 445168078 447011352 448907495 450801343 452594638 454476625 456591159 458812267 460978806
3514.2D60978806K067477K071023K163529K334356K369136K213299K250344K448767
$$ 460978806 463046283 465117306 467280835 469615191 471984327 474197626 476447970 478896737
3530.5D78896737K529472K600193K678663K586275K542883K671600K795726K805382
$$ 478896737 481426209 484026402 486705065 489291340 491834223 494505823 497301549 500106931
3546.8E00106931K755105K798856K914786K924085K918005L028094L036619K800226
$$ 500106931 502862036 505660892 508575678 511499763 514417768 517445862 520482481 523282707
3563.1E23282707K863049L661812M008829L505111L297687L493368L659904L745854
$$ 523282707 526145756 529807568 533816397 537321508 540619195 544112563 547772467 551518321
3579.4E51518321L704310L498375L614664M258037M333555L740371L732502M106283
$$ 551518321 555222631 558721006 562335670 566593707 570927262 574667633 578400135 582506418
3595.7E82506418M197598M231214M216552L819943L568649M036486M312813M105747
$$ 582506418 586704016 590935230 595151782 598971725 602540374 606576860 610889673 614995420
3612.1F14995420L986120L717602M058241M751087M081010K920449K708614M218936
$$ 614995420 618981540 622699142 626757383 631508470 635589480 638509929 641218543 645437479
3628.4F45437479N146682L802657L259421L385246L315985L253758K878368K245307
$$ 645437479 650584161 654386818 657646239 661031485 664347470 667601228 670479596 672724903
3644.7F72724903K353429L816724M456342K960860K385199L183365L106475K464235
$$ 672724903 675078332 678895056 683351398 686312258 688697457 691880822 694987297 697451532
3661F97451532K170563J731455J423538K062857K317548J449465K107263K866387K042354
$$ 697451532 699622095 701353550 702777088 704839945 707157493 708606958 710714221 713580608 715622962
3679.4G15622962J634359J356840R70364J401543K255917J999676J319885J074374
$$ 715622962 717257321 718614161 719584525 720986068 723241985 725241661 726561546 727635920
3695.7G27635920R35137Q89659J166463J113892N24342K50518O59466J365006J184821
$$ 727635920 728571057 729460716 730627179 731741071 732265413 732515931 733175397 734540403 735725224
3714G35725224N02646K29180K48730L89457N34653O04451L42488n3405k5332N82516
$$ 735725224 736227870 736457050 736705780 737095237 737629890 738234341 738576829 738523424 738498092 739080608
3734.4G39080608J240969P32481n16713o16550O66141O19293j20282P20560J243532
$$ 739080608 740321577 741054058 740537345 739920795 740586936 741206229 741085947 741806507 743050039
3752.8G43050039M18126m232L86894N52237J24336j5557J12772L95834O38366L12030
$$ 743050039 743468165 743463933 743850827 744403064 744527400 744511843 744624615 745020449 745658815 745970845
3773.2G45970845o7174K9623L68476K53320m0114J26660K84195J86324k4140k67208
$$ 745970845 745903671 745933294 746301770 746555090 746514976 746641636 746925831 747112155 747088015 746820807
3793.6G46820807k37822k50816j67132M73499L33608O9499N59747K91526m62532n79536
$$ 746820807 746582985 746332169 746165037 746638536 746972144 747041643 747601390 747892916 747430384 746850848
3814G46850848n7101k1517M7147P16507M20571o4433j30713j80304j32680j56045n2869
$$ 746850848 746793747 746772230 746819377 747535884 747956455 747892022 747761309 747581005 747448325 747292280 747239411
3836.4G47239411L06964L65257K78711K44797j49072q68856j223445K7477J566053
$$ 747239411 747546375 747911632 748190343 748435140 748286068 747417212 746193767 746221244 747787297
3854.8G47787297N48601m40180m76957j65164P4267k15769j25050M25041L61800R2447
$$ 747787297 748335898 747895718 747418761 747253597 747327864 747112095 746987045 747412086 747773886 747866333
3875.2G47866333l06428l50714n304l1770K47419K28465k70486J8537J97410l94582
$$ 747866333 747559905 747209191 747203887 747172117 747419536 747648001 747377515 747396052 747593462 747198880
3895.5G47198880o58751l52859M3511M19796N39302J98722p7665j71244l06189k67386
$$ 747198880 746540129 746187270 746230781 746650577 747189879 747388601 747310936 747139692 746833503 746566117
3915.9G46566117p332N2870j15514r1791m590j41084j60575Q3208J84059J6630j76251
$$ 746566117 746558785 746611655 746496141 746404350 746399760 746258676 746098101 746181309 746365368 746381998 746205747
3938.4G46205747k35081p8559J0074m3750O2644J45138L0934q1539q9049o3300m3512
$$ 746205747 745970666 745892107 745902181 745858431 745921075 746066213 746097147 746015608 745926559 745863259 745819747
3960.8G45819747k3484n6445q6069l3558P928K7894N2095m172o3002L099O1691j7822
$$ 745819747 745796263 745739818 745653749 745620191 745628119 745656013 745708108 745703936 745640934 745644033 745705724 745687902
3985.3G45687902p8142o8187q2195m8697K0981J7762
$$ 745687902 745609760 745541573 745459378 745410681 745431662 745449424
3997.5G45449424
$$ 745449424
##END=$$ End of the data block
