##TITLE=$$ Begin of the data block
##JCAMP-DX=5.00 $$ ACD/SpecManager v 10.08
##SPECTROMETER/DATA SYSTEM=Alpha
##DATE=11 Jun 2014 19:36:16
##DATA TYPE=INFRARED SPECTRUM
##DATA CLASS=XYDATA
##ORIGIN=
##OWNER=
##NPOINTS=1765
##FIRSTX=399.75695801
##LASTX=3997.56933594
##MAXX=3997.56933594
##MINX=399.75695801
##MAXY=0.73680025
##MINY=0.36914533
##XFACTOR=1.0000000000
##YFACTOR=1.000000000000000e-9
##FIRSTY=0.63215512
##DELTAX=2.03957629
##XUNITS=1/CM
##YUNITS=ARBITRARY UNITS
##XYDATA=(X++(Y..Y))
399.8 632155120 633912206 634558678 634528577 634471595 633943856 633000433 632512152 632262468 631722510 631229997
420.2 631229997 631056488 631107211 630858779 629794180 628611326 628120482 628068268 627950966 627493501 626787484
440.5 626787484 626155078 625591397 625004828 624470174 623780072 622798204 621739566 620481312 619098783
458.9 619098783 618063569 617283344 616331100 615107596 614242435 614175975 614533782 614913046 615402162 615995884
479.3 615995884 616423905 616858780 617535591 618036032 618163586 618276298 618347943 618136883 617811918 617647290
499.7 617647290 617662787 617527723 617059708 616568089 616106749 615294576 614246666 613454223 612897456 612257361
520.1 612257361 611609280 611354589 611425161 611134648 610427439 609956086 609878778 609748900 609433174 609333158
540.5 609333158 609547734 609565496 609275818 609347403 609813631 609768629 609090924 608721972 609151840 609810174
560.9 609810174 610168040 610660732 611546457 612220705 612407625 612553537 612878263 612846732 612294197 612051606
581.3 612051606 612457275 612729728 612528265 612585664 613051653 613068342 612511873 612229049 612377405 612138212
601.7 612138212 611369669 610862613 610729039 610162675 609080732 608496785 608670473 608744740 608598232 609158337
622.1 609158337 610539913 611615062 612039745 612745285 614042401 615108132 615564525 616195142 617426693
640.4 617426693 618413866 618646562 618901014 619635105 620087087 619791746 619424403 619385600 618995488 617974401
660.8 617974401 617210090 616898298 616246641 615894556 616899550 618325591 619453609 619929910 620501637
679.2 620501637 621753395 622915685 623365819 623742402 624660611 625447214 625426352 625276685 625693023 626457810
699.6 626457810 627331138 628360331 629452348 629897952 629033983 628027558 628853559 630945444 632315278
717.9 632315278 633203506 634861529 636838734 638275146 639613807 641496122 643194020 643859327 644208550
736.3 644208550 645102382 646025836 646333992 646663547 647792220 649159729 649960577 650668144 652002573
754.6 652002573 653429806 654181123 654766083 655926228 657073081 657450318 657613277 658244371 658874631
773 658874631 658896208 658784091 659368455 660367548 660922706 661328256 662382483 663601995 664063156 664195538
793.4 664195538 664911091 665900052 666430593 666856349 667756855 668623149 668769658 668626726 668958783 669457257
813.8 669457257 669615388 669980228 671121895 672647774 674009919 675423741 677299142 679322958 680944800
832.1 680944800 682246387 683492243 684346855 684397161 684092164 684067726 683780015 682408333 679938376
850.5 679938376 676781297 674585640 675366879 678822160 683036685 686441362 688140094 687566936 683901310
868.9 683901310 677138567 669983327 666163266 667333484 672691643 679865658 686467528 691413939
885.2 691413939 694390774 695475936 695351481 694546998 693094254 691364348 690014064 689088702 688276589
903.5 688276589 687735915 687840879 688290060 688270807 687619030 686956406 686557055 685970366 684906065 683580399
923.9 683580399 682055950 680124581 677931666 675968647 674374759 672871768 671367943 669970810
940.2 669970810 668595731 667108417 665636420 664493024 663805306 663274050 662478089 661277294 659613848
958.6 659613848 657399952 654817879 652185142 649518073 646583676 643305838 639772952 635962725
974.9 635962725 631743252 627166271 622424841 617557108 612643421 607922137 603576481 599680603
991.2 599680603 596115232 592698634 589501321 586655736 583974481 581136227 578165054 575345099
1007.5 575345099 572761178 570303679 567990601 565854251 563602030 560903251 557843626 554702699
1023.9 554702699 551574409 548428297 545337737 542643666 540914714 540636122 541850269 543953896
1040.2 543953896 545966685 547127247 547226548 546468258 545105278 543281496 541223705 539460957 538740158
1058.5 538740158 539567232 541714609 544442058 547102511 549297690 550842881 551787615 552308798 552520752
1076.9 552520752 552427053 552238166 552592874 553712904 555063128 556416571 557932079 559494913 560911000
1095.2 560911000 562209070 563436151 564509332 565325081 565817952 565976799 565903544 566020012 566915691
1113.6 566915691 568693459 570769846 572520494 573931158 575395226 577219427 579524636 582316339
1129.9 582316339 585470498 588782489 592106283 595262051 597928941 599843562 600985527 601495266
1146.2 601495266 601454914 600851715 599839926 598668218 597308040 595663428 594037950 593111634 593480945
1164.6 593480945 595261812 598166645 601759076 605617702 609478116 613224626 616763592 619969130
1180.9 619969130 622733772 625023425 626842856 628111482 628740609 628834486 628515363 627756953 626648009
1199.3 626648009 625481844 624407589 623363793 622454107 621951282 621843815 621741891 621343195 620746434
1217.6 620746434 620142698 619459331 618568957 617566228 616598368 615610301 614569068 613749981 613365054
1236 613365054 613159239 612831533 612494707 612285197 612026811 611650169 611455142 611574769 611690760 611559570
1256.4 611559570 611384928 611441791 611615956 611719251 611884475 612279117 612779438 613206089 613577604 613953650
1276.8 613953650 614250064 614468336 614934862 615819871 616820037 617585540 618080974 618463933 618758380
1295.1 618758380 618799984 618546247 618097067 617401898 616338491 614992023 613565326 612076581 610543847
1313.5 610543847 609257579 608597815 608589590 608846128 609058917 609103978 608809292 608019352 606869638 605661035
1333.9 605661035 604625285 603965878 603878736 604209900 604569077 604770899 604722917 604278207 603277326 601861119
1354.3 601861119 600319445 598698914 597005188 595514417 594243050 592755735 590954781 589081943
1370.6 589081943 587424695 586148024 585062861 583873093 582462072 580796778 579180717 577973962
1386.9 577973962 576773047 574883938 572224259 569104075 565800905 562298059 558570206 554647386
1403.2 554647386 550587654 546566010 542517960 538434327 534473181 530674219 527115345 524200737
1419.5 524200737 522173405 520774424 519940317 519629002 519931376 520585775 521122873 522138000 523837149
1437.9 523837149 524997652 525606275 526030362 526392519 526932538 527436733 527524233 527390838 528212249 530496299
1458.3 530496299 532138526 532969117 534008443 535222054 536035120 537045479 539323926 542143822 544273853
1476.6 544273853 545777500 546808422 547407508 547531068 547390342 547394454 547493756 547115982 546447277 546193659
1497 546193659 546244025 545922339 544997752 543996274 543951929 544002473 543276250 542148709 541052461 540393949
1517.4 540393949 540233850 540665507 541181564 541390061 541637778 541570008 541249931 541285992 541110277 540539622
1537.8 540539622 541228712 543418646 545395076 547025084 548358142 549794793 551356792 552634120
1554.1 552634120 553405285 555314302 558793724 560063481 560031295 559860826 559635699 559344649 558331013
1572.5 558331013 556823254 555701137 554590344 552999914 551223099 549343526 547207117 544849038
1588.8 544849038 542372048 539847374 537291944 534746766 532234848 529753745 527301371 524887741
1605.1 524887741 522580206 520397067 518188179 515779078 513448894 511586487 509831846 507914066
1621.4 507914066 506219983 504800975 503480136 502298892 501033723 499932140 499937177 500621617 500899315
1639.8 500899315 501009166 501162112 502059937 503618360 504207432 505271256 508811533 511333883 512668967
1658.2 512668967 514451861 517246664 520419240 522849262 525643766 529527187 532888949 536371469
1674.5 536371469 540552795 543913066 546459377 549891829 556001127 561553895 565545440 569765687
1690.8 569765687 573628843 578241348 583985388 589971662 597342134 603021443 607405365 612362564
1707.1 612362564 616546631 619652748 622126877 624698222 628580332 632438660 634667337 636415124
1723.4 636415124 638238907 639711380 640852630 641867757 644111335 646937251 648453474 650323808
1739.7 650323808 653150916 656062603 659104347 662588000 667090476 671994328 675710618 678960919
1756.1 678960919 682338715 685350358 688558459 691299200 693074346 694603264 696222186 698577762
1772.4 698577762 700890303 702021718 702761412 703810871 704948246 705991745 706843972 707232833 707839847
1790.7 707839847 709446728 710879385 711537838 712257624 713503122 714859545 715887666 716708481 717581213
1809.1 717581213 718686581 719781280 720645785 721452594 722233951 722798586 723314762 724001944 724548280
1827.4 724548280 725352228 726486206 727071524 727367520 727861106 728127301 728031218 728562534 729708493
1845.8 729708493 730318844 730577648 730854213 731159806 731463909 731724262 731991649 732231081 732239366 732072532
1866.2 732072532 732430756 733314693 733783305 733831882 733912468 734111190 734318316 734440565 734501541 734529674
1886.6 734529674 734724104 735091507 735251904 735369623 735624790 735765874 735829830 735980272 736110151 736103594
1907 736103594 736140668 736341834 736432672 736247838 736227930 736498535 736615777 736684382 736775219 736785948 736800253
1929.4 736800253 736777961 736731768 736726344 736690879 736494660 736384094 736584187 736760497 736716449 736566544 736436129
1951.9 736436129 736362040 736294270 736211836 736153185 736075699 735898137 735762656 735804975 735826492 735701323 735529423
1974.3 735529423 735387564 735315561 735256970 735151052 735002339 734816611 734587669 734429717 734445512 734418273
1994.7 734418273 734241545 734052241 733887434 733739018 733602047 733448327 733289778 733129382 732907474 732642412
2015.1 732642412 732465625 732340991 732123494 731859863 731637120 731451809 731253922 731022298 730789900 730556011
2035.5 730556011 730299652 730062127 729897261 729762971 729597509 729396701 729203045 729039967 728878796 728699923
2055.9 728699923 728517294 728322208 728087723 727870226 727708101 727560699 727411509 727260292 727091491 726916671
2076.3 726916671 726750791 726578593 726393044 726190031 725956202 725709617 725507259 725353539 725173354 724940002
2096.7 724940002 724711657 724496365 724266946 724059880 723891020 723697245 723430693 723162711 722974122 722810745
2117.1 722810745 722581029 722304344 722068191 721892834 721710801 721496344 721324742 721211791 721051157 720830560
2137.5 720830560 720667839 720581472 720490932 720368564 720245659 720140338 720029652 719901204 719792664 719710350
2157.9 719710350 719609201 719506025 719447911 719401538 719313085 719214499 719167650 719138384 719041586 718904018 718830347
2180.3 718830347 718800724 718732774 718660772 718651712 718651533 718562126 718430579 718369484 718352437 718278825 718154371 718067586
2204.8 718067586 718023777 717941642 717816830 717714310 717633963 717514634 717373729 717275143 717183053 717046082
2225.2 717046082 716903210 716797650 716698587 716546893 716357291 716202736 716093302 715962350 715780556 715641260
2245.6 715641260 715597093 715518355 715353608 715225518 715183377 715119243 714971542 714833081 714760780 714685380 714559138
2268 714559138 714446127 714398026 714343727 714223325 714103520 714045525 713948905 713717103 713443220 713231087 713016868
2290.4 713016868 712725103 712403893 712106645 711801350 711434603 711000919 710521638 709988773 709414542 708904207
2310.8 708904207 708528221 708063662 707281291 706403971 705772102 705381572 704957664 704398036 703991413 703894377
2331.2 703894377 703737617 703304291 702871025 702678323 702838063 703776062 705277383 705142260 702778399
2349.6 702778399 700051367 698521554 697991073 697898746 698124349 698666215 699526846 700518787 701529086
2367.9 701529086 702570081 703552246 704350829 704967380 705444336 705747485 705824614 705699265 705460131 705220342
2388.3 705220342 705012977 704786301 704525113 704286516 704077303 703833282 703557849 703315675 703103185 702850759
2408.7 702850759 702540576 702233493 701970339 701676607 701321900 701009095 700755537 700465560 700128913 699823737
2429.1 699823737 699550688 699235857 698848188 698468268 698172748 697894633 697555006 697191179 696854293 696514189
2449.5 696514189 696131706 695743024 695373952 694993436 694579720 694138587 693733752 693369627 692943037 692440927
2469.9 692440927 691949785 691490769 690984488 690406263 689827085 689270437 688683093 688085616 687549353 687007070
2490.3 687007070 686377108 685736895 685215354 684782743 684281707 683694422 683143497 682663202 682156384 681579888
2510.7 681579888 681014836 680484235 679935396 679410815 678983033 678601325 678179443 677738249 677377224 677113056
2531.1 677113056 676838994 676501513 676191211 675950408 675668001 675280094 674874902 674541235 674231112 673889756
2551.5 673889756 673576832 673293173 672955811 672553778 672140360 671768785 671422362 671040654 670660377 670328319
2571.9 670328319 669971943 669532418 669051468 668596268 668174088 667727470 667252600 666806638 666369259 665885508
2592.3 665885508 665386975 664920449 664460182 663958669 663431644 662941575 662476778 661981285 661472976 660989583
2612.7 660989583 660539210 660075903 659537554 659002006 658551097 658093810 657562613 657017589 656518757 656026959
2633.1 656026959 655463815 654867828 654333591 653845847 653334796 652788162 652226150 651656151 651064336 650460124
2653.5 650460124 649884820 649312019 648690879 648055136 647489011 646966934 646378756 645751059 645162582 644583166
2673.9 644583166 643980622 643375456 642787278 642208278 641596317 640944898 640334308 639795899 639216483 638545513
2694.3 638545513 637903392 637341738 636773705 636158586 635569036 635029852 634450972 633815467 633226275 632716775
2714.6 632716775 632190645 631622851 631121814 630694330 630217969 629668772 629150927 628705621 628269196 627826869
2735 627826869 627419233 627043366 626653373 626215160 625787318 625435650 625086248 624639869 624161124 623753369
2755.4 623753369 623355567 622892559 622417808 621954739 621440828 620870948 620325983 619844437 619359493 618798256
2775.8 618798256 618165731 617527127 616922200 616298020 615621388 614952028 614306509 613613069 612850487 612096250
2796.2 612096250 611358941 610544026 609663963 608807445 607949913 607033372 606068075 605082095 604080379
2814.6 604080379 603026807 601892173 600715578 599524975 598259211 596845269 595299482 593663394
2830.9 593663394 591896355 589954376 587793171 585272253 582272351 578802943 574934185 570951462
2847.2 570951462 567512512 565213740 564148486 563971817 564166307 564315557 564207017 563770533 563005269
2865.6 563005269 561997473 561015427 560326755 559903860 559559643 559191287 558736622 558097422 557208478
2883.9 557208478 556092680 554785073 553326368 551829636 550422132 549096465 547776520 546491623
2900.2 546491623 545234203 543891728 542375088 540561557 538342714 535754502 532933414 530143201
2916.6 530143201 527732909 525921464 524752915 524200916 524231791 524740636 525546670 526580870 527842462
2934.9 527842462 529234767 530630827 531949937 533126593 534033298 534524322 534561217 534245014 533758104
2953.3 533758104 533279419 532993793 533084810 533607602 534458220 535493076 536586821 537685037 538856328
2971.6 538856328 540153384 541502416 542832732 544122696 545310199 546347082 547250330 548034489 548660696
2990 548660696 549092293 549379170 549547195 549519360 549259543 548829496 548304260 547716796 547113478 546594143
3010.4 546594143 546153605 545701742 545233190 544753671 544211566 543582261 542886555 542140782 541375101 540628731
3030.8 540628731 539876699 539037585 538130939 537275374 536446691 535533369 534548283 533571303 532648325 531743705
3051.2 531743705 530798078 529861510 528954923 528004766 527057469 526221275 525473773 524701655 523854196 522972345
3071.6 522972345 522087455 521264136 520558953 519855440 519035041 518173397 517368495 516597450 515799284 514956057
3092 514956057 514158130 513462424 512757063 511992991 511194408 510364771 509556472 508767486 507942915 507104397
3112.4 507104397 506296039 505488396 504612327 503641963 502610266 501581669 500618637 499689937 498704165
3130.7 498704165 497686595 496722788 495827556 494910240 493863255 492752403 491684139 490633190 489597857
3149.1 489597857 488610864 487574100 486419499 485251158 484142244 483077288 482023329 480912954
3165.4 480912954 479752451 478637516 477568805 476470262 475325793 474210680 473129511 471987188
3181.7 471987188 470818013 469694465 468579143 467438728 466279089 465122074 464005321 462912560
3198 462912560 461795330 460688353 459607452 458491057 457364887 456285000 455205739 454114705 453020394
3216.4 453020394 451919019 450850219 449762046 448613673 447519094 446525246 445567608 444616735 443631291
3234.7 443631291 442589670 441536129 440512896 439579964 438752443 437921345 437009335 436056912 435169458
3253.1 435169458 434387922 433562547 432634354 431728721 430898607 430089742 429243475 428430349 427681178 426893383
3273.5 426893383 426046371 425188929 424360931 423560649 422768265 422009826 421297789 420598269 419866055 419065773
3293.9 419065773 418227822 417430580 416687220 415978909 415315896 414619297 413772702 412821710 411899477 411012918
3314.3 411012918 410070181 409054071 408037037 407062292 406072080 405000776 403851569 402643204 401416153
3332.6 401416153 400237411 399125248 397977144 396737635 395538181 394440591 393402517 392432213
3348.9 392432213 391458511 390398443 389374524 388489127 387652457 386778742 385912091 385166645 384516209
3367.3 384516209 383762270 382801712 381821513 381005138 380288154 379562020 378797293 378093868 377521783 377011061
3387.7 377011061 376525939 376018614 375367075 374665350 374158412 373783976 373282045 372601688 371957690 371498704
3408.1 371498704 371146977 370813936 370453387 370053470 369742393 369604677 369500071 369319111 369168490 369158238
3428.5 369158238 369231284 369339108 369476020 369511992 369334579 369145334 369172603 369415283 369829327 370195568
3448.9 370195568 370391995 370614231 370949090 371375918 371885359 372388303 372889757 373540401 374337822 374968112
3469.3 374968112 375297785 375652343 376218438 376885206 377571344 378290027 379033059 379763991 380479723 381167144
3489.7 381167144 381851494 382628441 383527577 384370834 385123700 386097223 387155473 387838006 388508976
3508 388508976 389624774 390852928 391818136 392613351 393433601 394348711 395497143 396749049 397861719
3526.4 397861719 399041027 400295168 401373237 402498215 403867513 405126870 406134337 407274038
3542.7 407274038 408872634 410608679 411848843 412945032 414478213 415975600 417199880 418558896
3559 418558896 419877440 420675278 421916813 424970508 428032011 429394573 430402756 431984693 433790863
3577.4 433790863 435626537 437219918 438253611 439775586 443061799 446115255 447414368 448880076
3593.7 448880076 451290011 453643054 455934614 458200485 459643275 460889369 463467628 466573030
3610 466573030 469029844 471071392 472518086 475025117 479237169 481754541 481782228 482133567 487107515
3628.4 487107515 493998766 496752501 498290032 500577092 502866030 505134106 506719053 507046402
3644.7 507046402 508426189 514513433 521582127 523440659 524030805 527534127 530808508 532359660
3661 532359660 533698678 534209311 534234464 536945641 540616155 541567564 545271397 550641239 551734269
3679.4 551734269 551344573 550637722 549275875 550055206 554329932 557205200 556873798 555896044 555402696
3697.7 555402696 555976152 558429539 560504138 560013652 559086442 560894370 565583408 567933381 566668928
3716.1 566668928 565194964 564984560 565607131 566539705 567405343 566640735 564526439 564100981 566963851
3734.4 566963851 570874214 571245849 567288816 564782739 568500161 570457935 568792105 571553290
3750.7 571553290 575355470 574318588 572202742 572636008 573642254 572770774 571963191 572106600 573186696
3769.1 573186696 574810803 574627221 572982371 572244704 573420584 574355125 573982775 574039757 574271500
3787.5 574271500 573921084 573100269 571950614 571509480 571023226 570746124 573243141 574248850 573570907
3805.8 573570907 575157344 575030565 571821809 569701970 571001768 571634591 571936846 574767470 574961305
3824.2 574961305 573137879 571952403 570912123 570350945 569692791 569928169 572384000 573958695 573865891
3842.5 573865891 573528767 571686924 567528605 563736856 567402303 575858414 576107264 571817577 568942249
3860.9 568942249 568837404 569779098 568957329 568886280 570938587 571586430 570827246 568928659 567803025
3879.2 567803025 568555355 568500161 569221735 569717884 568310142 568732321 569554687 567472339 565151334
3897.6 565151334 565182209 566814959 569043577 570380390 569431543 567710102 566470027 565403461 565217674
3915.9 565217674 566171348 566555500 565918088 565672755 565758765 565065801 564602613 565367758 565883279 565230072
3936.3 565230072 564207733 563586831 563794613 563981116 563537061 563474059 563730061 563556015 563198030 562952518
3956.7 562952518 562721610 562597454 562584102 562355518 561999142 561743557 561532795 561394632 561400354 561332405
3977.1 561332405 561068773 560865283 560782671 560604393 560362220 560253680 560186684 560016215 559842408 559680045
3997.5 559680045
##END=$$ End of the data block
