##TITLE=$$ Begin of the data block
##JCAMP-DX=5.00 $$ ACD/SpecManager v 10.08
##SPECTROMETER/DATA SYSTEM=Alpha
##DATE=11 Jun 2014 19:36:16
##DATA TYPE=INFRARED SPECTRUM
##DATA CLASS=XYDATA
##ORIGIN=
##OWNER=
##NPOINTS=1765
##FIRSTX=399.75695801
##LASTX=3997.56933594
##MAXX=3997.56933594
##MINX=399.75695801
##MAXY=0.73880702
##MINY=0.36955556
##XFACTOR=1.0000000000
##YFACTOR=1.000000000000000e-9
##FIRSTY=0.62918890
##DELTAX=2.03957629
##XUNITS=1/CM
##YUNITS=ARBITRARY UNITS
##XYDATA=(X++(Y..Y))
399.8F29188895K476990R55880J08063Q9407j99198q01444q31902m58897l13282m60207
420.2F29754305l11911J0133l25799j025618j250088r01222m84586j02639K15054r6083
440.5F25481546p68423r72688p67887n73695o04570r11355j103103j147210j164675
458.9F17467940j140654j144171j000345p61389m31061j07587O2168K62856M66168
477.3F13673925N32628N48899O33418N23389J92284J20878L25621L20494o497k74778
497.7F16590261l26991l17752m96685o62566l92258k49267p31885j079440p68662l39210
518.1F11225545l61502o01828m96626j40130k13743n37991l91066m3571j33693m24803
538.4F07880592k07305K79487J37388l28779j31130L61144Q6964m90010l12448K71261
$$ y = [629188895, 631665885, 632621765, 632729828, 632819235, 632620037, 631818593, 630986691, 630527794, 630214512, 629754305, 629442394, 629452527, 629126728, 628101110, 626851022, 625949800, 625465214, 625362575, 625577629, 625481546, 624713123, 623740435, 622972548, 622398853, 621794283, 620882928, 619779825, 618632615, 617467940, 616327286, 615183115, 614182770, 613421381, 612990320, 612882733, 612944901, 613207757, 613673925, 614206553, 614755452, 615388870, 615912259, 616104543, 616225421, 616551042, 616871536, 616865039, 616590261, 616263270, 615945518, 615448833, 614786267, 614394009, 614144742, 613412857, 612333417, 611564755, 611225545, 610864043, 610262215, 609765589, 609625459, 609411716, 608873725, 608482659, 608439088, 608305395, 607880592, 607673287, 607952774, 608090162, 607761383, 607630253, 607991397, 608078361, 607588351, 607275903, 607547164]
558.8F07547164N15282M68075O95110J035154O06238q5353J10566N38886P3552n64635
579.2F10940039k95281L14057K18868k25067L0339M74095J1146o05822l09884K00510
599.6F10753000j00553o63340n10335j62661n32031r98438n90026O7055L7909q4281
620F07216299O80089J560270J153231L15428N93900J233876R88305M66406P47860J354336
640.4F16310000J064003K37524K02418O43909L19540m23968l89993J28806j22190q81552
660.8F17088497q27849m05431n98907k20776R96351J305699R93133M73917O89029J361728
681.2F20855391J196384M45426L81231Q74281P11918k3782r4533M54604P91789R06050
701.6F26498759J029670J050711M33504q22425r69469Q60810K145469J388431Q44002
$$ y = [607547164, 608062446, 608530521, 609225631, 610260785, 610867023, 610781670, 610892236, 611431122, 611504674, 610940039, 610644758, 610958815, 611177683, 610952616, 610982955, 611457050, 611468196, 610862374, 610552490, 610753000, 610652447, 609989107, 609478772, 609316111, 608784080, 607785642, 607195616, 607262671, 607300580, 607216299, 607896388, 609456658, 610609889, 610925317, 611519217, 612753093, 613741398, 614207804, 614955664, 616310000, 617374003, 617611527, 617813945, 618457854, 618777394, 618353426, 617963433, 618092239, 617970049, 617088497, 616260648, 615855217, 615256310, 615035534, 616031885, 617337584, 618330717, 618804634, 619493663, 620855391, 622051775, 622497201, 622878432, 623752713, 624464631, 624440849, 624346316, 624800920, 625592709, 626498759, 627528429, 628579140, 629012644, 628190219, 627220750, 628081560, 630227029, 631615460, 632459462]
720F32459462J648307K050161J476645J276970J805365J691580O96480L86358R41813
738.3F44433141R21070K36154K94328J193821J459360Q18908O60360J329959J461744
756.7F52808845P68125N89013J095772J066208L85642K22802P61032P63536J1384j65164
777.1F58307195N72681R92000O27935N12779J025379J094699L83853J02818O70016
795.4F64289355R83894O03318M92275R40204R09984K01702q9407L57866N24104J57595
815.8F69370890K99573J106739J545429J384020J465022J961708K034903J489818J204670
834.2F81862772J323163R87887J05262l32773k3841k02477j354039k600312l218353
852.5F76547289k118290P88928L412663M268885L484249J716078n77629l675819o798744
$$ y = [632459462, 634107769, 636157930, 637634575, 638911545, 640716910, 642408490, 643104970, 643491328, 644433141, 645354211, 645590365, 645884693, 647078514, 648537874, 649356782, 650017142, 651347101, 652808845, 653576970, 654165983, 655261755, 656327963, 656713605, 656936407, 657697439, 658460975, 658472359, 658307195, 658879876, 659871876, 660499811, 661012590, 662037969, 663132668, 663516521, 663619339, 664289355, 665273249, 665876567, 666368842, 667309046, 668219030, 668420732, 668331325, 668689191, 669213295, 669370890, 669670463, 670777202, 672322631, 673706651, 675171673, 677133381, 679168284, 680658102, 681862772, 683185935, 684173822, 684279084, 683946311, 683922470, 683719993, 682365954, 679765642, 676547289, 674428999, 675217927, 678630590, 682899475, 686383724, 688099802, 687522173, 683846354, 677047610]
870.9F77047610p200420l849387J177371N403638P244408O619394M870176K935588
887.2F94248378J125157q7917p70628j396775j683355j340091r61602q63313n48721
905.6F87721133J12832M37975j6690o42120o87540m28557n46873r86397j308918j556039
926F82098806j957953k203941j946807j566351j472175j473546j399279j416027j527488
944.3F67135239j480222j132727o85453n61238q31782j186729j609564k201140k644956
962.7F54801428k699017k679646k931714l304720l544927l771424m171968m562556
979F27135456m755915m851997m849016m677832m372359l951013l568470l357828l138661
997.3E89612365k844453k731204k872408k953469k782882k579510k467632k298415
$$ y = [677047610, 669847190, 665997803, 667175174, 672578812, 679823220, 686442614, 691312790, 694248378, 695373535, 695285618, 694514990, 693118215, 691434860, 690094769, 689133167, 688269854, 687721133, 687833965, 688271940, 688255250, 687613130, 686925590, 686497033, 685950160, 684963763, 683654845, 682098806, 680140853, 677936912, 675990105, 674423754, 672951579, 671478033, 670078754, 668662727, 667135239, 665655017, 664522290, 663836837, 663275599, 662443817, 661257088, 659647524, 657446384, 654801428, 652102411, 649422765, 646491051, 643186331, 639641404, 635869980, 631698012, 627135456, 622379541, 617527544, 612678528, 608000696, 603628337, 599677324, 596108854, 592751026, 589612365, 586767912, 584036708, 581164300, 578210831, 575427949, 572848439, 570380807, 568082392]
1013.7E68082392k141416k272844k684415l041386l147066l140032l138840l062785
1030E45453608k694666j752556k58565J256526K121508K011597J159668J08540p48813
1048.3E46656847j348138j786530k023339j763761p53343P53045K061724K697170K689243
1066.7E47182918K252161J598895R84490N27918J80066r2328j42038L47257J051843
1085E53891182J331687J408219J564324J567245J383900J242161J193583J066923P97451
1103.4E65446675M94242J98066j8239J70350R21011J768052K055467J781821J459837
1121.8E74277282J433193J764775K271473K772570L160238L349900L374756L163278
1138.1E95567465K621531J882732J167834N66900k8432o29484j017392j176953j346708
$$ y = [568082392, 565940976, 563668132, 560983717, 557942331, 554795265, 551655233, 548516393, 545453608, 542758942, 541006386, 540747821, 542004347, 544125855, 546137452, 547297120, 547405660, 546656847, 545308709, 543522179, 541498840, 539735079, 538981736, 539734781, 541796505, 544493675, 547182918, 549435079, 551033974, 552018464, 552546382, 552726448, 552634120, 552492082, 552839339, 553891182, 555222869, 556631088, 558195412, 559762657, 561146557, 562388718, 563582301, 564649224, 565446675, 565940917, 566138983, 566120744, 566291094, 567212105, 568980157, 571035624, 572817445, 574277282, 575710475, 577475250, 579746723, 582519293, 585679531, 589029431, 592404187, 595567465, 598188996, 600071728, 601239562, 601806462, 601778030, 601148546, 600131154, 598954201, 597607493]
1156.4E97607493j591920j591683r26137L43621J758635K925217L610015L830671L821791
1174.8F09787703L745079L572404L209710K724886K283216J854062J265883N82397
1191.1F29025340O6638l07918p42316j113951j182973j068533j003146q65817m97937
1209.5F22309387j47522j28865l74854n64694n87225o90162r22382r99332r03487r18746
1229.9F16072118j017451q45909m33803k43485l38375l36230k07305k22623l22521
1248.2F12104416j95682Q0049J20580q6069j61409K3782J56045J23083J80066L98695
1268.6F12743556N05746M02868L43263L88741L21389K26080M69446Q93593R96649P51436
1289F18042767N01275L93808K89798M1723k38538m30345o95110j071572j340568j435995
$$ y = [597607493, 596015573, 594423890, 593497753, 593841374, 595600009, 598525226, 602135241, 605965912, 609787703, 613532782, 617105186, 620314896, 623039782, 625322998, 627177060, 628442943, 629025340, 629091978, 628784060, 628041744, 626927793, 625744820, 624676287, 623673141, 622807324, 622309387, 622161865, 622033000, 621658146, 621093452, 620506227, 619816065, 618893683, 617894351, 616990864, 616072118, 615054667, 614208758, 613774955, 613531470, 613193095, 612856865, 612649560, 612426937, 612104416, 611908734, 611988783, 612109363, 612023294, 611861885, 611885667, 612041712, 612164795, 612344861, 612743556, 613249302, 613652170, 613995433, 614384174, 614705563, 614931643, 615401089, 616294682, 617291331, 618042767, 618544042, 618937850, 619227648, 619269371, 619030833, 618600488, 617905378, 616833806, 615493238, 614057243]
1309.4F14057243j506925j540780j303613o67155J9551K92956K31982M8995l14892
1327.8F09317362q15034j140773j198709j055121o77705p8917L53039L68774K02775
1346.1F05275691m9413m49776r96948j415848j555682j621782j667142j450658j238704
1364.5E94829738j477837j827717j927316j690567j258135j066685j204311j419545
1380.8E82957625j651764j596391j209438j242756j921833k645433l084063l295541
1397.1E66310406l514767l715157l905774m069328m034460m054605m086912l960669
1413.4E34968734l803313l547907k886712k025605j407444q24154k91943L14712O54102
1431.8E21150470N29766J005173J692712J161396O18041M42564L72410N21720M75764
$$ y = [614057243, 612550318, 611009538, 609705925, 609038770, 609058321, 609351277, 609583259, 609632254, 609317362, 608502328, 607361555, 606162846, 605107725, 604430020, 604351103, 604704142, 605072916, 605275691, 605226278, 604776502, 603779554, 602363706, 600808024, 599186242, 597519100, 596068442, 594829738, 593351901, 591524184, 589596868, 587906301, 586648166, 585581481, 584377170, 582957625, 581305861, 579709470, 578500032, 577257276, 575335443, 572690010, 569605947, 566310406, 562795639, 559080482, 555174708, 551105380, 547070920, 543016315, 538929403, 534968734, 531165421, 527617514, 524730802, 522705197, 521297753, 520473599, 520181656, 520496368, 521150470, 521680236, 522685409, 524378121, 525539517, 526157558, 526600122, 526972532, 527494252, 527970016]
1450.1E27970016Q4400j10864Q67605K324998J633942Q05259J026094J229286Q34525
1468.5E36665261J012862K302169K873063K139271J480877J027107O03915R9718j76847
1486.8E48027396j311J07348l77655o69837k68638L3378l33726r43065j000404j5795
1507.2E44557691N0246p20799j083433j033247o12318j64807M08947N15700K12669
1525.6E42130649K53677n5432l10182M2617j85549o03795O83009K214611J970589J632631
1546E47772825J358151J464725J576602J261711P46012J917303L485500J240373m2438
1564.3E60780764j46687k14816l29196j057625j526534j149953j145959j593768j785398
1582.7E51830828j909017k150596k382099k525628k546072k569973k604306k584279
$$ y = [527970016, 528054416, 527943552, 528811157, 531136155, 532770097, 533575356, 534601450, 535830736, 536665261, 537678123, 539980292, 542853355, 544992626, 546473503, 547500610, 548104525, 548204243, 548027396, 548026085, 548133433, 547755778, 547085941, 546817303, 546850681, 546516955, 545573890, 544573486, 544557691, 544607937, 543887138, 542803705, 541770458, 541158140, 540993333, 541402280, 541917980, 542130649, 542384326, 542328894, 542018712, 542061329, 541875780, 541271985, 541954994, 544169605, 546140194, 547772825, 549130976, 550595701, 552172303, 553434014, 554180026, 556097329, 559582829, 560823202, 560780764, 560634077, 560419261, 560090065, 559032440, 557505906, 556355953, 555209994, 553616226, 551830828, 549921811, 547771215, 545389116, 542863488, 540317416, 537747443, 535143137, 532558858]
1599E32558858k529800k483427k455294k367795k250015k282620k468228k338708j871943
1617.4E11511028j827777k001762j768947j485824j368106j203894j248062j053601
1633.7D99553055N5551P11352K74360R2745J71125R77993J623511N97656J097202L644407
1654.1E08798957K626002J426339J858771K864897L234804K449214K801120L937066
1670.4E29997170L438711L537178M217625L397167K593517L481924O148041N582153
1686.7E62393486M019857M246235L888368M642606N770326O007254P385075N698085
1703F04051292M429102N009234M224837L142953K486586K554596L893137L896534K236903
1721.4F35925174J760304J888096J541972J138270R58622K235770K889216J570463
$$ y = [532558858, 530029058, 527545631, 525090337, 522722542, 520472527, 518189907, 515721679, 513382971, 511511028, 509683251, 507681489, 505912542, 504426718, 503058612, 501854718, 500606656, 499553055, 499608606, 500319958, 500594318, 500687063, 500858188, 501836181, 503459692, 504057348, 505154550, 508798957, 511424959, 512851298, 514710069, 517574966, 520809770, 523258984, 526060104, 529997170, 533435881, 536973059, 541190684, 544587851, 547181368, 550663292, 556811333, 562393486, 566413343, 570659578, 574547946, 579190552, 584960878, 590968132, 598353207, 604051292, 608480394, 613489628, 617714465, 620857418, 623344004, 625898600, 629791737, 633688271, 635925174, 637685478, 639573574, 641115546, 642253816, 643212438, 645448208, 648337424, 649907887]
1737.7F49907887J901686K833665K894401L020883L471672M519463M941285L729820
1754F77220762L260791L419221L059029L227770K729476J764417J531779J613200K349675
1772.4G00176120K332151J161396P59363J051128J138985J057446Q58605L82722O17921
1790.7G09535837J622915J415074O45578P38979J269221J363814J018643Q14498Q96692
1809.1G19321251J143277J123607Q76903Q03590P90298N82636N12003O67632N39660
1827.4G26360857Q03471J111925N51402K93732N39601L17216o9380N45025J147449
1845.8G31601298N96404K59221K97188L05534K86638K56241K79248K58982M470k00272
1866.2G33944952L52741R16540M92931N6386O3956J77562K30849J74164Q2076J0371
$$ y = [649907887, 651809573, 654643238, 657537639, 660558522, 664030194, 668549657, 673490942, 677220762, 680481553, 683900774, 686959803, 690187573, 692917049, 694681466, 696213245, 697826445, 700176120, 702508271, 703669667, 704429030, 705480158, 706619143, 707676589, 708535194, 708917916, 709535837, 711158752, 712573826, 713219404, 713958383, 715227604, 716591418, 717610061, 718424559, 719321251, 720464528, 721588135, 722465038, 723268628, 724058926, 724641562, 725153565, 725821197, 726360857, 727164328, 728276253, 728827655, 729121387, 729660988, 729978204, 729908824, 730453849, 731601298, 732197702, 732456923, 732754111, 733059645, 733346283, 733602524, 733881772, 734140754, 734145224, 733944952, 734297693, 735214233, 735707164, 735763550, 735827506, 736005068, 736235917, 736410081, 736492157, 736502528]
1886.6G36502528J77026L59178J64508J48714K65717J13011L9041J32799J38939M2736
1907G38084197R3699K46107R5844k29477o4672K51592J11639Q0943R4414j1086K4855
1929.4G38778055K8968j2041M113l2842j84953r4652J80602J28090n7399j09375r0360
1951.9G38538206o0797o5804q7618o5148q1063j71840j39057J3947J0967j10090j50322
1974.3G37631381j02222m0055o2525j19209j47522j82092k32518j55747J8001l8564
1994.7G36568928j78933j66774j48654j62006j57594j41561j31846j66952k35200k63870
2015.1G34815538j76549j20223k08556k56121k23995j95443k00630k13682k03669k07782
2035.5G32808888k40505k34842j66774j44064j83225k09510k17021k13325j69217j23859
$$ y = [736502528, 736679554, 737038732, 737203240, 737351954, 737617671, 737730682, 737769723, 737902522, 738041461, 738084197, 738177896, 738424003, 738519847, 738290370, 738225698, 738477290, 738588929, 738669872, 738764286, 738753200, 738778055, 738807023, 738794982, 738799095, 738766253, 738581300, 738486648, 738667250, 738795340, 738737941, 738628566, 738538206, 738477409, 738411605, 738323987, 738258839, 738177776, 738005936, 737866879, 737880826, 737891793, 737781703, 737631381, 737529159, 737489104, 737426579, 737307370, 737159848, 736977756, 736745238, 736589491, 736607492, 736568928, 736389995, 736223221, 736074567, 735912561, 735754967, 735613406, 735481560, 735314608, 735079408, 734815538, 734638989, 734518766, 734310210, 734054089, 733830094, 733634651, 733434021, 733220339, 733016670, 732808888, 732568383, 732333541, 732166767, 732022703, 731839478, 731629968, 731412947, 731199622, 731030405, 730906546]
2055.9G30906546j36077j86622k37942k13087j31011j17600j68741j78098j52528j54794
2076.3G29230046j85311k03311j87218j68979j88947k28226k16186j64211j59383k04086
2096.7G27324188k18749k09749k06292j88887j79767k03670k55942k59220k03789k03252
2117.1G25194871k39074k26557k02894j76668j65701j87636j63138j24454j46210j80781
2137.5G23381758j61052j14918j00434j15633j08063p2777q2433j27018j05917n7340
2157.9G22336173r5129j28865p4923m1068p2360r4235o7830n0068q6784j07587m4763
2180.3G21472561m589o7294r7036o139M0411n0485j16527q5950n1558p4744r9897n7340
2204.8G20801413k5690o0021r4653j00493r0301j06812j38342j09494q5771j28388
$$ y = [730906546, 730770469, 730583847, 730345905, 730132818, 730001807, 729884207, 729715466, 729537368, 729384840, 729230046, 729044735, 728841424, 728654206, 728485227, 728296280, 728068054, 727851868, 727687657, 727528274, 727324188, 727105439, 726895690, 726689398, 726500511, 726320744, 726117074, 725861132, 725601912, 725398123, 725194871, 724955797, 724729240, 724526346, 724349678, 724183977, 723996341, 723833203, 723708749, 723562539, 723381758, 723220706, 723105788, 723005354, 722889721, 722781658, 722708881, 722626448, 722499430, 722393513, 722336173, 722241044, 722112179, 722037256, 721996188, 721923828, 721829593, 721761763, 721711695, 721624911, 721517324, 721472561, 721467972, 721400678, 721303642, 721297503, 721337914, 721287429, 721170902, 721084952, 721033394, 720958650, 720858753, 720801413, 720775723, 720715702, 720621049, 720520556, 720430255, 720323443, 720185101, 720075607, 719989836, 719861448]
2225.2G19861448j43469j10983r0063j13606j73510j71482j07110j16884j67191j13726
2245.6G18553424k4736p2837j68383j34051n8889r1076j61469j28091l2961l9458j25170
2268G17516303j30236o5208m5359p5876r1553q2195j37508k51233k67208j99497k11358
2290.4G15959072k78473k84254k62201l04103l84092m24207m39465n08904n76794n03183
2310.8G11993396l72588m66287p53999q29578n82099l33786l90052n83947m25518q4460
2331.2G07171082j92105m97043m03822n5790K43604R15468J456022j93417k430260
2349.6G06013739k765596j503408m66227m9115K61546N50806Q63552J053632J062989
2367.9G05021918J013934R23992Q07762O41048M27782K39373N2213j25527k26319k24292
$$ y = [719861448, 719717979, 719606996, 719516933, 719403327, 719229817, 719058335, 718951225, 718834341, 718667150, 718553424, 718528688, 718455851, 718287468, 718153417, 718094528, 718003452, 717841983, 717713892, 717680931, 717641473, 717516303, 717386067, 717320859, 717275500, 717199624, 717108071, 717025876, 716888368, 716637135, 716369927, 716170430, 715959072, 715680599, 715396345, 715134144, 714830041, 714445949, 714021742, 713582277, 713073373, 712496579, 711993396, 711620808, 711154521, 710400522, 709570944, 708988845, 708655059, 708265007, 707681060, 707255542, 707171082, 706978977, 706481934, 706078112, 706022322, 706265926, 707181394, 708637416, 708443999, 706013739, 703248143, 701744735, 701278508, 701229393, 701490939, 702041745, 702905297, 703958929, 705021918, 706035852, 706959844, 707767606, 708408654, 708836436, 709075809, 709128022, 709002495, 708776176, 708551884]
2388.3G08551884k08557k45213k79606k44617k00153k41995k90334k47538j94788k46107
2408.7G06152976l05951k60055k13444k72692l41951l26932k88665k92838l17812l10421
2429.1G03222215k90394l23355l79741l52502k69234k68996l63052l89933l09468l07977
2449.5F99967563l92556m02331l52621l52622m07874m40419m14550l99530m50730m81189
2469.9F95873141m42922m37736n13554n78046n56826n30959n85138o10948n37276n06044
2490.3F90573692n81860o30319n60642m98533n36680n60939n03302m69089n26309n76675
2510.7F85129344n42402n10871n46456n33521m16159l39032l85463m42803l80158k78294
2531.1F80754185k69771l16977l17455k57492k66492l75509l96133l07441l07738l63648
$$ y = [708551884, 708343327, 708098114, 707818508, 707573891, 707373738, 707131743, 706841409, 706593871, 706399083, 706152976, 705847025, 705586970, 705373526, 705100834, 704758883, 704431951, 704143286, 703850448, 703532636, 703222215, 702931821, 702608466, 702228725, 701876223, 701606989, 701337993, 700974941, 700585008, 700275540, 699967563, 699575007, 699172676, 698820055, 698467433, 698059559, 697619140, 697204590, 696805060, 696354330, 695873141, 695430219, 694992483, 694478929, 693900883, 693344057, 692813098, 692227960, 691617012, 691079736, 690573692, 689991832, 689361513, 688800871, 688302338, 687765658, 687204719, 686701417, 686232328, 685706019, 685129344, 684586942, 684076071, 683529615, 682996094, 682579935, 682240903, 681855440, 681412637, 681032479, 680754185, 680484414, 680167437, 679849982, 679592490, 679325998, 678950489, 678554356, 678246915, 677939177, 677575529]
2551.5F77575529l25680k67983l02791m00126m33564l63946l26217l61919l72350l66807
2571.9F74054146m00365m39286m44293m13716l94940m38571m82738m62711m49657m88162
2592.3F69639707m99130m59790m45008m86791n15700m63664m18663m53711m83453m84467
2612.7F64929330m94182n12480n51165n36024m38392m22240n14745n65827n24462m84645
2633.1F59885168n28335n71907n23508m85956n40376n96285n74648n21362n53906o38127
2653.5F54350758o06418n41270n85437o21795n57483n14626n87344o45399n76496n29647
2673.9F48584843n84245o19769n97119n77569o03378o33836o11127n77807o12318o56248
2694.3F42511427n93960n32389n84423o22213n60284n05924n69284o49869o15478n41389
$$ y = [677575529, 677249849, 676981866, 676679075, 676278949, 675845385, 675481439, 675155222, 674793303, 674420953, 674054146, 673653781, 673214495, 672770202, 672356486, 671961546, 671522975, 671040237, 670577526, 670127869, 669639707, 669140577, 668680787, 668235779, 667748988, 667233288, 666769624, 666350961, 665897250, 665413797, 664929330, 664435148, 663922668, 663371503, 662835479, 662397087, 661974847, 661460102, 660894275, 660369813, 659885168, 659356833, 658784926, 658261418, 657775462, 657235086, 656638801, 656064153, 655542791, 654988885, 654350758, 653744340, 653203070, 652617633, 651995838, 651438355, 650923729, 650336385, 649690986, 649114490, 648584843, 648000598, 647380829, 646783710, 646206141, 645602763, 644968927, 644357800, 643779993, 643167675, 642511427, 641917467, 641385078, 640800655, 640178442, 639618158, 639112234, 638542950, 637893081, 637277603, 636736214]
2714.6F36736214n29885n62966n34654m47333m37974n01574n08725m33803l84450m19914
2735F31974936m58062m15683l68714m07994m35710l74854l40163m04239m64857m31060
2755.4F27873600l89457m49717n25773n23150m88162m85897n11289m94778m63962n20945
2775.8F23020470o12378o21319o07788o60301o98149o48498o26326p16150p85649p61211
2796.2F16282701p42793q03232q83162q92460q54373q58307r39786j001001r83536
2814.6F08324051j024842j134336j177729j206874j304627j426220j537204j624643
2830.9E97887576j716495j912355k215863k571046l009140l497601l890097l950060
2847.2E75124919l408372k310872j105547k20895J89901J49011j44601m56631p43210
$$ y = [636736214, 636206329, 635643363, 635108709, 634661376, 634223402, 633721828, 633213103, 632779300, 632394850, 631974936, 631516874, 631101191, 630732477, 630324483, 629888773, 629513919, 629173756, 628769517, 628304660, 627873600, 627484143, 627034426, 626508653, 625985503, 625497341, 625011444, 624500155, 624005377, 623541415, 623020470, 622408092, 621786773, 621178985, 620518684, 619820535, 619172037, 618545711, 617829561, 617043912, 616282701, 615539908, 614736676, 613853514, 612961054, 612106681, 611248374, 610308588, 609307587, 608324051, 607299209, 606164873, 604987144, 603780270, 602475643, 601049423, 599512219, 597887576, 596171081, 594258726, 592042863, 589471817, 586462677, 582965076, 579074979, 575124919, 571716547, 569405675, 568300128, 568079233, 568269134, 568418145, 568273544, 567816913, 567073703]
2865.6E67073703r61542r49622o85989m22061l42846l73244m47512o19292q86261j134217
2886E60251117j316250j453280j513004j469374j369894j291930j257897j263857j339197
2904.3E47976434j521468j815855k185345k563417k839267k838016k475858j869321
2920.6E29867887j187324n34415P0095N54085Q27908J025498J270413J448214J449705
2939E34792066J323044J144051R09210N46455P4148l16143m89354m59134k53201R7811
2959.4E37368953N25654Q92937J063168J075983J087904J180291J296818J350045J352072
2977.8E47193825J312793J201987J062333R31621P88867O19889M45544L08812J79947
2996.1E54045618k0504k63274m16219m77672n58734o13630n67496n00619m75585m60506
$$ y = [567073703, 566112161, 565162539, 564476550, 564054489, 563711643, 563338399, 562890887, 562271595, 561385334, 560251117, 558934867, 557481587, 555968583, 554499209, 553129315, 551837385, 550579488, 549315631, 547976434, 546454966, 544639111, 542453766, 539890349, 537051082, 534213066, 531737208, 529867887, 528680563, 528146148, 528216243, 528770328, 529598236, 530623734, 531894147, 533342361, 534792066, 536115110, 537259161, 538168371, 538714826, 538788974, 538472831, 537983477, 537524343, 537271142, 537368953, 537894607, 538787544, 539850712, 540926695, 542014599, 543194890, 544491708, 545841753, 547193825, 548506618, 549708605, 550770938, 551702559, 552491426, 553111315, 553556859, 553865671, 554045618, 554025114, 553761840, 553345621, 552867949, 552309215, 551695585, 551128089, 550627470, 550151885, 549691379]
3016.5E49691379m49717m95911o00695p06077p88271p95603p23541p16686q14438q93712
3036.9E42706728q83341q61108r12309r76980r97483r63390r07958r01580r12964r28998
3057.3E33460617r42469r09149q67129q37028q24451q43346q37028q17538q04364p47204
3077.7E25030911p44522q28087q42035q03113p85947q01742q51154q22663p35283p26700
3098.1E17089665p64132p99715q12471p78079p77483q38280q49783p93278q03531r23514
3118.5E08949399j035869j065552j018942r40442r27746r90510j002252r52244r20832
3136.8E00095010r64672j080483j123339j075208j058727j048863j009018j047372
3153.2D91687328j163960j187205j119852j089365j105845j134276j144558j130372
$$ y = [549691379, 549241662, 548745751, 548145056, 547438979, 546650708, 545855105, 545131564, 544414878, 543600440, 542706728, 541823387, 540962279, 540049970, 539072990, 538075507, 537112117, 536204159, 535302579, 534389615, 533460617, 532518148, 531608999, 530741870, 529904842, 529080391, 528237045, 527400017, 526582479, 525778115, 525030911, 524286389, 523458302, 522616267, 521813154, 521027207, 520225465, 519374311, 518551648, 517816365, 517089665, 516325533, 515525818, 514713347, 513935268, 513157785, 512319505, 511469722, 510676444, 509872913, 508949399, 507913530, 506847978, 505829036, 504888594, 503960848, 502970338, 501968086, 501015842, 500095010, 499130338, 498049855, 496926516, 495851308, 494792581, 493743718, 492734700, 491687328, 490523368, 489336163, 488216311, 487126946, 486021101, 484886825, 483742267, 482611895]
3169.5D82611895j111210j103550j120538j129657j158714j205087j155227j080185
3185.8D73547727j100183j155108j195699j211375j160741j103818j132935j133234
3202.1D64354634j069665j123339j209288j138568j059175j092613j134842j103431
3218.4D55423713j063526j120746j218140j196563j060755r65774r56922j003713j040309
3236.8D45797265j030416j025408r86248q60245q12798r35227j001775r10431q18551
3255.1D37416166q58962r46373r28074q36283q12650q46833p84308p33524q23289r08763
3275.5D28937107r08613q71390q36253q03590p64012p26134p05004p03036p34419p86215
3295.9D21098441q41797q76009q15153p18713p47204q95500j015752r91941q97467
$$ y = [482611895, 481500685, 480397135, 479276597, 478146940, 476988226, 475783139, 474627912, 473547727, 472447544, 471292436, 470096737, 468885362, 467724621, 466620803, 465487868, 464354634, 463284969, 462161630, 460952342, 459813774, 458754599, 457661986, 456527144, 455423713, 454360187, 453239441, 452021301, 450824738, 449763983, 448798209, 447841287, 446837574, 445797265, 444766849, 443741441, 442755193, 441894948, 441082150, 440146923, 439145148, 438234717, 437416166, 436557204, 435610831, 434682757, 433846474, 433033824, 432186991, 431402683, 430669159, 429845870, 428937107, 428028494, 427157104, 426320851, 425517261, 424753249, 424027115, 423322111, 422619075, 421884656, 421098441, 420256644, 419380635, 418565482, 417846769, 417099565, 416204065, 415188313, 414196372, 413298905]
3314.3D13298905q95321r50426j000464j045019j070082j132309j195193j216918j230389
3332.6D03562784j192897j116902j160592j306265j325697j254410j181334j053095
3348.9C93971592r75787j017213j028329r62854r28759r32992q91834p50363o48797
3367.3C85834664p92593j043528j060843q92044p69317p20292p63685p67022o62684
3385.7C78362656n92262n40644n26398o54251o82413m49300l53247n78612p74324o86139
3406.1C72525066m73052l64393l78251m04507l74973k92540j90585j58728j97291j35183
3426.5C69555563N0634J22666Q3983R1106J3113j77741j78009N513J69575L62694L98636
3448.9C70497733K64228K74181L72350M64708N58913N27441M70668O34134Q18610O61224
$$ y = [413298905, 412403584, 411453158, 410452694, 409407675, 408337593, 407205284, 406010091, 404793173, 403562784, 402369887, 401252985, 400092393, 398786128, 397460431, 396206021, 395024687, 393971592, 392995805, 391978592, 390950263, 389987409, 389058650, 388125658, 387233824, 386483461, 385834664, 385042071, 383998543, 382937700, 382045656, 381276339, 380556047, 379792362, 379025340, 378362656, 377770394, 377229750, 376703352, 376049101, 375366688, 374917388, 374564141, 373985529, 373211205, 372525066, 372052014, 371687621, 371309370, 370904863, 370529890, 370237350, 370046765, 369888037, 369690746, 369555563, 369606197, 369728863, 369812846, 369903952, 369917065, 369739324, 369561315, 369566828, 369736403, 370099097, 370497733, 370761961, 371036142, 371408492, 371873200, 372432113, 372959554, 373430222, 374064356, 374882966, 375544190]
3469.3C75544190L84033L78162N56379O88613P28011P63178P64847P36653P60526P61926
3489.7C82066518P46727Q40724R67353Q60095P52419J049281J172572P37995O51419
3508C89845103J079470J257837J057327Q83847Q98331R91375J207918J292169J149982
3526.4C99663359J215756J278996J132787J226335J423568J243323J029253J218379
3542.7D09431756J692116J856029J344859J166195J621932J572937J250058J379550
3559D21315432J365870Q53717J327068L218412L211528J402974R92954J612008J906723
3577.4D37206686J923084J632243J078636J622677L474861L243536J361459J475096
3593.7D53018278K481311K461434K405196K389252J532406J307726K694070L247738
$$ y = [375544190, 375928223, 376306385, 376862764, 377551377, 378279388, 379042566, 379807413, 380544066, 381304592, 382066518, 382813245, 383653969, 384621322, 385481417, 386233836, 387283117, 388455689, 389193684, 389845103, 390924573, 392182410, 393239737, 394123584, 395021915, 396013290, 397221208, 398513377, 399663359, 400879115, 402158111, 403290898, 404517233, 405940801, 407184124, 408213377, 409431756, 411123872, 412979901, 414324760, 415490955, 417112887, 418685824, 419935882, 421315432, 422681302, 423535019, 424862087, 428080499, 431292027, 432695001, 433687955, 435299963, 437206686, 439129770, 440762013, 441840649, 443463326, 446938187, 450181723, 451543182, 453018278, 455499589, 457961023, 460366219, 462755471, 464287877, 465595603, 468289673, 471537411]
3610D71537411K539724K071053J483172K578974M286975K605766J18673M47541N147576
3628.4D92816865P052571K864212J653790K345741K321661K319216J615227L44157
3644.7E13333440J462161O295264P237375J872659N85138L575147L355145J571238
3661E39287567J321912N04255R9778K884806L770291R25184L770053N522132J172900
3679.4E59258878m04596p81298j389503Q54134M403770K914846l74079r85264m83930
3697.7E63012958N84006K508521K108037n22255r34482J858771M793703K476454j226723
3716.1E74658990j504660k08437O42240R28163Q38042q06451k084792k85864K997816
3734.4E75175047L929675K92420m040062k489090L793776J929104j681507K891183
$$ y = [471537411, 474077135, 476148188, 477631360, 480210334, 484497309, 487103075, 487221748, 487669289, 492816865, 499869436, 502733648, 504387438, 506733179, 509054840, 511374056, 512989283, 513333440, 514795601, 521090865, 528328240, 530200899, 530786037, 534361184, 537716329, 539287567, 540609479, 541113734, 541213512, 544098318, 547868609, 548793793, 552563846, 558085978, 559258878, 558854282, 558072984, 556683481, 557537615, 561941385, 564856231, 564482152, 563496888, 563012958, 563596964, 566105485, 568213522, 567691267, 566756785, 568615556, 573409259, 575885713, 574658990, 573154330, 572945893, 573588133, 574516296, 575354338, 574547887, 572463095, 572177231, 575175047, 579104722, 579397142, 575357080, 572867990, 576661766, 578590870, 576909363, 579800546]
3750.7E79800546L906667j066565k176702M38928J041890r23694q67962K19226J234889
3769.1E81607223J696050k48909j734555p47681J235962R70483l92556M4286K41041
3787.5E82671344l33726q20220j180231m43638m61876k46584K593696J063108o80744
3805.8E82161129J586735k08795l322423k171218J282215O37114M41074L015876J85073
3824.2E83606780j870931j125216r91702o21200p74026J96398K534747J649797o3837
3842.5E82540810l32951j879752m217386l842116L705383Q615195L14057m311681k891063
3860.9E77700496j19925R47356q18014q9526K065599O71685p49767j919627j122773
3879.2E76565504Q29279J5796P91073N22315j453400M06444P91789k141715k319157
$$ y = [579800546, 583707213, 582640648, 580463946, 580902874, 581944764, 581021070, 580153108, 580372334, 581607223, 583303273, 583054364, 581319809, 580572128, 581808090, 582778573, 582386017, 582430303, 582671344, 582337618, 581517398, 580337167, 579893529, 579431653, 579185069, 581778765, 582841873, 582161129, 583747864, 583539069, 580216646, 578045428, 579327643, 579964757, 580405831, 583421707, 583606780, 581735849, 580610633, 579618931, 578997731, 578223705, 578420103, 580954850, 582604647, 582540810, 582207859, 580328107, 576110721, 572268605, 575973988, 584589183, 584903240, 580591559, 577700496, 577580571, 578527927, 577709913, 577620387, 579685986, 580357671, 579607904, 577688277, 576565504, 577394783, 577410579, 578201652, 578723967, 577270567, 577677011, 578468800, 576327085, 574007928]
3897.6E74007928M9115J616597K225339J360297r33945j714110j228690j080454k03550
3915.9E74098527R93789M49538o11305k55466O7711p00593m48048Q11458N37037o82532
3936.3E74260116j027584o00696K22206K17557m27425q4937K55108j51753l73721k82228
3956.7E72006643k28822r6620R656j96755l44872k36332j34468p6354Q106r1791k60949
3979.2E70357442j62125l1769j50859k83420k09749j36733j35541j08838j97888
3997.5E68940520
$$ y = [574007928, 574057043, 575673640, 577898979, 579259276, 578325331, 576611221, 575382531, 574302077, 574098527, 575092316, 575541854, 574930549, 574675083, 574742794, 574042201, 573594153, 574405611, 574942648, 574260116, 573232532, 572631836, 572854042, 573071599, 572644174, 572559237, 572814345, 572662592, 572288871, 572006643, 571777821, 571681201, 571690857, 571494102, 571149230, 570912898, 570778430, 570702076, 570710182, 570618391, 570357442, 570195317, 570163548, 570012689, 569729269, 569519520, 569382787, 569247246, 569138408, 568940520]
##END=$$ End of the data block
