##TITLE=$$ Begin of the data block
##JCAMP-DX=5.00 $$ ACD/SpecManager v 10.08
##SPECTROMETER/DATA SYSTEM=Alpha
##DATE=11 Jun 2014 19:36:16
##DATA TYPE=INFRARED SPECTRUM
##DATA CLASS=XYDATA
##ORIGIN=
##OWNER=
##NPOINTS=1765
##FIRSTX=399.75695801
##LASTX=3997.56933594
##MAXX=3997.56933594
##MINX=399.75695801
##MAXY=0.74171335
##MINY=0.37037930
##XFACTOR=1.0000000000
##YFACTOR=1.000000000000000e-9
##FIRSTY=0.62835175
##DELTAX=2.03957629
##XUNITS=1/CM
##YUNITS=ARBITRARY UNITS
##XYDATA=(X++(Y..Y))
$$ plain form
399.8 628351748 629583418 630056024 630137205 630690336 631428421 631533325 630980253 630173802 629557192 629055619
420.2 629055619 628529251 628062665 627261221 626259506 625543892 625082672 624772012 624659240 624473453 623732090
440.5 623732090 622615218 621921182 621679187 621222079 620368958 619307339 618197560 617041886 615952313
458.9 615952313 615037501 613979161 612781525 611800969 611165345 610874832 611033738 611618578 612383723
477.3 612383723 613046288 613421857 613709629 614106297 614498377 614861727 615252078 615543246 615481615 615126789
497.7 615126789 614815354 614586234 614140928 613462269 612950146 612579107 611792445 610677421 609974504 609671354
518.1 609671354 609232187 608745992 608414054 608202875 607889056 607316256 606887281 606842637 606714189 606326401
538.4 606326401 606204748 606465876 606559694 606318653 606260538 606576920 606585383 606008053 605632901 605969965
$$ packed form
399.8F28351748J231670M72606Q1181N53131P38085J04904n53072q06451o16610n01573
420.2F29055619n26368m66586q01444j001715p15614m61220l10660j12772j85787p41363
440.5F23732090j116872o94036k41995m57108q53121j061619j109779j155674j089573
458.9F15952313r14812j058340j197636r80556o35624k90513J58906N84840P65145
477.3F12383723O62565L75569K87772L96668L92080L63350L90351K91168o1631l54826
497.7F15126789l11435k29120m45306o78659n12123l71039p86662j115024p02917l03150
518.1F09671354m39167m86195l31938k11179l13819n72800m28975m4644j28448l87788
538.4F06326401j21653K61128R3818k41041n8115L16382Q463n77330l75152L37064
$$ plain form
558.8 605969965 606605411 607178211 607878149 608707786 609206080 609210372 609275162 609709322 609874368 609426737
579.2 609426737 609162748 609565079 609800160 609462500 609462738 610032499 610169709 609582484 609168112 609337032
599.6 609337032 609270751 608569145 608070314 607973218 607428789 606428444 605903089 606030583 606129467 606132925
620 606132925 606787443 608125746 609118998 609465480 610136747 611529112 612683952 613136470 613744974 614919126
640.4 614919126 615899563 616243303 616601169 617351055 617768288 617424548 617041171 617074430 616787016 615799963
660.8 615799963 615010202 614756286 614306450 614005327 614848197 616203010 617379904 617976069 618646204
679.2 618646204 619920492 621068060 621490717 621857345 622807622 623642266 623645782 623473227 623844504 624591708
699.6 624591708 625472665 626551032 627733946 628199041 627304494 626336157 627223194 629310250 630650222
$$ packed form
558.8F05969965O35446N72800O99938Q29637M98294M292O4790M34160J65046m47631
579.2F09426737k63989M02331K35081l37660K38N69761J37210n87225m14372J68920
599.6F09337032o6281p01606m98831r7096n44429j000345n25355J27494R8884L458
620F06132925O54518J338303R93252L46482O71267J392365J154840M52518O08504J174152
640.4F14919126R80437L43740L57866P49886M17233l43740l83377L3259k87414r87053
660.8F15799963p89761k53916m49836l01123Q42870J354813J176894N96165O70135
679.2F18646204J274288J147568M22657L66628R50277Q34644L516j72555L71277P47204
699.6F24591708Q80957J078367J182914M65095q94547r68337Q87037K087056J339972
$$ plain form
717.9 630650222 631564796 633286357 635298848 636727095 638038099 639902055 641644120 642379761 642748892
736.3 642748892 643715084 644756854 645076871 645372272 646524429 647929609 648738563 649441004 650771737
754.6 650771737 652201235 652986884 653583109 654685378 655820847 656243145 656428039 657164574 658001602
773 658001602 658135891 658016086 658583641 659575045 660162151 660600960 661561251 662640929 663090527 663318515
793.4 663318515 664132476 665183723 665721476 666088939 666943073 667857170 668099880 668028533 668435335 669053376
813.8 669053376 669303894 669701159 670863271 672351003 673614740 674986064 676930845 679038465 680632770
832.1 680632770 681900442 683229923 684170961 684215128 683887720 683926463 683741748 682348728 679731965
850.5 679731965 676541150 674457192 675255477 678648710 682889938 686364830 688080549 687490344 683831155
$$ packed form
717.9F30650222R14574J721561K012491J428247J311004J863956J742065P35641L69131
736.3F42748892R66192J041770L20017K95401J152157J405180Q08954P02441J330733
754.6F50771737J429498P85649N96225J102269J135469M22298J84894P36535Q37028
773F58001602J34289j19805N67555R91404N87106M38809R60291J079678M49598K27988
793.4F63318515Q13961J051247N37753L67463Q54134R14097K42710p1347M06802O18041
813.8F69053376K50518L97265J162112J487732J263737J371324J944781K107620J594305
832.1F80632770J267672J329481R41038M4167l27408L8743j84715j393020k616763
850.5F79731965l190815k083958P98285L393233M241228L474892J715719n90205l659189
$$ plain form
868.9 683831155 677077234 669899762 666078150 667275071 672655642 679905891 686601579 691539466
885.2 691539466 694448411 695503831 695415914 694704711 693358064 691684723 690301895 689280629 688387752
903.5 688387752 687852740 688012004 688429356 688292980 687584281 686941504 686557412 685990036 684961796 683650970
923.9 683650970 682149470 680289567 678141534 676138759 674540043 673159063 671766877 670357585
940.2 670357585 668907762 667339206 665792942 664626479 663958848 663413703 662550926 661272585 659602165
958.6 659602165 657450616 654882371 652207017 649513781 646569490 643278301 639750779 635992706
974.9 635992706 631846368 627295077 622522712 617648065 612771869 608085811 603769839 599876940
991.2 599876940 596284270 592872381 589721918 586899400 584183455 581319571 578388751 575623572
$$ packed form
868.9F83831155o753921p177472l821612J196921N380571P250249O695688M937887
885.2F91539466K908945J055420q7917p11203j346647j673341j382828j021266q92877
903.5F88387752n35012J59264M17352j36376p08699o42777l84092n67376j028240j310826
923.9F83650970j501500j859903k148033k002775j598716j380980j392186j409292
940.2F70357585j449823j568556j546264j166463o67631n45145q62777j278341j670420
958.6F59602165k151549k568245k675354k693236k944291l291189l527522l758073
974.9F35992706m146338m551291m772365m874647m876196m686058m315972l892899
991.2E99876940l592670l411889l150463k822518k715945k863884k930820k765179
$$ plain form
1007.5 575623572 573056757 570599675 568286180 566127479 563873470 561237216 558229566 555092573
1023.9 555092573 551986933 548901081 545854032 543138385 541367292 541093469 542312562 544401586
1040.2 544401586 546418250 547566831 547639251 546874702 545492291 543671668 541694283 540015936 539328694
1058.5 539328694 540140092 542229235 544908106 547572851 549787879 551340163 552298188 552825928 553052485
1076.9 553052485 553004444 552851737 553201377 554304600 555651844 556992233 558494985 560083210 561521351
1095.2 561521351 562798262 564015627 565099359 565913320 566397846 566534102 566466570 566646814 567607164
1113.6 567607164 569408417 571477294 573253334 574715078 576188982 577993095 580252051 582990766
1129.9 582990766 586132407 589465797 592825174 595989585 598629773 600528777 601690710 602246821
$$ packed form
1007.5E75623572k566815k457082k313495k158701k254009k636254l007650l136993
1023.9E55092573l105640l085852l047049k715647j771093k73823J219093K089024
1040.2E44401586K016664J148581P2420p64549j382411j820623j977385j678347o87242
1058.5E39328694Q11398K089143K678871K664745K215028J552284R58025N27740K26557
1076.9E53052485m8041j52707L49640J103223J347244J340389J502752J588225J438141
1095.2E61521351J276911J217365J083732Q13961M84526J36256o7532J80244R60350
1113.6E67607164J801253K068877J776040J461744J473904J804113K258956K738715
1129.9E82990766L141641L333390L359377L164411K640188J899004J161933N56111
$$ plain form
1146.2 602246821 602212787 601576626 600575149 599446595 598135114 596558809 594995320 594084620 594417155
1164.6 594417155 596142113 599005401 602571368 606425285 610307872 614077091 617637336 620847106
1180.9 620847106 623577595 625856578 627711713 629003942 629621744 629685700 629340529 628574193 627466023
1199.3 627466023 626299620 625238776 624229610 623339117 622828484 622725606 622635603 622224033 621617198
1217.6 621617198 621041298 620399296 619541049 618581116 617671907 616726100 615687370 614827275 614397109
1236 614397109 614204764 613911808 613577843 613363862 613117576 612775743 612608135 612729490 612858713 612764060
1256.4 612764060 612595558 612605512 612745523 612859368 613046110 613469481 614002407 614411414 614735246 615117192
1276.8 615117192 615446389 615662038 616119564 617019892 618032992 618787527 619267583 619643331 619930208
$$ packed form
1146.2F02246821l4034o36161j001477j128554j311481j576305j563489r10700L32535
1164.6E94417155J724958K863288L565967L853917L882587L769219L560245L209770
1180.9F20847106K730489K278983J855135J292229O17802O3956l45171p66336j108170
1199.3F27466023j166403j060844j009166q90493n10633j02878r0003m11570o06835
1217.6F21617198n75900o42002q58247r59933r09209r45807j038730q60095m30166
1236F14397109j92345k92956l33965k13981k46286l41833j67608J21355J29223r4653
1256.4F12764060j68502R954J40011J13845J86742M23371N32926M09007L23832L81946
1276.8F15117192L29197K15649M57526R00328J013100P54535M80056L75748K86877
$$ plain form
1295.1 619930208 619967878 619716227 619276643 618600428 617564082 616252720 614854634 613378644 611846626
1313.5 611846626 610559881 609907508 609911978 610158622 610343516 610391140 610113025 609326839 608184636 606968164
1333.9 606968164 605898201 605220437 605154455 605515778 605874836 606049836 605971932 605496764 604493439 603108406
1354.3 603108406 601575375 599945486 598263144 596812904 595600963 594137967 592300892 590377808
1370.6 590377808 588704109 587444723 586353004 585123897 583705485 582064688 580468714 579252958
1386.9 579252958 578012824 576119721 573492825 570382476 567066967 563573480 559869289 555942833
1403.2 555942833 551866591 547855437 543829381 539769113 535825789 532013476 528454304 525595307
1419.5 525595307 523621917 522255242 521438301 521123707 521409631 522050679 522596419 523629963 525318623
$$ packed form
1295.1F19930208L7670k51651m39584o76215j036346j311362j398086j475990j532018
1313.5F11846626j286745o52373M470K46644J84894M7624k78115p86186j142203j216472
1333.9F06968164j069963o77764o5982L61323L59058J75000p7904m75168j003325j385033
1354.3F03108406j533031j629889j682342j450240j211941j462996j837075j923084
1370.6E90377808j673699j259386j091719j229107j418412j640797j595974j215756
1386.9E79252958j240134j893103k626896l110349l315509l493487l704191l926456
1403.2E55942833m076242m011154m026056m060268l943324l812313l559172k858997
1419.5E25595307j973390j366675q16941l14594K85924O41048N45740J033544J688660
$$ plain form
1437.9 525318623 526435733 527010739 527450979 527853608 528401375 528899610 529002130 528898895 529763699
1456.2 529763699 532074988 533714116 534545481 535592973 536801279 537605047 538642764 540991008 543846965
1474.6 543846965 545951962 547431111 548475146 549100459 549214005 549020290 548974693 549056590 548669398
1493 548669398 548006058 547785878 547847629 547512054 546602428 545642734 545609713 545637727 544927239 543860734
1513.4 543860734 542824626 542182505 541986048 542393088 542949080 543208778 543489873 543455958 543182254 543252826
1533.7 543252826 543067515 542487741 543230832 545478582 547460437 549084842 550420165 551856518 553392589
1552.1 553392589 554646313 555428207 557369411 560848892 562077463 562009633 561810195 561538875 561184287
1570.5 561184287 560103536 558548510 557410538 556269586 554618001 552770853 550838768 548667669
$$ packed form
1437.9E25318623J117110N75006M40240M02629N47767M98235J02520j03235Q64804
1456.2E29763699K311289J639128Q31365J047492J208306Q03768J037717K348244K855957
1474.6E43846965K104997J479149J044035O25313J13546j93715m5597Q1897l87192
1493E48669398o63340k20180O1751l35575r09626r59694l3021K8014p10488j066505
1513.4E43860734j036108o42121j96457M07040N55992K59698K81095l3915k73704P0572
1533.7E43252826j85311n79774P43091K247750J981855J624405J335323J436353J536071
1552.1E53392589J253724P81894J941204L479481J228571o7830j99438k71320l54588
1570.5E61184287j080751j555026j137972j140952j651585j847148j932085k171099
$$ plain form
1586.8 548667669 546256363 543686032 541057646 538413763 535775840 533172250 530625105 528101087
1603.1 528101087 525560558 523091376 520751297 518385291 515821934 513366759 511403561 509534001
1619.4 509534001 507497370 505691588 504169941 502774000 501552105 500283480 499206960 499253631 499979943
1637.8 499979943 500293195 500447273 500679135 501728952 503456473 504138410 505322576 509104490 511809409
1656.1 511809409 513265073 515161395 518081129 521384954 523915708 526813090 530830741 534312487
1672.4 534312487 537906289 542193651 545626342 548236966 551767766 558034301 563706458 567745447
1688.8 567745447 571996331 575893044 580558538 586382985 592484772 599978149 605720937 610157311
1705.1 610157311 615188658 619448066 622626960 625161588 627776682 631727457 635661423 637913704
$$ packed form
1586.8E48667669k411306k570331k628386k643883k637923k603590k547145k524018
1603.1E28101087k540529k469182k340079k366006k563357k455175j963198j869560
1619.4E09534001k036631j805782j521647j395941j221895j268625j076520M6671P26312
1637.8D99979943L13252J54078K31862J049817J727521O81937J184166L781914K704919
1656.1E11809409J455664J896322K919734L303825K530754K897382M017651L481746
1672.4E34312487L593802M287362L432691K610624L530800O266535N672157M038989
1688.8E67745447M250884L896713M665494N824447O101787P493377N742788M436374
1705.1F10157311N031347M259408L178894K534628K615094L950775L933966K252281
$$ plain form
1721.4 637913704 639672935 641548514 643089771 644256175 645258486 647536576 650434315 651986182
1737.7 651986182 653892934 656748950 659641683 662654996 666154206 670734107 675728381 679491341
1754 679491341 682771325 686180174 689223945 692464054 695206881 696982384 698530674 700161755 702555597
1772.4 702555597 704936326 706109047 706867754 707926750 709050715 710081220 710943818 711335719 711953878
1790.7 711953878 713618517 715090752 715746939 716466844 717715144 719081581 720126212 720951378 721833766
1809.1 721833766 722970843 724102080 724978983 725796103 726619065 727214515 727725506 728408515 728970051
1827.4 728970051 729799867 730939984 731504440 731798708 732323647 732622981 732544482 733091593 734263599
1845.8 734263599 734879613 735122621 735399961 735728800 736043394 736283541 736535370 736802936 736846507 736674249
$$ packed form
1721.4F37913704J759231J875579J541257J166404J002311K278090K897739J551867
1737.7F51986182J906752K856016K892733L013313L499210M579901M994274L762960
1754F79491341L279984L408849L043771L240109K742827J775503J548290J631081K393842
1772.4G02555597K380729J172721P58707J058996J123965J030505Q62598L91901O18159
1790.7G11953878J664639J472235O56187P19905J248300J366437J044631Q25166Q82388
1809.1G21833766J137077J131237Q76903Q17120Q22962N95450N10991O83009N61536
1827.4G28970051Q29816J140117N64456K94268N24939K99334p8499N47111J172006
1845.8G34263599O16014K43008K77340L28839L14594K40147K51829K67566M3571j72258
$$ plain form
1866.2 736674249 737028480 737933040 738416851 738490701 738591552 738781810 738995135 739159644 739255309 739277840
1886.6 739277840 739441574 739782453 739946604 740101457 740383923 740525901 740581155 740720272 740873456 740927696
1907 740927696 741017282 741246760 741332591 741122007 741109312 741405725 741508842 741559088 741664946 741693079 741709173
1929.4 741709173 741694987 741682291 741713345 741683543 741473258 741365135 741565168 741711915 741656542 741533935
1949.8 741533935 741440535 741399288 741341591 741248608 741192281 741132438 740977705 740853429 740874767 740876555 740769088
1972.3 740769088 740645587 740544736 740466535 740381420 740269303 740138352 739979267 739750862 739584267 739620686
1992.6 739620686 739612043 739437640 739264429 739135385 739003062 738839805 738649964 738467991 738309264 738114953
2013 738114953 737895072 737767637 737647712 737402439 737142324 736941993 736760080 736570001 736350477 736120164
$$ packed form
1866.2G36674249L54231R04560M83811P3850J00851J90258K13325J64509R5665K2531
1886.6G39277840J63734L40879J64151J54853K82466J41978N5254J39117J53184N4240
1907G40927696Q9586K29478Q5831k10584j2695K96413J03117N0246J05858K8133J6094
1929.4G41709173j4186j2696L1054k9802k10285j08123K00033J46747n5373j22607
1949.8G41533935r3400m1247n7697r2983n6327n9843j54733j24276K1338J788j07467
1972.3G40769088j23501j00851p8201q5115j12117j30951j59085k28405j66595L6419
1992.6G39620686q643j74403j73211j29044j32323j63257j89841j81973j58727j94311
2013G38114953k19881j27435j19925k45273k60115k00331j81913j90079k19524k30313
$$ plain form
2033.4 736120164 735918164 735703647 735468984 735293388 735153079 734979093 734773219 734588563 734465301 734367371
2053.8 734367371 734222770 734019935 733804286 733584046 733388066 733252704 733127892 732969999 732809961 732659876
2074.2 732659876 732506394 732352853 732179880 731972218 731763780 731573880 731400669 731248200 731083930 730876267
2094.6 730876267 730667531 730501592 730331421 730120838 729922056 729755521 729550898 729276299 729023516 728850842
2115 728850842 728679061 728439748 728180587 727973580 727819800 727663875 727497220 727360189 727231264 727075577
2135.4 727075577 726923645 726812720 726719856 726616204 726493239 726371944 726289630 726209342 726091027 725989878
2155.8 725989878 725924790 725828469 725716293 725669384 725658596 725599349 725516558 725476265 725446999 725365520 725263178
2178.2 725263178 725220442 725217044 725181162 725133538 725135624 725151420 725095332 724992812 724925041 724878132 724799693 724712908
$$ packed form
2033.4G36120164k02000k14517k34663j75596j40309j73986k05874j84656j23262r7930
2053.8G34367371j44601k02835k15649k20240j95980j35362j24812j57893j60038j50085
2074.2G32659876j53482j53541j72973k07662k08438j89900j73211j52469j64270k07663
2094.6G30876267k08736j65939j70171k10583j98782j66535k04623k74599k52783j72674
2115G28850842j71781k39313k59161k07007j53780j55925j66655j37031j28925j55687
2135.4G27075577j51932j10925r2864j03652j22965j21295q2314q0288j18315j01149
2155.8G25989878o5088r6321j12176m6909j0788n9247q2791m0293k9266q1479j02342
2178.2G25263178m2736l398l5882m7624K086J5796n6088j02520o7771m6909p8439q6785
$$ plain form
2202.7 724712908 724662006 724634707 724577606 724476337 724378288 724296987 724171996 724014819 723926127 723891497 723808587
2225.2 723808587 723668516 723538935 723444343 723341942 723191559 723028004 722917140 722804368 722630143 722510993
2245.6 722510993 722503304 722455025 722308040 722190440 722143948 722053289 721893668 721788347 721753597 721678734 721553385
2268 721553385 721472263 721455216 721420228 721319318 721211314 721144259 721029103 720803976 720574617 720405579 720203161
2290.4 720203161 719915032 719609559 719332278 719048500 718709528 718303919 717850924 717349350 716819823 716369450
2310.8 716369450 716043293 715626955 714903057 714061022 713458717 713113427 712702572 712116539 711702466 711600661
2331.2 711600661 711393893 710947990 710599542 710508347 710713863 711651742 713107705 712903917 710525811
2349.6 710525811 707881033 706481397 706004858 705881298 706076860 706581950 707453489 708597660 709777594
$$ packed form
2202.7G24712908n0902k7299n7101j01269r8049q1301j24991j57177q8692l4630q2910
2225.2G23808587j40071j29581r4592j02401j50383j63555j10864j12772j74225j19150
2245.6G22510993p689m8279j46985j17600m6492r0659j59621j05321l4750p4863j25349
2268G21553385q1122j7047l4988j00910j08004o7055j15156k25127k29359j69038k02418
2290.4G20203161k88129l05473k77281k83778l38972m05609m52995n01574n29527m50373
2310.8G16369450l26157m16338p23898q42035o02305l45290m10855n86033m14073j01805
2331.2G11600661k06768m45903l48448r1195K05516R37879J455963k03788k378106
2349.6G10525811k644778j399636m76539j23560J95562N05090Q71539J144171J179934
$$ plain form
2367.9 709777594 710841000 711739719 712483585 713066220 713465989 713692904 713738501 713599205 713352621 713119984
2388.3 713119984 712915719 712685168 712438285 712237895 712070048 711845875 711550057 711254299 711005628 710762382
2408.7 710762382 710495114 710251033 710043132 709773242 709404469 709057510 708794832 708551228 708275378 707986951
2429.1 707986951 707690001 707344294 706968009 706647635 706385851 706101179 705759287 705402851 705080390 704755723
2449.5 704755723 704388142 704008043 703646958 703295410 702906907 702480614 702078342 701689541 701244712 700753331
2469.9 700753331 700287104 699835360 699314415 698736131 698177040 697645485 697091520 696514130 695973039 695448339
2490.3 695448339 694878399 694291055 693752348 693245769 692696333 692128599 691640615 691205144 690698326 690129161
2510.7 690129161 689591944 689079285 688533545 687999427 687583208 687250972 686882257 686462700 686086774 685808957
$$ packed form
2367.9G09777594J063406Q98719P43866N82635L99769K26915M5597j39296k46584k32637
2388.3G13119984k04265k30551k46883k00390j67847k24173k95818k95758k48671k43246
2408.7G10762382k67268k44081k07901k69890l68773l46959k62678k43604k75850k88427
2429.1G07986951k96950l45707l76285l20374k61784k84672l41892l56436l22461l24667
2449.5G04755723l67581l80099l61085l51548l88503m26293m02272l88801m44829m91381
2469.9G00753331m66227m51744n20945n78284n59091n31555n53965n77390n41091n24700
2490.3F95448339n69940n87344n38707n06579n49436n67734m87984m35471n06818n69165
2510.7F90129161n37217n12659n45740n34118m16219l32236l68715m19557l75926k77817
$$ plain form
2531.1 685808957 685546935 685232699 684938669 684713602 684450150 684058785 683628380 683283687 682994187 682689130
2551.5 682689130 682394981 682123005 681817472 681427479 680990875 680614769 680311501 679995298 679634511 679264665
2571.9 679264665 678898931 678492725 678034723 677593470 677184761 676746666 676262319 675790846 675371170 674944639
2592.3 674944639 674476504 674024284 673588395 673096955 672562718 672080755 671650469 671199203 670708239 670194805
2612.7 670194805 669703960 669237912 668735921 668231368 667786002 667322397 666764438 666195154 665720522 665271997
2633.1 665271997 664744437 664201796 663700402 663188159 662645221 662091553 661557913 661042333 660482466 659871221
2653.5 659871221 659275472 658708692 658115864 657501936 656956136 656449318 655856729 655215383 654636741 654097378
2673.9 654097378 653528035 652911723 652287900 651726365 651190102 650586545 649956346 649371386 648778260 648136914
$$ packed form
2531.1F85808957k62022l14236k94030k25067k63452l91365m30405l44693k89500l05057
2551.5F82689130k94149k71976l05533l89993m36604l76106l03268l16203l60787l69846
2571.9F79264665l65734m06206m58002m41253m08709m38095m84347m71473m19676m26531
2592.3F74944639m68135m52220m35889m91440n34237m81963m30286m51266m90964n13434
2612.7F70194805m90845m66048n01991n04553m45366m63605n57959n69284m74632m48525
2633.1F65271997n27560n42641n01394n12243n42938n53668n33640n15580n59867o11245
2653.5F59871221n95749n66780n92828o13928n45800n06818n92589o41346n78642n39363
2673.9F54097378n69343o16312o23823n61535n36263o03557o30199n84960n93126o41346
$$ plain form
2694.3 648136914 647521317 646963775 646410644 645822704 645242095 644706309 644138753 643510163 642922819 642408848
2714.6 642408848 641883671 641321301 640783489 640311420 639875948 639416158 638947725 638526618 638101518 637626410
2735 637626410 637175500 636802971 636471510 636094928 635675609 635311723 634972751 634551108 634072006 633636415
2755.4 633636415 633243799 632810175 632321954 631838560 631375551 630880296 630337059 629820168 629344165 628812253
2775.8 628812253 628190398 627569318 627004027 626385629 625672519 625001013 624393821 623730719 622967005 622196853
2796.2 622196853 621466696 620680749 619816482 618945956 618092239 617216170 616274536 615277052 614256322
2814.6 614256322 613210499 612092316 610886812 609654665 608380973 606974423 605420113 603764415
2830.9 603764415 602016151 600082040 597865045 595315874 592347920 588874936 584929407 580892742
$$ packed form
2694.3F48136914o15597n57542n53131n87940n80609n35786n67556o28590n87344n13971
2714.6F42408848n25177n62370n37812m72069m35472m59790m68433m21107m25100m75108
2735F37626410m50910l72529l31461l76582m19319l63886l38972m21643m79102m35591
2755.4F33636415l92616m33624m88221m83394m63009m95255n43237n16891m76003n31912
2775.8F28812253o21855o21080n65291o18398p13110o71506o07192o63102p63714p70152
2796.2F22196853p30157p85947q64267q70526q53717q76069r41634r97484j020730
2814.6F14256322j045823j118183j205504j232147j273692j406550j554310j655698
2830.9F03764415j748264j934111k216995k549171k967954l472984l945529m036665
$$ plain form
2847.2 580892742 577476382 575199127 574080050 573831737 574031413 574218929 574125588 573698819 572935522
2865.6 572935522 571916223 570908904 570195436 569772184 569451630 569128573 568717659 568096399 567193866
2883.9 567193866 566020250 564648807 563175678 561693907 560288072 558980823 557701588 556411147
2900.2 556411147 555124998 553781867 552250743 550392091 548143506 545554340 542734504 539924502
2916.6 539924502 537457943 535576046 534377933 533846200 533920527 534488559 535333037 536365867 537648797
2934.9 537648797 539118290 540592849 541941166 543124557 544060349 544582725 544616222 544284642 543804884
2953.3 543804884 543368697 543154359 543299258 543834090 544683635 545731246 546857238 547999203 549224675
2971.6 549224675 550564885 551922619 553275943 554627478 555864930 556930602 557878017 558734298 559426069
$$ packed form
2847.2E80892742l416360k277255j119077k48313J99676J87516r3341m26769p63297
2865.6E72935522j019299j007319p13468m23252l20554l23057m10914o21260r02533
2883.9E67193866j173616j371443j473129j481771j405835j307249j279235j290441
2900.2E56411147j286149j343131j531124j858652k248585k589166k819836k810002
2916.6E39924502k466559j881897j198113n31733P4327N68032Q44478J032830J282930
2934.9E37648797J469493J474559J348317J183391R35792N22376L3497l31580m79758
2953.3E43804884m36187k14338J44899N34832Q49545J047611J125992J141965J225472
2971.6E49224675J340210J357734J353324J351535J237452J065672R47415Q56281O91771
$$ plain form
2990 559426069 559883058 560152411 560295403 560281217 560067534 559678078 559175074 558599412 558001816 557477713
3010.4 557477713 557034612 556597412 556125104 555626631 555114448 554521859 553796887 552996099 552212059 551489890
3030.8 551489890 550778329 549970508 549067080 548183262 547330916 546433747 545478165 544487894 543504000 542553365
3051.2 542553365 541628778 540719688 539773405 538794994 537875593 537048578 536271095 535452425 534564078 533683956
3071.6 533683956 532849252 532060385 531341314 530603409 529731512 528816640 527986467 527203023 526402593 525582135
3092 525582135 524779916 524040699 523307383 522521138 521706402 520903051 520137966 519335091 518435597 517558575
3112.4 517558575 516783357 516000628 515105784 514107645 513052225 511985004 510987222 510071516 509089887
3130.7 509089887 508014500 506980538 506047070 505121946 504050672 502874434 501750231 500677466 499625057
$$ packed form
2990E59426069M56989K69353J42992j4186k13683l89456n03004n75662n97596n24103
3010.4E57477713m43101m37200m72308m98473n12183n92589p24972q00788p84040p22169
3030.8E51489890p11561q07821r03428q83818q52346q97169r55582r90271r83894r50635
3051.2E42553365r24587r09090r46283r78411r19401q27015p77483q18670q88347q80122
3071.6E33683956q34704p88867p19071p37905q71897r14872q30173p83444q00430q20458
3092E25582135q02219p39217p33316p86245q14736q03351p65085q02875q99494q77022
3112.4E17558575p75218p82729q94844r98139j055420j067221r97782r15706r81629
3130.7E09089887j075387j033962r33468r25124j071274j176238j124203j072765j052409
$$ plain form
3149.1 499625057 498627722 497593343 496434003 495251745 494096428 492933601 491773635 490606934
3165.4 490606934 489408731 488237619 487138450 486024559 484852970 483697772 482534438 481304675
3181.7 481304675 480099380 478966564 477845073 476699322 475503087 474279374 473101705 471958578
3198 471958578 470776647 469550312 468341500 467172712 466015577 464868635 463728219 462590188 461441189
3216.4 461441189 460294664 459176183 458028495 456837416 455681652 454608649 453592300 452581078
3232.7 452581078 451518446 450416356 449351490 448327422 447358072 446480125 445565104 444528937 443539530
3251.1 443539530 442698151 441884995 440980971 440029502 439087600 438143104 437258035 436468393 435712785 434919626
3271.4 434919626 434042096 433101058 432175666 431329429 430543721 429761529 428951383 428129017 427344024 426579237
$$ packed form
3149.1D99625057r97335j034379j159340j182258j155317j162827j159966j166701
3165.4D90606934j198203j171112j099169j113891j171589j155198j163334j229763
3181.7D81304675j205295j132816j121491j145751j196235j223713j177669j143127
3198D71958578j181931j226335j208812j168788j157135j146942j140416j138031j148999
3216.4D61441189j146525j118481j147688j191079j155764j073003j016349j011222
3232.7D52581078j062632j102090j064866j024068r69350q77947r15021j036167r89407
3251.1D43539530q41379q13156r04024r51469r41902r44496q85069p89642p55608p93159
3271.4D34919626q77530r41038r25392q46237p85708p82192q10146q22366p84993p64787
$$ plain form
3291.8 426579237 425767750 424901009 424021870 423169047 422378361 421660841 420915246 420028239 418999821
3310.2 418999821 417936236 416938812 415950388 414893419 413801879 412729830 411655009 410481662 409210324
3328.6 409210324 407907844 406588525 405328840 404168725 402944267 401599646 400286019 399028629
3344.9 399028629 397807777 396687567 395591646 394411325 393261820 392257631 391319454 390359133 389414102
3363.2 389414102 388577908 387794852 386880577 385794342 384704381 383739024 382897645 382147998 381391138
3381.6 381391138 380612254 379884511 379214197 378634334 378086716 377393395 376655489 376134217 375729978 375143886
3402 375143886 374367326 373671532 373208672 372854829 372443259 371950865 371459067 371097296 370910645 370765507
3422.4 370765507 370560259 370415330 370437264 370504707 370570958 370700002 370750457 370571464 370379299 370401323
$$ packed form
3291.8D26579237q11487q66741q79139q52823p90686p17520p45595q87007j028418
3310.2D18999821j063585r97424r88424j056969j091540j072049j074821j173347j271338
3328.6D09210324j302480j319319j259685j160115j224458j344621j313627j257390
3344.9C99028629j220852j120210j095921j180321j149505j004189r38177r60321r45031
3363.2C89414102q36194p83056r14275j086235j089961r65357q41379p49647p56860
3381.6C81391138p78884p27743o70314n79863n47618o93321p37906n21272m04239n86092
3402C75143886p76560o95794m62860l53843m11570m92394m91798l61771j86651j45138
3422.4C70765507k05248j44929K1934O7443O6251J29044N0455j78993j92165K2024
$$ plain form
3442.8 370401323 370620072 371025532 371438593 371692300 371932775 372297794 372792602 373340487 373862237 374436796
3463.2 374436796 375191629 376066744 376749486 377122730 377521038 378152698 378925502 379739523 380534053 381260067
3483.6 381260067 382005841 382856667 383674085 384403408 385236800 386269867 387274325 388156503 389237732
3501.9 389237732 390415251 391225785 392014802 393213153 394512206 395584017 396489650 397392303 398414850
3520.3 398414850 399719089 401136994 402408212 403710186 405079901 406328350 407643080 409131974
3536.6 409131974 410458088 411602437 412932336 414698601 416595459 417977035 419214278 420945585
3552.9 420945585 422644913 424006939 425475955 426933914 427884579 429314137 432630152 435903877
3569.2 435903877 437405288 438552886 440290213 442284465 444313675 446095854 447325528 449067861
$$ packed form
3442.8C70401323K18749M05460M13061K53707K40475L65019M94808N47885N21750N74559
3463.2C74436796P54833Q75115O82742L73244L98308O31660P72804Q14021P94530P26014
3483.6C81260067P45774Q50826Q17418P29323Q33392J033067J004458Q82178J081229
3501.9C89237732J177519Q10534P89017J198351J299053J071811R05633R02653J022547
3520.3C98414850J304239J417905J271218J301974J369715J248449J314730J488894
3536.6D09131974J326114J144349J329899J766265J896858J381576J237243J731307
3552.9D20945585J699328J362026J469016J457959R50665J429558L316015L273725
3569.2D35903877J501411J147598J737327J994252K029210J782179J229674J742333
$$ plain form
3585.5 449067861 452655673 455973625 457373261 458948970 461629301 464281172 466780066 469196111
3601.9 469196111 470755875 472159326 475037336 478492767 481224298 483443350 485016167 487756699
3618.2 487756699 492291480 495021343 495131254 495595068 500936925 508251667 511222839 512938917 515428305
3636.5 515428305 517937601 520380139 522030950 522396564 523953676 530462742 537886798 539823294
3652.8 539823294 540515780 544274867 547699332 549251735 550605536 551152170 551256061 554219902 558137476
3671.2 558137476 559168637 563073277 568627715 569729269 569342792 568589747 567149103 567999780 572567761
3689.6 572567761 575665414 575343370 574339628 573866308 574521124 577142477 579329610 578795731 577789962
3707.9 577789962 579643190 584569991 587107718 585831344 584323704 584157526 584801078 585750282 586721897
$$ packed form
3585.5D49067861L587812L317952J399636J575709K680331K651871K498894K416045
3601.9D69196111J559764J403451K878010L455431K731531K219052J572817K740532
3618.2D87756699M534781K729863J09911M63814N341857P314742K971172J716078K489388
3636.5E15428305K509296K442538J650811L65614J557112O509066P424056J936496
3652.8E39823294O92486L759087L424465J552403J353801N46634J03891K963841L917574
3671.2E58137476J031161L904640N554438J101554l86477p53045j440644Q50677M567981
3689.6E72567761L097653l22044j003742m73320O54816K621353K187133n33879j005769
3707.9E77789962J853228M926801K537727j276374j507640j66178O43552R49204R71615
$$ plain form
3726.3 586721897 586006939 583838701 583455086 586532831 590602219 590866506 586660504 584137440 588177323
3744.6 588177323 590226352 588499725 591500938 595468760 594312608 592126012 592625380 593659699
3760.9 593659699 592691958 591830194 592066705 593313336 595077336 594920397 593220055 592427671 593635917
3779.3 593635917 594631076 594259977 594333053 594588518 594239593 593425453 592293561 591890037 591376901 591084003
3799.7 591084003 593782783 594940305 594285369 595878303 595609725 592187464 589960635 591371715 592156351
3818 592156351 592620730 595665991 595826268 593866527 592660844 591654122 591067910 590296149 590530515
3836.4 590530515 593198121 594948947 594928801 594602525 592637300 588253021 584344208 588337779 597243369
3854.8 597243369 597444773 592953980 589996219 589913785 590908051 590032637 589895785 592002630 592733264
$$ packed form
3726.3E86721897p14958k168238l83615L077745M069388K64287m206002k523064M039883
3744.6E88177323K049029j726627L001213L967822j156152k186596M99368J034319
3760.9E93659699r67741q61764K36511J246631J764000j56939j700342p92384J208246
3779.3E93635917R95159l71099P3076K55465l48925q14140j131892m03524n13136k92898
3799.7E91084003K698780J157522o54936J592934k68578l422261k226829J411080P84636
3818E92156351M64379L045261J60277j959741j205683j006722n86212p71761K34366
3836.4E90530515K667606J750826k0146l26276j965225m384279l908813L993571Q905590
3854.8E97243369K01404m490793k957761q2434R94266q75414j36852K106845P30634
$$ plain form
3873.1 592733264 592057765 590174615 589093864 589949310 589877725 590641201 591196895 589732647 590195179
3891.5 590195179 591037750 588807344 586375475 586391985 588078141 590476215 591949999 591019452 589308977
3909.8 589308977 588081002 586991608 586795568 587783754 588192642 587549984 587358296 587511957 586774170
3928.2 586774170 586248875 587067187 587673247 587077200 586115479 585517764 585704744 585901022 585497439 585490882
3948.6 585490882 585805178 585635126 585211396 584892809 584655285 584594667 584656775 584472001 584124923 583892226
3969 583892226 583746314 583653927 583638847 583538473 583291352 583118021 583039165 582864940 582636893 582509875
3989.4 582509875 582425117 582323670 582243145 582107663
3997.5 582107663
$$ packed form
3873.1E92733264o75499j883150j080751Q55446p1585P63476N55694j464248M62532
3891.5E90195179Q42571k230406k431869J6510J686156K398074J473784r30547j710475
3909.8E89308977j227975j089394j96040R88186M08888o42658j91688J53661p37787
3928.2E86774170n25295Q18312O06060n96047r61721n97715J86980J96278m03583o557
3948.6E85490882L14296j70052m23730l18587k37524o0618O2108j84774l47078k32697
3969E83892226j45912r2387j5080j00374k47121j73331p8856j74225k28047j27018
3989.4E82509875q4758j01447q0525j35482
3997.5E82107663
##END=$$ End of the data block
