##TITLE=$$ Begin of the data block
##JCAMP-DX=5.00 $$ ACD/SpecManager v 10.08
##SPECTROMETER/DATA SYSTEM=Alpha
##DATE=11 Jun 2014 19:36:16
##DATA TYPE=INFRARED SPECTRUM
##DATA CLASS=XYDATA
##ORIGIN=
##OWNER=
##NPOINTS=1765
##FIRSTX=399.75695801
##LASTX=3997.56933594
##MAXX=3997.56933594
##MINX=399.75695801
##MAXY=0.74625510
##MINY=0.37174833
##XFACTOR=1.0000000000
##YFACTOR=1.000000000000000e-9
##FIRSTY=0.62510079
##DELTAX=2.03957629
##XUNITS=1/CM
##YUNITS=ARBITRARY UNITS
##XYDATA=(X++(Y..Y))
399.8F25100791J831174J395107K05338m00186m94957m18723j73389m32432j036465
418.1F25576258r06825k34783J37150j85489r25184q01086m16041q62419q07405j0669
438.5F20563507K8372n67019q32737n96165l69489n13733r60231j351416j410425j071512
458.9F12919152o99342q43107j202226j110196o28889j00672L40641M80115N03719
477.3F09659195N79476N09918M41134M90129L81768J97470J03772N8412P2777k1100
497.7F12472951k31027l61264m37379n29945n06103m71711p62939j001239p54118m33982
518.1F06983244m93764n97477k66850K3841l70264p52389l86238M2617j80483m13060
538.4F03589177n6922L11792J38282k58922j68443K47061l755n64694k52903N19276
$$ y = [625100791, 626931965, 628327072, 628532410, 628132224, 627637267, 627218544, 627045155, 626612723, 625576258, 624669433, 624434650, 624571800, 624386311, 623461127, 622660041, 622244000, 621381581, 620574176, 620563507, 620591879, 620024860, 619192123, 618595958, 618226469, 617712736, 616752505, 615401089, 613990664, 612919152, 612219810, 611376703, 610174477, 609064281, 608435392, 608334720, 608675361, 609155476, 609659195, 610238671, 610748589, 611189723, 611679852, 612061620, 612259090, 612362862, 612421274, 612494051, 612472951, 612241924, 611880660, 611443281, 610913336, 610407233, 609935522, 609172583, 608171344, 607417226, 606983244, 606489480, 605892003, 605625153, 605648994, 605278730, 604526341, 604140103, 604182720, 604002237, 603589177, 603532255, 603844047, 603982329, 603723407, 603554964, 603802025, 603798270, 603233576, 602980673, 603499949]
558.8F03499949P08997M97639N61893P88629N53012P0274J45376M61817J67012l77655
579.2F07076943k37942K36809R9957j71363J98364M98236r54n65291l38494J63197
599.6F06959462p2718o18517m74095j55628n16772r62496o02841O9320J60873R3460
620F03880048P55787J413643R87291L80874P31468J372576J162827N06580O52790J308978
640.4F13152862J093208K29240J48713P20561N31018l03269l47912J67251j80364j012325
660.8F14198983q70645l00646m76957k48968J000702J426876J140952O01113O98983
679.2F17170393J288891J218200N50389M49837Q86857P23600j7762j32084M23491Q20280
699.6F23382092R26256J020550J109243N20170q16584r79841R18448K192259J373291
$$ y = [603499949, 604208946, 604706585, 605268478, 606057107, 606610119, 606680393, 606825769, 607287586, 607454598, 607076943, 606839001, 607075810, 607175767, 607004404, 607202768, 607701004, 607700050, 607134759, 606796265, 606959462, 606886744, 606268227, 605794132, 605638504, 605121732, 604159236, 603556395, 603625715, 603786588, 603880048, 604635835, 606049478, 607036769, 607417643, 608149111, 609521687, 610684514, 611191094, 611843884, 613152862, 614246070, 614475310, 614624023, 615344584, 615875602, 615572333, 615224421, 615391672, 615211308, 614198983, 613328338, 613027692, 612550735, 612301767, 613302469, 614729345, 615870297, 616471410, 617170393, 618459284, 619677484, 620227873, 620677710, 621564567, 622288167, 622270405, 622138321, 622561812, 623382092, 624308348, 625328898, 626438141, 626958311, 626141727, 625161886, 626080334, 628272593, 629645884]
717.9F29645884Q30948J634241K000987J477242J377463J921952J791417P64251L53336
736.3F41797721R01819J035273L95477K86281J071751J408100Q47340P17461J438021
754.6F49899244J599074Q29637N44488J117170J195848M16398J45555P50124Q61645
773F57359183J16110j57774N53727J020968O33657N05090J059651J155615M61281K11715
793.4F62919223P72178J029969O22213M90248R19819Q95858J91569p5460M29094O32227
813.8F68826938K64287M09603J177311J532674J341044J434923J943230K059937J583457
832.1F80573404J303375J354992R48668L1113l43442P1168j65701j410365k589226
850.5F79773986l161728k098262Q00192L424346M260660L456652J673519o25789l672003
$$ y = [629645884, 630476832, 632111073, 634112060, 635589302, 636966765, 638888717, 640680134, 641444385, 641797721, 642699540, 643734813, 644130290, 644416571, 645488322, 646896422, 647743762, 648461223, 649899244, 651498318, 652327955, 652872443, 653989613, 655185461, 655601859, 655747414, 656497538, 657359183, 657475293, 657317519, 657871246, 658892214, 659525871, 660030961, 661090612, 662246227, 662707508, 662919223, 663691401, 664721370, 665343583, 665833831, 666753650, 667649508, 667841077, 667765617, 668194711, 668826938, 669091225, 669500828, 670678139, 672210813, 673551857, 674986780, 676930010, 678989947, 680573404, 681876779, 683231771, 684180439, 684211552, 683868110, 683939278, 683773577, 682363212, 679773986, 676612258, 674513996, 675314188, 678738534, 682999194, 686455846, 688129365, 687503576, 683831573]
868.9F83831573o721795p112265l774881J217782N384148P233381O650030M896820
885.2F91604793K950847J139581o1690p48396j399696j700521j384318j011610q45670
903.5F88543320m86851J15335L68297j01328o97970o94335m24564n73337j027643j304090
923.9F83716834j494110j899540k170146j927793j517594j380563j426458j391709
940.2F70508921j358569j472055j532793j258076p74085n72384q19087j230120j690328
958.6F59801424k212346k574384k646745k699732k967239l302812l528357l763974
974.9F36105835m164636m527270m709304m831850m843057m671812m340946l906012
991.2F00110948l572941l379643l132403k858638k774001k888560k927303k742589
$$ y = [683831573, 677109778, 669997513, 666222632, 667440414, 672824562, 680057943, 686707973, 691604793, 694555640, 695695221, 695633531, 694885135, 693485439, 691784918, 690400600, 689388990, 688543320, 688056469, 688171804, 688540101, 688438773, 687740803, 687046468, 686621904, 686048567, 685020924, 683716834, 682222724, 680323184, 678153038, 676225245, 674707651, 673327088, 671900630, 670508921, 669150352, 667678297, 666145504, 664887428, 664113343, 663540959, 662721872, 661491752, 659801424, 657589078, 655014694, 652367949, 649668217, 646700978, 643398166, 639869809, 636105835, 631941199, 627413929, 622704625, 617872775, 613029718, 608357906, 604016960, 600110948, 596538007, 593158364, 590025961, 587167323, 584393322, 581504762, 578577459, 575834870]
1007.5E75834870k525448k389908k247572k128542k251684k656818l008485l098428
1023.9E55527985l093123l106118l024458k636016j722515l09050J149714K024889
1040.2E44811308J958609J131773R1791p53224j341700j756192j965701j688779o56843
1058.5E39831042Q57890K113163K654136K607047K189338J557112R69708N57482K30968
1076.9E53567886p6115j54495L70383J108885J350701J367748J529872J593292J420557
1095.2E62078714J246870J195192J065254Q06273N18560K06292j1266K17259R99987
1113.6E68323135J847923K124250J796603J436115J452565J802802K273321K756536
1129.9E83813250L129661L286600L318012L165007K661585J889885J111865N21123
$$ y = [575834870, 573309422, 570919514, 568671942, 566543400, 564291716, 561634898, 558626413, 555527985, 552434862, 549328744, 546304286, 543668270, 541945755, 541636705, 542786419, 544811308, 546769917, 547901690, 547993481, 547240257, 545898557, 544142365, 542176664, 540487885, 539831042, 540688932, 542802095, 545456231, 548063278, 550252616, 551809728, 552779436, 553336918, 553567886, 553491771, 553337276, 553707659, 554816544, 556167245, 557534993, 559064865, 560658157, 562078714, 563325584, 564520776, 565586030, 566392303, 566910863, 567117155, 567105889, 567323148, 568323135, 570171058, 572295308, 574091911, 575528026, 576980591, 578783393, 581056714, 583813250, 586942911, 590229511, 593547523, 596712530, 599374115, 601264000, 602375865, 602896988]
1146.2F02896988J3948n43833r57966j135587j315356j569092j555979r05812L17156
1164.6E95244467J698137K846837L563165L840447L834724L737152L592729L278256
1180.9F21635914K784192K294302J839579J267075O01053M4585l77298p71463j075804
1199.3F28242135j139104j048208j000166q66949m73678j11878j31726l99888n59270
1217.6F22511268n50509o40154q64863r56774q96394r35853j020848q11637l71039
1236F15463197j79231l20375l64303k23637k14756l02374j48475J33574J41859q4162
1256.4F13901317j74820j2458J23203J14858J96755M20034N07653M05669L70085M15564
1276.8F16267860L16203J93357M37498Q93533J031697P67827M76241L79443L06368
$$ y = [602896988, 602910936, 602367103, 601409137, 600273550, 598958194, 597389102, 595833123, 594927311, 595244467, 596942604, 599789441, 603352606, 607193053, 611027777, 614764929, 618357658, 621635914, 624420106, 626714408, 628553987, 629821062, 630422115, 630466700, 630089402, 629317939, 628242135, 627103031, 626054823, 625054657, 624187708, 623714030, 623602152, 623470426, 623070538, 622511268, 621960759, 621320605, 620455742, 619498968, 618602574, 617666721, 616645873, 615834236, 615463197, 615283966, 614963591, 614599288, 614375651, 614160895, 613858521, 613710046, 613843620, 613985479, 613901317, 613726497, 613714039, 613837242, 613952100, 614148855, 614568889, 615076542, 615482211, 615852296, 616267860, 616584063, 616777420, 617214918, 618108451, 619140148, 619907975, 620384216, 620763659, 621070027]
1295.1F21070027N3466k53737m50015o77109j016080j298368j416684j475334j486599
1313.5F13049567j247287o51717j9551K48909K12551L9458l08335p94530j132429j196861
1333.9F08199775j054823o77943p7665L43084L65019K05874o5267m68135r89437j387655
1354.3F04392827j541198j635074j683355j460135j249790j475632j808167j902639
1370.6E91636837j657844j240134j100302j265645j458883j657248j601934j227141
1386.9E80427706j234591j892924k637029l084779l276288l490210l693640l876030
1403.2E57242215m032731m005909m043460m079461l934801l781676l539086k866685
1419.5E26958406j999199j363576p71284k78771K90096O40035N36322J007140J677215
$$ y = [621070027, 621123493, 620869756, 620419741, 619742632, 618726552, 617428184, 616011500, 614536166, 613049567, 611802280, 611150563, 611131012, 611379921, 611592472, 611631930, 611323595, 610529065, 609396636, 608199775, 607144952, 606467009, 606389344, 606732428, 607097447, 607303321, 607238054, 606769919, 605780482, 604392827, 602851629, 601216555, 599533200, 598073065, 596823275, 595347643, 593539476, 591636837, 589978993, 588738859, 587638557, 586372912, 584914029, 583256781, 581654847, 580427706, 579193115, 577300191, 574663162, 571578383, 568302095, 564811885, 561118245, 557242215, 553209484, 549203575, 545160115, 541080654, 537145853, 533364177, 529825091, 526958406, 524959207, 523595631, 522824347, 522545576, 522835672, 523475707, 524012029, 525019169, 526696384]
1437.9E26696384J143217O11842M41253L76940N50687N07712Q1122j27732Q84413K367199
1458.3E33533037J657664Q19386J039147J240075Q54611J062214K356172K843678K053797
1476.6E47459781J431346J032293O27816J07824j79708k265J10806l73364o68228k53439
1497E49292862N3645l26574r31144r64463N0247Q6844p15077j071334j022756o06000
1517.4E43846250j23680M87328N74290K46465K87831j0192k30372J32978j43588n74588
1537.8E44492722P26819K246499K007603J658917J358688J429498J520991J255453
1554.1E56697190P85649J946985L464043J168728j39057k55823k91288l43085j067519
1572.5E61965823j562297j206279j239300j718044j894057j989603k262235k503573
$$ y = [526696384, 527839601, 528451443, 528892696, 529269636, 529820323, 530328035, 530409157, 530281425, 531165838, 533533037, 535190701, 536010087, 537049234, 538289309, 539143920, 540206134, 542562306, 545405984, 547459781, 548891127, 549923420, 550551236, 550659060, 550479352, 550477087, 550587893, 550214529, 549546301, 549292862, 549346507, 549019933, 548088789, 547124326, 547174573, 547261417, 546546340, 545475006, 544452250, 543846250, 543722570, 544209898, 544784188, 545030653, 545318484, 545308292, 545077920, 545210898, 545067310, 544492722, 545219541, 547466040, 549473643, 551132560, 552491248, 553920746, 555441737, 556697190, 557482839, 559429824, 562893867, 564062595, 563923538, 563667715, 563376427, 563033342, 561965823, 560403526, 559197247, 557957947, 556239903, 554345846, 552356243, 550094008, 547590435]
1588.8E47590435k631426k691269k715886k703607k697527k678454k657533k650321
1605.1E26164412k552568k424419k468884k672196k578199k106666j964271k099932
1621.4E07297277j894176j592278j432717j272797j307458j059532Q3297P43240L52949
1639.8D99917805K36929L48746J211763J897573P81298J281738L969252K863050J563311
1658.2E14071465K001881L032804L412604K626121K993465M118084L567398L669858
1674.5E39493680M370689L519178K686560L587008O323218N766451M150689M335642
1690.8E74233115L950953M719913N853415O104469P534266N804359M508675N114197
1707.1F17823362M312694L213585K588570K699196M028857L982067K284527J776874
$$ y = [547590435, 544959009, 542267740, 539551854, 536848247, 534150720, 531472266, 528814733, 526164412, 523611844, 521187425, 518718541, 516046345, 513468146, 511361480, 509397209, 507297277, 505403101, 503810823, 502378106, 501105309, 499797851, 498738319, 498821616, 499564856, 499917805, 500154734, 500503480, 501715243, 503612816, 504394114, 505675852, 509645104, 512508154, 514071465, 516073346, 519106150, 522518754, 525144875, 528138340, 532256424, 535823822, 539493680, 543864369, 547383547, 550070107, 553657115, 559980333, 565746784, 569897473, 574233115, 578184068, 582903981, 588757396, 594861865, 602396131, 608200490, 612709165, 617823362, 622136056, 625349641, 627938211, 630637407, 634666264, 638648331, 640932858, 642709732]
1723.4F42709732J891255J571596J185060J007139K347350K995313J598417J928866
1739.7F57234728K870739K927422L061951L521680M561603M966498L763914L315866
1756.1F86224401L451884L058553L240287K771735J840413J618027J659155K370894
1772.4G06235349K354801J160145P55667J091659J199604J092910Q67665L79145O34194
1790.7G15771139J692354J471818O49929P37250J274883J374722J057923Q63254R16481
1809.1G25809753J139820J113295Q79824Q32618Q23736O04510N36799O98627N67555
1827.4G33006537Q43465J168609O08027L18766N20944K95937o7532N67556J173377
1845.8G38435686O08503K47121K70129L14414L38197K90811K68280K48075L6240j50681
$$ y = [642709732, 644600987, 646172583, 647357643, 648364782, 650712132, 653707445, 655305862, 657234728, 660105467, 663032889, 666094840, 669616520, 674178123, 679144621, 682908535, 686224401, 689676285, 692734838, 695975125, 698746860, 700587273, 702205300, 703864455, 706235349, 708590150, 709750295, 710505962, 711597621, 712797225, 713890135, 714757800, 715136945, 715771139, 717463493, 718935311, 719585240, 720322490, 721597373, 722972095, 724030018, 724893272, 725809753, 726949573, 728062868, 728942692, 729775310, 730599046, 731203556, 731740355, 732438982, 733006537, 733850002, 735018611, 735626638, 735945404, 736466348, 736762285, 736694753, 737262309, 738435686, 739044189, 739291310, 739561439, 739875853, 740214050, 740504861, 740773141, 741021216, 741057456, 740906775]
1866.2G40906775L86536R34422N06997Q0049Q8871J78814K22623J74046P8082J0609
1886.6G43567824J89662L84629J89364J42634K55346J49787J02103J72495J41502L2961
1907G45328307Q7083K22086P1288k04862J908L02911J41263J08301J05560j371L3438
1929.4G46195912J7584l5644j5676l3676j82391q5711K19166J75536l4094j18911j07050
1951.9G45995045n8234n4598q1897m1306m2081j63555j49369K0385K8133p9036j09851
1974.3G45263636r0361p2240r5725j18852j27435j36792j89841j66834n126k8133j70767
1996.7G44061530j73569j18077j02460j30534j55628j34528j10864j84298k66016j73866
2017.1G42511690j05203j99556k42531k20955j98066j87754k07425k13265k01583k11954
$$ y = [740906775, 741293311, 742227733, 742734730, 742814779, 742903650, 743082464, 743305087, 743479133, 743557215, 743567824, 743757486, 744142115, 744331479, 744474113, 744729459, 744879246, 744981349, 745153844, 745295346, 745328307, 745415390, 745637476, 745708764, 745503902, 745505810, 745808721, 745949984, 746058285, 746163845, 746162474, 746195912, 746213496, 746177852, 746162176, 746128500, 745946109, 745860398, 746079564, 746255100, 746221006, 746102095, 745995045, 745936811, 745882213, 745800316, 745759010, 745716929, 745553374, 745404005, 745424390, 745452523, 745373487, 745263636, 745173275, 745101035, 745005310, 744886458, 744759023, 744622231, 744432390, 744265556, 744260430, 744232297, 744061530, 743887961, 743769884, 743667424, 743536890, 743381262, 743246734, 743135870, 742951572, 742685556, 742511690, 742406487, 742206931, 741964400, 741743445, 741545379, 741357625, 741150200, 740936935, 740735352, 740523398]
2037.5G40523398k00689j34230j14500j49548j80543j85310j67013j49071j35481j35124
2057.9G38971889j70171k33531k11835j21474j18137j61290j43349j17004j21117j44720
2078.3G37429261j71006j66296j54496j73628j92165j75596j70409j90437j87695j62840
2098.7G35684693j67310k03133k02358j61588j56999k07424k24411j91868j80125k07722
2119.1G33781755k20120j81854j58012j78516j74284j27494r2149j08838j46091j36673
2139.5G32257724r7275o3300o6042j04964j03414q7261j03951q0525n0545p9334n7220
2161.9G31363893J3053K563o3241q9407n1498j5080m2558o7114j8716J2695l2246o0200
2186.4G30952144j4484J1444n3823j00136m2915K384n6684j06216l2127L9459l0577
$$ y = [740523398, 740322709, 740188479, 740073979, 739924431, 739743888, 739558578, 739391565, 739242494, 739107013, 738971889, 738801718, 738568187, 738356352, 738234878, 738116741, 737955451, 737812102, 737695098, 737573981, 737429261, 737258255, 737091959, 736937463, 736763835, 736571670, 736396074, 736225665, 736035228, 735847533, 735684693, 735517383, 735314250, 735111892, 734950304, 734793305, 734585881, 734361470, 734169602, 733989477, 733781755, 733561635, 733379781, 733221769, 733043253, 732868969, 732741475, 732649326, 732540488, 732394397, 732257724, 732160449, 732097149, 732031107, 731926143, 731822729, 731735468, 731631517, 731550992, 731500447, 731421113, 731363893, 731376946, 731379509, 731316268, 731226861, 731175363, 731160283, 731117725, 731050611, 731031895, 731044590, 731012344, 730952144, 730937660, 730949104, 730895281, 730795145, 730752230, 730754614, 730697930, 730591714, 730559587, 730599046, 730568469]
2208.8G30568469j17541r7692n4478q2851j28031r9480p0393j09672j19985q2731q2314
2231.3G29523301j16467j35422j05322o6995j01566j37389p3671k8790j06573j56462
2251.7G28494644r1076k8908n8889j22607j16944m6492n543m9651r2030n1021j8239
2274.1G27813244o3419q4281n0366j10686k44975k45035j48416j66297k64406k98321
2294.5G26137042k68161k50578l09050l91007m40478n17666n54920m46915l30091m57108
2314.9G22171068p56204p75397m58002k57015m00245n63205l51131p8856k38002m85539
2335.3G17807472l90709p8141K91049J027048J502573k36928k457619k695620j424015
2353.6G13345110m98831r5606L52204P52390R64999J018405J014232R83239R04142
$$ y = [730568469, 730450928, 730353236, 730298758, 730215907, 730087876, 729988396, 729918003, 729808331, 729688346, 729605615, 729523301, 729406834, 729271412, 729166090, 729099095, 728997529, 728860140, 728786469, 728757679, 728651106, 728494644, 728403568, 728374660, 728315771, 728193164, 728076220, 728029728, 728024185, 727974534, 727882504, 727831483, 727813244, 727749825, 727665544, 727615178, 727504492, 727259517, 727014482, 726866066, 726699769, 726435363, 726137042, 725868881, 725618303, 725309253, 724918246, 724477768, 723960102, 723405182, 722958267, 722628176, 722171068, 721414864, 720639467, 720181465, 719924450, 719524205, 718961000, 718609869, 718531013, 718293011, 717807472, 717416763, 717338622, 717629671, 718656719, 720159292, 719922364, 717464745, 714769125, 713345110, 712846279, 712750673, 713102877, 713855267, 714820266, 715838671, 716852903, 717836142, 718740284]
2372G18740284P87139N99444L67582J98126M1306j26481k18690k06768j99616k40862
2392.4G19741464k45154j85967j75357k46405k65658k14636j90378k37226k83182k63274
2412.8G17434227k29239k47896k95579k93315k55346k62618k99573l01003k89679l14712
2433.2G14645267l47138l12567k59697k82049l49820l53813k89381k96414l67164l78847
2453.6G11408377l53039l54170l91961m21941l71396l39628m35769n09203m72366m49718
2474G07309186n03003n50926n37991n17965n49555n68986n27799n21183n85615o27339
2494.4G01818824n59926m66287m87030n41508m96507m36663m86970n50211n29408n16117
2514.8F96748197n47290n16593l96073l27528l77118m16041l45945k42591k23398k82288
$$ y = [718740284, 719527423, 720126867, 720494449, 720692575, 720733881, 720607400, 720388710, 720181942, 719982326, 719741464, 719496310, 719310343, 719134986, 718888581, 718622923, 718408287, 718217909, 717980683, 717697501, 717434227, 717204988, 716957092, 716661513, 716368198, 716112852, 715850234, 715550661, 715249658, 714959979, 714645267, 714298129, 713985562, 713725865, 713443816, 713093996, 712740183, 712450802, 712154388, 711787224, 711408377, 711055338, 710701168, 710309207, 709887266, 709515870, 709176242, 708740473, 708231270, 707758904, 707309186, 706806183, 706255257, 705717266, 705199301, 704649746, 704080760, 703552961, 703031778, 702446163, 701818824, 701258898, 700792611, 700305581, 699764073, 699267566, 698830903, 698343933, 697793722, 697264314, 696748197, 696200907, 695684314, 695288241, 694960713, 694583595, 694167554, 693821609, 693579018, 693355620, 693073332]
2535.2F93073332k92003k52902l05713l99410l77178k96772k93136l13043k82586k56777
2555.6F90003812k90870l73662m07398l44514k99395l36885l68178l43263l45290m21524
2576F86472833m67241m12106l67820m24147m99427m67420l78668l88265m62830m71413
2596.4F82133496m34518m64380n31018n02109m33862m50433m88877m57823m12703m36604
2616.8F77521169n03242n07057m45246m46260n29826n69880n06818m62175n12182n39422
2637.1F72499061m98772m77731n12123n53549n51641n27084n48303o05583n87582n23627
2657.5F67113066n36561n84901n78046n46395n68629o12855n80668n31018n66065o20782
2677.9F61387146o12319n70595n60284n81860n79536n55158n79119o33955o13987n34416
$$ y = [693073332, 692781329, 692528427, 692222714, 691823304, 691446126, 691149354, 690856218, 690543175, 690260589, 690003812, 689712942, 689339280, 688931882, 688587368, 688287973, 687951088, 687582910, 687239647, 686894357, 686472833, 686005592, 685593486, 685225666, 684801519, 684302092, 683834672, 683456004, 683067739, 682604909, 682133496, 681698978, 681234598, 680703580, 680201471, 679767609, 679317176, 678828299, 678370476, 677957773, 677521169, 677017927, 676510870, 676065624, 675619364, 675089538, 674519658, 674012840, 673550665, 673038483, 672499061, 672000289, 671522558, 671010435, 670456886, 669905245, 669378161, 668829858, 668224275, 667636693, 667113066, 666576505, 665991604, 665413558, 664867163, 664298534, 663685679, 663105011, 662573993, 662007928, 661387146, 660774827, 660204232, 659643948, 659062088, 658482552, 657927394, 657348275, 656714320, 656100333, 655565917]
2698.3F55565917n22434n94616o04510n29886n36382o04153n77747m94600m91917n54740
2718.7F50054932n55516m79936m35829m84467n03182l99232l39270m04239m56154m08232
2739.1F45588875l36111l58343m02689l55720l22938l95298m66109m36961l86000m21882
2759.5F41706824m80354m83453m82201m96567m89831m55200m48764n23805o15597o29664
2779.9F36601388n90622o02841o49572o30975o20186p04288p84576p64728p21931p75636
2800.3F29756033q69155q92996q74222q87930r37462r81271j001418j043081j112163
2818.7F21156335j159072j207769j306295j452089j584887j662970j752972j950086
2835F09080195k235174k548337k968430l525436m008472m076481l473878k322256j081527
$$ y = [655565917, 655043483, 654448867, 653844357, 653314471, 652778089, 652173936, 651596189, 651101589, 650609672, 650054932, 649499416, 649019480, 648583651, 648099184, 647596002, 647196770, 646857500, 646453261, 645997107, 645588875, 645252764, 644894421, 644491732, 644136012, 643813074, 643417776, 642951667, 642514706, 642128706, 641706824, 641226470, 640743017, 640260816, 639764249, 639274418, 638819218, 638370454, 637846649, 637231052, 636601388, 636010766, 635407925, 634758353, 634127378, 633507192, 632802904, 632018328, 631253600, 630531669, 629756033, 628886878, 627993882, 627119660, 626231730, 625294268, 624312997, 623311579, 622268498, 621156335, 619997263, 618789494, 617483199, 616031110, 614446223, 612783253, 611030281, 609080195, 606845021, 604296684, 601328254, 597802818, 593794346, 589717865, 586243987, 583921731, 582840204]
2853.3E82840204j67727K26259J78277q7559m29630p62582r92298r85563p20501m25100
2873.7E78673780l01063l35872m37081o10232q89361j164437j348674j468837j501918
2892.1E70616305j407981j293957j289964j326799j314223j329124j504362j865446
2908.4E59284449k272368k612233k851784k840042k472639j877726j201748n30780
2924.7E42625129O6281N34474Q57294J096904J304448J461565J516581J454055J262308
2943.1E52179039R50098N54263Q5533l16262m93825m59969k46346J49906O13391R47714
2963.5E53963542J105309J167476J200676J242697J324832J395703J391947J347244
2979.8E64139426J250088J099348R56535Q41976P18593N43058L60727J88172k3603
$$ y = [582840204, 582672477, 582898736, 583077013, 582989454, 582559824, 581797242, 580804944, 579819381, 579098880, 578673780, 578372717, 578036845, 577599764, 576989532, 576100171, 574935734, 573587060, 572118223, 570616305, 569208324, 567914367, 566624403, 565297604, 563983381, 562654257, 561149895, 559284449, 557012081, 554399848, 551548064, 548708022, 546235383, 544357657, 543155909, 542625129, 542691410, 543225884, 544083178, 545180082, 546484530, 547946095, 549462676, 550916731, 552179039, 553129137, 553683400, 553768933, 553452671, 552958846, 552498877, 552252531, 552402437, 553015828, 553963542, 555068851, 556236327, 557437003, 558679700, 560004532, 561400235, 562792182, 564139426, 565389514, 566488862, 567445397, 568287373, 569005966, 569549024, 569909751, 570097923, 570074320]
2998.1E70074320k26677l78191m94301n76318o00576n31733m40300m17530m52161m97282
3018.5E65459251n31733n90860o74785p47025p74860p24018p13885q47816r34243q73208
3038.9E58046818q53062r22859r61959r51767r30488r35137r70662r65297r57191r68874
3059.3E48629522r03189q16345p96676q34107q87394q85964q56757q17179p41840p48277
3079.7E40341794q42750q77857q44538q01206q01503q64148q58903p50721p15911p59363
3100.1E32224894p88510q19862q19147q16047q83937r10818q34048q23677r39429j031637
3120.5E23557782j029968r97603r77933r83000j034022j062691j033366r90629r87351
3138.9E14461219j086712j154065j103162j087249j088559j039923j071632j197874
$$ y = [570074320, 569847643, 569469452, 568975151, 568398833, 567798257, 567266524, 566826224, 566408694, 565956533, 565459251, 564927518, 564336658, 563661873, 562914848, 562139988, 561415970, 560702085, 559854269, 558920026, 558046818, 557193756, 556270897, 555308938, 554357171, 553426683, 552491546, 551520884, 550555587, 549598396, 548629522, 547726333, 546909988, 546113312, 545279205, 544391811, 543505847, 542649090, 541831911, 541090071, 540341794, 539499044, 538621187, 537776649, 536975443, 536173940, 535309792, 534450889, 533700168, 532984257, 532224894, 531436384, 530616522, 529797375, 528981328, 528097391, 527186573, 526352525, 525528848, 524589419, 523557782, 522527814, 521530211, 520552278, 519569278, 518535256, 517472565, 516439199, 515448570, 514461219, 513374507, 512220442, 511117280, 510030031, 508941472, 507901549, 506829917, 505632043]
3155.2E05632043j267731j224518j143158j116216j165628j236022j231283j179188
3171.5D96068299j190454j224160j170784j127035j213819j267612j217305j196921
3187.8D86460209j218498j256049j294523j265883j189501j190960j229346j209825
3204.1D76605624j216233j231432j183182j159638j192361j234770j221090j137019
3220.5D67029899j139134j254648j272082j149148j045167j031012j087218j124174
3236.8D57927316j114249j107693j013606q75116r21100j063705j070976r65774r04888
3255.1D48890209r44555r70393r45300r02593q66860q76814q53181q25137q84712r60946
3275.5D39859718r74059r18567q72880q57622q14050p89225q07792q21352q59171r37403
$$ y = [505632043, 504364312, 503139794, 501996636, 500880420, 499714792, 498478770, 497247487, 496068299, 494877845, 493653685, 492482901, 491355866, 490142047, 488874435, 487657130, 486460209, 485241711, 483985662, 482691139, 481425256, 480235755, 479044795, 477815449, 476605624, 475389391, 474157959, 472974777, 471815139, 470622778, 469388008, 468166918, 467029899, 465890765, 464636117, 463364035, 462214887, 461169720, 460138708, 459051490, 457927316, 456813067, 455705374, 454691768, 453816652, 452895552, 451831847, 450760871, 449795097, 448890209, 447945654, 446975261, 446029961, 445127368, 444260508, 443383694, 442530513, 441705376, 440820664, 439859718, 438885659, 437967092, 437094212, 436236590, 435422540, 434633315, 433825523, 433004171, 432145000, 431207597]
3295.9D31207597r72092r06914p93606p41691q19981r66757j103282j157821j105636
3314.3D22639817j068622j106590j150817j141578j161217j269818j362621j427144
3330.6D12951410j448989j376242j289576j314252j436234j488268j417399j275480
3346.9D01904970j157313j185239j261919j225114j143843j104802j095980j067251
3363.2C92663509r28730q18491r60052j216054j229137j009196q62122q52674r15319
3381.6C83871734r23723q06421o78807o20574o73682q04990p82192n48452m25279o08713
3402C76998901q42750p91788n44518l72559l60876m73321n56379m35025k23189j67281
3422.4C72231215k37226j77562J2666N0783R954O4492M0173j19328j26839N5075K36422
$$ y = [431207597, 430235505, 429328591, 428534985, 427793294, 426973313, 426006556, 424903274, 423745453, 422639817, 421571195, 420464605, 419313788, 418172210, 417010993, 415741175, 414378554, 412951410, 411502421, 410126179, 408836603, 407522351, 406086117, 404597849, 403180450, 401904970, 400747657, 399562418, 398300499, 397075385, 395931542, 394826740, 393730760, 392663509, 391734779, 390916288, 389956236, 388740182, 387511045, 386501849, 385639727, 384787053, 383871734, 382948011, 382141590, 381462783, 380842209, 380168527, 379363537, 378581345, 378032893, 377607614, 376998901, 376156151, 375364363, 374819845, 374447286, 374086410, 373613089, 373056710, 372621685, 372398496, 372231215, 371993989, 371816427, 371829093, 371879876, 371889830, 371954322, 371994495, 371875167, 371748328, 371803403, 372039825]
3444.8C72039825M42892M68910K82824K59876L93331N10365N78552N63234N98640P91907
3465.2C76930356R38863P47680L99888L85105O69748Q91119R30012R04381Q58068Q44807
3485.6C84500027Q89688Q75026Q53748R51379J092374J020879R12070J181036J313985
3504C93590212R21190Q92400J308620J392305J191706J053542J019448J123756J412511
3522.3D03905690J509070J371443J450926J484216J291990J415581J708686J535952
3538.6D15673554J231134J385838J892537K033323J494914J396477J939029J859963
3554.9D28906769J470029J597643J578837J037896J573235L592521L560006J651317
3571.3D44968253J233638J863956K207458K283842J951068J344681J912981L804803
$$ y = [372039825, 372482717, 372951627, 373234451, 373494327, 373887658, 374398023, 374976575, 375539809, 376138449, 376930356, 377869219, 378616899, 379016787, 379401892, 380071640, 380962759, 381892771, 382797152, 383655220, 384500027, 385389715, 386264741, 387118489, 388069868, 389162242, 390183121, 391095191, 392276227, 393590212, 394511402, 395403802, 396712422, 398104727, 399296433, 400349975, 401369423, 402493179, 403905690, 405414760, 406786203, 408237129, 409721345, 411013335, 412428916, 414137602, 415673554, 416904688, 418290526, 420183063, 422216386, 423711300, 425107777, 427046806, 428906769, 430376798, 431974441, 433553278, 434591174, 436164409, 439756930, 443316936, 444968253, 446201891, 448065847, 450273305, 452557147, 454508215, 455852896, 457765877, 461570680]
3587.6D61570680L506690J599700J833349K862573K758592K686709K683044J825750
3603.9D81327087J624137L095329L720760K965569K385676J764983K997101M759758
3620.2E04640400K868951K21431O74248N788564P669867K996802J732051K625585K713322
3638.6E31931221K663851J781583L73244J630903O867945P818818K018332O60241L868938
3656.9E59615076L616511J705230J449465N84662J71066L177762M080176J000226M028260
3675.3E79428434N804599J166761m24087q06332j438320J060605M894436L194332l88086
3693.6E92492342j048803n10097O75917K757013K246379n88238r39667K096415N134403
3712F02315664K531827j382709j582265j59740P41780J059711R93967q30829k310217
$$ y = [461570680, 465077370, 466677070, 468510419, 471372992, 474131584, 476818293, 479501337, 481327087, 482951224, 486046553, 489767313, 492732882, 495118558, 496883541, 499880642, 504640400, 507509351, 507730782, 508405030, 514193594, 521863461, 524860263, 526592314, 529217899, 531931221, 534595072, 536376655, 536749899, 538380802, 545248747, 553067565, 555085897, 555746138, 559615076, 563231587, 564936817, 566386282, 566970944, 567142010, 570319772, 574399948, 575400174, 579428434, 585233033, 586399794, 585975707, 585169375, 583731055, 584791660, 589686096, 592880428, 592492342, 591443539, 590933442, 591609359, 594366372, 596612751, 596024513, 595084846, 597181261, 602315664, 604847491, 603464782, 601882517, 601722777, 602464557, 603524268, 604518235, 603687406, 601377189]
3730.3F01377189m03583L208161M298031L86953m312515k642989M139662K108216j756132
3748.7F06402993L182471M193723j163542k266586N66840J136303r63211q44300K80381
3767.1F10525072J292348J765787k57850j793861p42316J368463J072109l95656P0572
3785.4F12904668K75135l32415p86185j104236m10080n75423k75016K890229J238823
3803.8F13825500o44922J708507k89499l578067k268672J477837P48098M99189L216624
3822.1F14694595J51694k014398j181186r69410n39600p56860K65598K780736J822114
3840.5F14253283m6850l60012k020597m519820m004062M262567R325087J50144m735768
3858.8F12303972l077149o2883J026690q86202k3425K323092Q28981o95765k014995
$$ y = [601377189, 600973606, 604181767, 608479798, 608866751, 604554236, 601911247, 606050909, 608159125, 606402993, 609585464, 613779187, 612615645, 610349059, 610915899, 612052202, 611088991, 610244691, 610525072, 611817420, 613583207, 613325357, 611531496, 610789180, 612157643, 613229752, 612834096, 612904668, 613179803, 612847388, 612061203, 610956967, 610546887, 609971464, 609696448, 612586677, 613825500, 613180578, 614889085, 614599586, 611021519, 608752847, 610230684, 610978782, 611477971, 614694595, 614846289, 612831891, 611650705, 610681295, 610141695, 609384835, 609650433, 612431169, 614253283, 614206433, 613846421, 611825824, 607306004, 603301942, 607564509, 616889596, 617039740, 612303972, 609226823, 609163940, 610190630, 609304428, 609281003, 611604095, 612433076, 611737311, 609722316]
3877.2F09722316j207113Q72552L5763R01938N69701j542390N03302Q95977k323925
3895.5F08428121k530039J16050J913310K515971J469612r79483j783669j291394j145303
3913.9F06713176j84715J125872N40018o11365k33769P0691p87258m62711R49979O58631
3934.3F07778549o68406j055301n88178L03089K61963m20392L0339L98576r1493l54290
3954.7F05594456l01301k81513j11043M8756j75774l24845j98663j33514q8990N6744
3975.1F04084313O56k37823j93238j371q6010k59161j75237n7578j11163j20521j01268
3997.5F02741599
$$ y = [609722316, 608515203, 609387755, 609423518, 610325456, 610895157, 609352767, 609856069, 610752046, 608428121, 605898082, 606014132, 607927442, 610443413, 611913025, 610933542, 609149873, 607858479, 606713176, 606528461, 607654333, 608194351, 607582986, 607349217, 607419908, 606632650, 606169939, 607119918, 607778549, 607110143, 606054842, 605466664, 605769753, 606031716, 605611324, 605641663, 606040239, 605948746, 605594456, 605293155, 605011642, 604900599, 604949355, 604773581, 604448736, 604250073, 604116559, 604027569, 604084313, 604084969, 603847146, 603653908, 603652537, 603566527, 603307366, 603132129, 603074551, 602963388, 602842867, 602741599]
##END=$$ End of the data block
