##TITLE=$$ Begin of the data block
##JCAMP-DX=5.00 $$ ACD/SpecManager v 10.08
##SPECTROMETER/DATA SYSTEM=Alpha
##DATE=11 Jun 2014 19:36:16
##DATA TYPE=INFRARED SPECTRUM
##DATA CLASS=XYDATA
##ORIGIN=
##OWNER=
##NPOINTS=1765
##FIRSTX=399.75695801
##LASTX=3997.56933594
##MAXX=3997.56933594
##MINX=399.75695801
##MAXY=0.75449795
##MINY=0.37351286
##XFACTOR=1.0000000000
##YFACTOR=1.000000000000000e-9
##FIRSTY=0.62081337
##DELTAX=2.03957629
##XUNITS=1/CM
##YUNITS=ARBITRARY UNITS
##XYDATA=(X++(Y..Y))
399.8F20813370J298547O11841K47896M43399J82152n89252r90212o76214j26482l63290
$$ 620813370 622111917 622723758 622971654 623415053 623597205 623007953 622017741 621341527 621215045 620851755
420.2F20851755p21931n40853o26266p65443n77450m06384n62131m95136o735j54794
$$ 620851755 620129824 619588971 618962705 618197262 617619812 617213428 616651297 616156161 616149426 615994632
440.5F15994632q69870j074016p76470n08129n50568q81017j150548j243234j053095
$$ 615994632 615124762 614050746 613274276 612766147 612215579 611334562 610184014 608940780 607887685
458.9F07887685p29441o94335r08553j069487q76963l93212K26021O58036O65247O18696
$$ 607887685 607158244 606463909 605555356 604485869 603608906 603215694 603441715 604099751 604764998 605383694
479.3F05383694N84662M97401M74453L07143R8466J90378K97546J24693j22905k60472
$$ 605383694 605968356 606465757 606940210 607247353 607345819 607536197 607833743 607958436 607835531 607575059
499.7F07575059k72751m00603n94973m65989l30091o58870j044452r62794o19948m55737
$$ 607575059 607302308 606901705 606306732 605840743 605510652 604851782 603807330 602844536 602224588 601768851
520.1F01768851m50551k12610K5213k98202o09815l42489l5941k27690m51624j21773
$$ 601768851 601318300 601105690 601130903 600832701 600222886 599880397 599844456 599616766 599165142 599043369
540.5E99043369K53022j5795m17292j21773M06683K20060k98857j73450L33309N24461
$$ 599043369 599296391 599280596 598863304 598741531 599148214 599368274 599069417 598895967 599229276 599753737
560.9E99753737M70758N53548P92027O20305N4539K7060M10497J98722l40879k03609
$$ 599753737 600224495 600778043 601570070 602190375 602244914 602271974 602682471 602881193 602540314 602336705
581.3F02336705L38196K34843j47701J64032N59926J48118m63843l04163K43187K0683
$$ 602336705 602674901 602909744 602762043 602926075 603486001 603634119 603170276 602866113 603109300 603129983
601.7F03129983o33657m77016K3425l01421q66830n02468K23041K35617P0930P24315
$$ 603129983 602496326 602019310 602042735 601741314 600874484 600372016 600595057 600830674 600901604 601625919
622.1F01625919J478672J124442M91261Q17597J405895J133382N23746P44462J359761
$$ 601625919 603104591 604229033 604720294 605537891 606943786 608077168 608600914 609345376 610705137
640.4F10705137J157642M13060L20732P72953N78285k04742l74794O9797j22905q35895
$$ 610705137 611862779 612275839 612596571 613369524 613947809 613743067 613368273 613438070 613315165 612479270
660.8F12479270o67632j38998l77596k21014R55820J486838J292050N93007N29647
$$ 612479270 611811638 611672640 611295044 611074030 612029850 613516688 614808738 615401745 615931392
679.2F15931392J191914J293480O72519M71294Q84772Q25941Q4937j41919M29154R14454
$$ 615931392 617123306 618416786 619089305 619560599 620445371 621271312 621356249 621214330 621643484 622557938
699.6F22557938J021445J079023J177609N96344q14795j050353Q76903K210736J412392
$$ 622557938 623579383 624658406 625836015 626432359 625617564 624567211 625444114 627654850 629067242
717.9F29067242R28760J806915K140522J497924J342177J928032J816034P31766K66671
$$ 629067242 629996002 631802917 633943439 635441363 636783540 638711572 640527606 641259372 641526043
736.3F41526043Q80421J101136M36067L00587J157343J549780R37641P13468J323878
$$ 641526043 642406464 643507600 643943667 644244254 645401597 646951377 647889018 648602486 649926364
754.6F49926364J463533Q42035O65605J188338J217067M51326J56701P02142Q25346
$$ 649926364 651389897 652231932 652897537 654085875 655302942 655754268 655910969 656613111 657438457
773F57438457J66476n8711N94676J008689O77526N64575J057268J160919M91440K41519
$$ 657438457 657604933 657546222 658140898 659149587 659827113 660391688 661448956 662609875 663101315 663342834
793.4F63342834Q28623J060605O03378M62115R00626J003504L93331j0431L39687N62012
$$ 663342834 664171457 665232062 665835440 666297555 667198181 668201685 668595016 668584585 668924272 669486284
813.8F69486284K89202M40061J175940J568496J423359J520574K008081K069115J514018
$$ 669486284 669775486 670215547 671391487 672959983 674383342 675903916 677911997 679981112 681495130
832.1F81495130J209140J321554R64463M1127l47078M7803j37925j308501k522051
$$ 681495130 682704270 684025824 684990287 685031414 684684336 684732139 684594214 683285713 680763662
850.5F80763662l140330k104104P51793L379226M214287L396153J652062o52730l735483
$$ 680763662 677623332 675519228 676271021 679650247 683864534 687260687 688912749 688260019 684524536
868.9F84524536o728768p072985l766418J225114N421460P272541O691814M938066
$$ 684524536 677795768 670722783 666956365 668181479 673602939 680875480 687567294 692505360
885.2F92505360K961099J122415j04308p83444j377821j677811j416206j054645q54075
$$ 692505360 695466459 696588874 696484566 695701122 694323301 692645490 691229284 690174639 689320564
903.5F89320564m78804J35482L99947j14858p48277p31945m32968n58019j020253j321971
$$ 689320564 688841760 688977242 689377189 689262331 688514054 687782109 687349141 686791122 685770869 684448898
923.9F84448898j525104j890004k116799j893938j516402j373350j403451j381636
$$ 684448898 682923794 681033790 678916991 677023053 675506651 674133301 672729850 671348214
940.2F71348214j352310j453519j537025j326442r00626p05182r08554j259446j700938
$$ 671348214 669995904 668542385 667005360 665678918 664778292 664073110 663164556 661905110 660204172
958.6F60204172k250850k627790k671063k670765k938628l313303l537417l739059
$$ 660204172 657953322 655325532 652654469 649983704 647045076 643731773 640194356 636455297
974.9F36455297m104733m503071m736603m815876m779816m598677m270732l879071
$$ 636455297 632350564 627847493 623110890 618295014 613515198 608916521 604645789 600766718
991.2F00766718l580153l385007l155291k877712k752960k858698k885819k686977
$$ 600766718 597186565 593801558 590646267 587768555 585015595 582156897 579271078 576584101
1007.5E76584101k487481k387643k260208k094269k148449k516031k903045l059864
$$ 576584101 574096620 571708977 569448769 567354500 565206051 562690020 559786975 556727111
1023.9E56727111l069162l091991l031552k627432j692832l28183J026809J867056
$$ 556727111 553657949 550565958 547534406 544906974 543214142 542885959 543912768 545779824
1040.2E45779824J852393J071096N9247p37071j258075j657486j929224j686871o37770
$$ 545779824 547632217 548703313 548762560 548025489 546767414 545109928 543180704 541493833 540856063
1058.5E40856063Q57950K083718K644062K606750K172410J542211R65536N62787K66611
$$ 540856063 541714013 543797731 546441793 549048543 551220953 552763164 553728700 554291487 554558098
1076.9E54558098j8477j03831M17172J146019J358449J339734J470387J537085J435220
$$ 554558098 554539621 554435790 554852962 555998981 557357430 558697164 560167551 561704636 563139856
1095.2E63139856J330256J247406J037836P66397N27203K56240P3731L08335J055360
$$ 563139856 564470112 565717518 566755354 567521751 568048954 568305194 568378925 568687260 569742620
1113.6E69742620J869261K140463J847565J504838J469314J756847K204895K669692
$$ 569742620 571611881 573752344 575599909 577104747 578574061 580330908 582535803 585205495
1129.9E85205495L049791L259719L329157L182531K674520J928747J200974N91456
$$ 585205495 588255286 591515005 594844162 598026693 600701213 602629960 603830934 604422390
1146.2F04422390J5378n54680r48847j125097j311362j559496j512468q50677L13461
$$ 604422390 604437768 603883088 602934241 601809144 600497782 598938286 597425818 596575141 596888602
1164.6E96888602J613140K739131L492296L824949L867925L775954L605723L259063
$$ 596888602 598501742 601240873 604733169 608558118 612426043 616201997 619807720 623066783
1180.9F23066783K755105K304435J887322J300394O01888N2929l55423p73012j092315
$$ 623066783 625821888 628126323 630013645 631314039 631915927 631968856 631613433 630840421 629748106
1199.3F29748106j148641j037419r60469q39532m80771r3400p3016l70264n60999n21958
$$ 629748106 628599465 627562046 626601577 625762045 625281274 625187874 625114858 624744594 624183595 623661637
1219.7F23661637n74827p95126q95977q52585q92818r65774p72774l70026j85847k72810
$$ 623661637 623086810 622291684 621395707 620543122 619650304 618684530 617911756 617541730 617355883 617083073
1240.1F17083073k82705j88351k35975l30567j53542J38104J35243r2804j52648L1531
$$ 617083073 616800368 616612017 616376042 616045475 615891933 616030037 616165280 616072476 615919828 615951359
1260.4F15951359J43767R9718J66893M06742N19038L96609L10659L64125L27826K36630
$$ 615951359 616095126 616194844 616361737 616768479 617287517 617684126 617994785 618358910 618686736 618923366
1280.8F18923366M51684Q56757R99868P97033N21183L80099K80500O1989j93417l93808
$$ 618923366 619375050 620231807 621231675 622028708 622549891 622929990 623210490 623272479 623079062 622685254
1301.2F22685254o62446j016319j274765j382112j468361j485824j211405o00278M112
$$ 622685254 622022808 621006489 619731724 618349612 616881251 615395427 614184022 613583744 613587856
1319.6F13587856K37286J90914K7299l07381p75755j113653j192093j042425o75202
$$ 613587856 613825142 614016056 614043355 613735974 612960219 611846566 610654473 609612048 608936846
1338F08936846r9420L23236L38196J72496q3625m76122r83119j360536j508534j605093
$$ 608936846 608837426 609160662 609498858 609671354 609587729 609111607 608128488 606767952 605259418 603654325
1358.3F03654325j653612j442849j253248j475334j790642j887441j658619j266121
$$ 603654325 602000713 600557864 599304616 597829282 596038640 594151199 592492580 591226459
1374.7E91226459j134336j276434j465022j656473j578331j226783j276374j912176
$$ 591226459 590092123 588815689 587350667 585694194 584115863 582889080 581612706 579700530
1391E79700530k611101l059387l265798l492058l726482l896058l995120l945530l997862
$$ 579700530 577089429 574030042 570764244 567272186 563545704 559649646 555654526 551708996 547711134
1409.3E47711134m044533l897726l722191l459633k811551j993179j390696q16881
$$ 547711134 543666601 539768875 536046684 532587051 529775500 527782321 526391625 525574744
1425.7E25574744k98679L08156O42538N14090R85503J640916J113892O27517M74155
$$ 525574744 525276065 525584221 526226759 526740849 527726352 529367268 530481160 531108677 531582832
1444E31582832M07398N92649N45621J11401j06275Q89719K376496J669824Q49724J102209
$$ 531582832 531990230 532582879 533128500 533239901 533133626 534023345 536399841 538069665 538919389 540021598
1464.4E40021598J266837Q27969J050829K373934K884150K103269J428246R69112N53429
$$ 540021598 541288435 542116404 543167233 545541167 548425317 550528586 551956832 552925944 553479373
1482.8E53479373M4704k32995k9444R0241m22418o91235k05576J26063k68697q84951
$$ 553479373 553524077 553291082 553261638 553351879 552929461 552238226 552032650 552158713 551890016 551005065
1503.2E51005065r21189Q5413J17123o57618r88066r07302m80711n7936N17666O26147
$$ 551005065 550083876 550169289 550286412 549628794 548640728 547733426 547252715 547194779 547712445 548338592
1523.6E48338592L31044L91603O7353j68025K21610n0962m73500R00805K374530K008259
$$ 548338592 548669636 549061239 549128592 548960567 549182177 549131215 548657715 549558520 551933050 553941309
1543.9E53941309J633406J346231J426339J492858J189112P23720J925111L415644
$$ 553941309 555574715 556920946 558347285 559840143 561029255 561752975 563678086 567093730
1560.3E67093730J086950j96814l01838l44992m27008j188576j687169j322269j336336
$$ 567093730 568180680 567983866 567682028 567337036 566910028 565721452 564034283 562712014 561375678
1578.6E61375678j797855j993954k131999k414107k669633k815127k835870k858520
$$ 561375678 559577823 557583869 555451870 553037763 550368130 547553003 544717133 541858613
1594.9E41858613k898633k905369k877831k854705k846480k762079k647757k681554
$$ 541858613 538959980 536054611 533176780 530322075 527475595 524713516 522065759 519384205
1611.3E19384205k874910k816558k366245k137184k216995k005518j678228j504481
$$ 519384205 516509295 513692737 511326492 509189308 506972313 504966795 503288567 501784086
1627.6E01784086j314938j290768r85384K36302R13203N06669M10110N59390J520932
$$ 501784086 500469148 499178380 498192996 498429298 499342501 499849170 500259280 500818670 502339602
1645.9E02339602K236127J031340J621544M422843L098429J713693K198755L285349
$$ 502339602 504575729 505607069 507228613 511651456 514749885 516463578 518662333 521947682
1662.2E21947682L643691K781213L155529M292310L688693L809332M541994L636419
$$ 521947682 525591373 528372586 531528115 535820425 539509118 543318450 547860444 551496863
1678.6E51496863K756417L668666O430507N813420M179239M382789L979981M768073
$$ 551496863 554253280 557921946 564352453 570165873 574345112 578727901 582707882 587475955
1694.9E87475955N951345O250084P695377N885899M584014N227745M414081L306747
$$ 587475955 593427300 599677384 607372761 613258660 617842674 623070419 627484500 630791247
1711.2F30791247K671242K784729M162848M071593K304316J832306J982987J630783
$$ 630791247 633462489 636247218 640410066 644481659 646785975 648618281 650601268 652232051
1727.5F52232051J211107J037836K405226L024042J587987J955628K929151K966166
$$ 652232051 653443158 654480994 656886220 659910262 661498249 663453877 666383028 669349194
1743.8F69349194L070652L557921M692792N088509L786742L315449L467381L095448
$$ 669349194 672419846 675977767 680670559 685759068 689545810 692861259 696328640 699424088
1760.1F99424088L311038K807677J812458J594663J706719K482653K436339J187563
$$ 699424088 702735126 705542803 707355261 708949924 710656643 713139296 715575635 716763198
1776.5G16763198P69079J084566J173675J091302R02593M26173O81460J733780J498282
$$ 716763198 717532277 718616843 719790518 720881820 721784413 722210586 722892046 724625826 726124108
1794.8G26124108O57201P38620J299859J421451J091302Q77201R27746J159549J140893
$$ 726124108 726781309 727519929 728819788 730241239 731332541 732209742 733137488 734297037 735437930
1813.2G35437930R12904Q72732Q42034N95630N42521P11620N64635Q72493J228690
$$ 735437930 736350834 737223566 738065600 738661230 739203751 739915371 740480006 741352499 742581189
1831.5G42581189O36875L25084N26488K90751p0810N95629J218915O33121K50101K75552
$$ 742581189 743218064 743543148 744069636 744360387 744289577 744885206 746104121 746737242 746987343 747262895
1851.9G47262895L36766L65436L21806L13163K83003K9742j71244L99113R57787M95255
$$ 747262895 747599661 747965097 748286903 748600066 748883069 748912811 748741567 749140680 750098467 750593722
1872.3G50593722N6565R5963K16723K56300J80602Q4519M1545K31802M03106J76132
$$ 750593722 750650287 750746250 750962973 751219273 751399875 751484394 751525939 751757741 752160847 752336979
1892.7G52336979J51455L03746J73389P9573J56641J52468M2439Q3625K33352J14501
$$ 752336979 752488434 752792180 752965569 753045142 753201783 753354251 753396690 753480315 753713667 753828168
1913.1G53828168j55926K4498K86936J08183R6500J19924K2114N6266K4498k7359J9551
$$ 753828168 753672242 753696740 753983676 754091859 754188359 754308283 754330397 754386663 754411161 754383802 754403353
1935.5G54403353Q404j59085j01566J79529J67310j4603j13487j06573m2856l0458
$$ 754403353 754411757 754252672 754151106 754330635 754497945 754483342 754369855 754263282 754220426 754189968
1955.9G54189968n9485m0353m3094j28686j02759L5167K2590q3625j23024j02341o3896
$$ 754189968 754130483 754090130 754047036 753918350 753815591 753850758 753873348 753789723 753666699 753564358 753500462
1978.4G53500462o7771q2850j01090j33037j95384j47582K9266j7047j63495j53959
$$ 753500462 753432691 753349841 753248751 753115714 752920330 752772748 752802014 752784967 752621472 752467513
1998.8G52467513j15931r9540j06513j46032j40130j14083j86801k52009j38998p4446
$$ 752467513 752351582 752252042 752145529 751999497 751859367 751745284 751558483 751306474 751167476 751093030
2019.2G51093030j93119k45929j99079j60992j72616k02119j91510j63734j77800k08438
$$ 751093030 750899911 750653982 750454903 750293911 750121295 749919176 749727666 749563932 749386132 749177694
2039.6G49177694j66356j11878j18077j52767j61826j23918r7156j25348j51694j55807
$$ 749177694 749011338 748899460 748781383 748628616 748466790 748342872 748245716 748120368 747968674 747812867
2060G47812867j83642j70648j09613r3043j03533j07348j27315j24634j05560j33931
$$ 747812867 747629225 747458577 747348964 747255921 747152388 747045040 746917725 746793091 746687531 746553600
2080.3G46553600j65403j44243j27018j51753j66714j47462j35780j46568j45494j52588
$$ 746553600 746388197 746243954 746116936 745965183 745798469 745651007 745515227 745368659 745223165 745070577
2100.7G45070577j72496j59323j39594j58668j99676j92046j38521j29104j75595k09629
$$ 745070577 744898081 744738758 744599164 744440496 744240820 744048774 743910253 743781149 743605554 743395925
2121.1G43395925j85907j26183j05799j22904j12176q1718r1017j28328j07646n6446
$$ 743395925 743210018 743083835 742978036 742855132 742742956 742661238 742570221 742441893 742334247 742277801
2141.5G42277801m8280p2896q1659o2584m9592n1558m3213l5167p0214q1539m709N4956
$$ 742277801 742229521 742156625 742074966 742012382 741962790 741911232 741868019 741832852 741762638 741681099 741676390 741731346
2166G41731346O199o3956n4837k2590l6955m8995P511N0366N781k2232J7225L0280
$$ 741731346 741737545 741673589 741618752 741596162 741559207 741510212 741517723 741568089 741573870 741551638 741568863 741599143
2190.5G41599143k0266m1187N126J1861m2259n7459k1935q881m0710n9962m8160l5525
$$ 741599143 741578877 741537690 741542816 741554677 741512418 741454959 741433024 741424143 741383433 741323471 741275311 741239786
2215G41239786o2406r5844o2287l5465p7784j21117j05619n2392n3466j05977j05142
$$ 741239786 741177380 741081536 741019249 740983784 740906000 740784883 740679264 740626872 740573406 740467429 740362287
2237.4G40362287o0738q7261j27911m8399J9192n8770j25825o8128O318k0981r1076
$$ 740362287 740301549 740214288 740086377 740037978 740057170 739998400 739872575 739804447 739810765 739789784 739698708
2259.8G39698708q4937l9160m9054p6831m6611O795J9789k3961n7817m6670r7394k03073
$$ 739698708 739613771 739574611 739525557 739448726 739402115 739408910 739428699 739404738 739346921 739300251 739202857 738999784
2284.3G38999784k19882j59800j65343k34127k61664k40386k40028k94804l47913l77178
$$ 738999784 738779902 738620102 738454759 738220632 737958968 737718582 737478554 737183750 736835837 736458659
2304.7G36458659m56035n10395m29749l39210m46200p04110p68483n11884k59102l32296
$$ 736458659 736002624 735492229 735062480 734723270 734277070 733572960 732804477 732292593 732033491 731701195
2325.1G31701195n41866m31656q4699o7710l20852l59059j60575K02835J070023J657784
$$ 731701195 731159329 730727673 730642974 730575264 730254412 729895353 729734778 729937613 731007636 732665420
2345.5G32665420j65761k516568k744078j331866l24130r358K61545N77092R17256
$$ 732665420 732499659 729983091 727239013 725907147 725583017 725573659 725835204 726412296 727329552
2363.8G27329552J093745J084984J053929R73106Q05318O06835L86953J70291j1743
$$ 727329552 728423297 729508281 730562210 731535316 732340634 732947469 733334422 733504713 733492970
2382.2G33492970j44660k07782j89602j79053k14934k34187k07901j89542k15173k26617
$$ 733492970 733348310 733140528 732950926 732771873 732556939 732322752 732114851 731925309 731710136 731483519
2402.6G31483519k14100k06411k04384k38717k56478j94848k08378l08037l01659k32398
$$ 731483519 731269419 731063008 730858624 730619907 730363429 730168581 729960203 729652166 729350507 729118109
2423G29118109k30432k69949k84553k68340k82764l43442l32654k56359k49625l07798
$$ 729118109 728887677 728617728 728333175 728064835 727782071 727438629 727105975 726849616 726599991 726292193
2443.4G26292193l21269k81036k81930l36647l66092l39389l24428l64184l96013l71337
$$ 726292193 725970924 725689888 725407958 725071311 724705219 724365830 724041402 723677218 723281205 722909868
2463.8G22909868l57032m16935m71413m38034m18961m95315n63323n52059n08368n11050
$$ 722909868 722552836 722135901 721664488 721226454 720807493 720312178 719748855 719196796 718688428 718177378
2484.2G18177378n29170n09083n19514n74470o03139n41747m44710m55856n21064m97341
$$ 718177378 717648208 717139125 716619611 716045141 715442002 714900255 714455545 713999689 713478625 712981284
2504.6G12981284m44591m85063n49197n27263m93765n20527n12779m10616l20494l19839
$$ 712981284 712536693 712051630 711502433 710975170 710481405 709960878 709448099 709037483 708716989 708397150
2525G08397150l55899l42667k67566k34544k83062k77698j97113k14934l33548l66330
$$ 708397150 708041251 707698584 707431018 707196474 706913412 706635714 706438601 706223667 705890119 705523789
2545.4G05523789k87891k68399l18408k93911k30610k56896l46124l73364l29375k89023
$$ 705523789 705235898 704967499 704649091 704355180 704124570 703867674 703521550 703148186 702818811 702529788
2565.8G02529788k88963l20435l42011l60489m16517m55976l95656l39925m03106m74692
$$ 702529788 702240825 701920390 701578379 701217890 700801373 700345397 699949741 699609816 699206710 698732018
2586.2F98732018m39584l75330m01497m41849m18485m15146m70638n21302m84765m02629
$$ 698732018 698292434 697917104 697515607 697073758 696655273 696240127 695769489 695248187 694763422 694360793
2606.6F94360793l87371m38809m77016m50492m35710n03779n13792m18007m03166m93526
$$ 694360793 693973422 693534613 693057597 692607105 692171395 691667616 691153824 690735817 690332651 689839125
2626.9F89839125n29945m71413m30346m95314n62966n05567m41313m85122n21421m85063
$$ 689839125 689309180 688837767 688407421 687912107 687349141 686843574 686402261 685917139 685395718 684910655
2647.3F84910655m76480n42223o11365n97477n47647n74470o04331n30720m68433n44608
$$ 684910655 684434175 683891952 683280587 682683110 682135463 681560993 680956662 680425942 679957509 679412901
2667.7F79412901o49750n97298m71055m79937n89550o22153n59449n39243n84364n98669
$$ 679412901 678763151 678165853 677694798 677214861 676625311 676003158 675443709 674904466 674320102 673721433
2688.1F73721433n54025n46992o16193o07729n13077n09441n89132n78523m85301n08249
$$ 673721433 673167408 672620416 672004223 671396494 670883417 670373976 669784844 669206321 668721020 668212771
2708.5F68212771o15537n91457m69267m44949n13434n22614m38809l79384m39405n09441
$$ 668212771 667597234 667005777 666536510 666091561 665578127 665055513 664616704 664237320 663797915 663288474
2728.9F63288474m55320l83436m07875m31836l55541k84195l39568m08649l53754k92003
$$ 663288474 662833154 662449718 662041843 661610007 661254466 660970271 660630703 660222054 659868300 659576297
2749.3F59576297l72768m56154l92795l23951l91126m86731m63367m07338m68194n58853
$$ 659576297 659203529 658747375 658354580 658030629 657639503 657152772 656689405 656282067 655813873 655255020
2769.7F55255020n23627m45366m86553n87106n96225n44250n87284o83666o51717n73575
$$ 655255020 654731393 654286027 653799474 653212368 652616143 652071893 651484609 650800943 650149226 649575651
2790.1F49575651o43194p78914p84456p08699p41661q56757q87335q42273q61823r52304
$$ 649575651 648932457 648153543 647369087 646660388 645918727 645061970 644174635 643332362 642470539 641518235
2810.5F41518235r80019r62675j036882j150132j200080j218616j293481j452863j597941
$$ 641518235 640538216 639575541 638538659 637388527 636188447 634969831 633676350 632223487 630625546
2828.9F30625546j665235j754522j979470k273977k582550l000319l548682m057884
$$ 630625546 628960311 627205789 625226319 622952342 620369792 617369473 613820791 609762907
2845.2F09762907m139900l508330k369463j170456k34962K49505K55764l1472m03761
$$ 609762907 605623007 602114677 599745214 598574758 598339796 598589301 598845065 598813593 598409832
2863.5E98409832p54893j004756j018584p41660m00603k52008k88904m03464n90384
$$ 598409832 597654939 596650183 595631599 594889939 594489336 594237328 593948424 593544960 592954576
2881.9E92954576q82626j194000j396477j472831j466751j401186j333952j320243
$$ 592954576 592071950 590877950 589481473 588008642 586541891 585140705 583806753 582486510
2898.2E82486510j305282j292825j368939j544059j837909k259016k675474k901971
$$ 582486510 581181228 579888403 578519464 576975405 575137496 572878480 570203006 567301035
2914.5E67301035k835810k473057j902103j221776n30541O2943N45203R15528J180708
$$ 567301035 564465225 561992168 560090065 558868289 558337748 558400691 558945894 559861422 561042130
2932.9E61042130J393914J557887J606822J487493J268268R98080O24120J45316k92897
$$ 561042130 562436044 563993931 565600753 567088246 568356514 569354594 569978714 570124030 569831133
2951.2E69831133m99666m24921j40667K33948O03080R53614J204491J252830J213133
$$ 569831133 569331467 568906546 568765879 568999827 569602907 570556521 571761012 573013842 574226975
2969.6E74226975J282514J437783J497984J457274J423001J346290J186848J053929
$$ 574226975 575509489 576947272 578445256 579902530 581325531 582671821 583858669 584912598
2985.9E84912598R76026Q15451N52297L39746J96338J9014k01225l77774m74573n52714
$$ 584912598 585888624 586704075 587256372 587596118 587792456 587811470 587610245 587232471 586757898 586205184
3006.3E86205184n89013n09619m13001l92616l98397m14372m82857n82456o71685p47264
$$ 586205184 585616171 585106552 584693551 584300935 583902538 583488166 583005309 582422853 581751168 581003904
3026.7E81003904p63952p25866p34687q11576q79646q76367q45492q88169r70363r96173
$$ 581003904 580239952 579514086 578779399 577967823 577088177 576211810 575366318 574478149 573507786 572511613
3047.1E72511613r68933r31203r08256r02652r34601r88901r68158q31604p15017p67649
$$ 572511613 571542680 570611477 569703221 568800569 567865968 566877067 565908909 565077305 564362288 563594639
3067.5E63594639q73744q91686q94844q58486p43270p32720q45372q88944q38518p77006
$$ 563594639 562720895 561829209 560934365 560075879 559332609 558599889 557754517 556865573 556027055 555250049
3087.9E55250049p85947q74877q49068p08044p09534q10861q42869q15511p74920q10266
$$ 555250049 554464102 553589225 552740157 552032113 551322579 550511718 549668849 548853338 548078418 547268152
3108.3E47268152r22858r28224q22126q18193r36985j030386j060247j067937j029730
$$ 547268152 546345294 545417070 544594944 543776751 542839766 541809380 540749133 539681196 538651466
3126.6E38651466r81927j006007j056790j083970j041711r99271j091302j184106j163125
$$ 538651466 537669539 536663532 535606742 534522772 533481061 532481790 531390488 530206382 529043257
3145E29043257j128971j101852j064777j119614j251459j292348j221716j154304j177013
$$ 529043257 527914286 526812434 525747657 524628043 523376584 522084236 520862520 519708216 518531203
3163.4E18531203j264870j288891j227855j187683j218378j280666j274645j241982
$$ 518531203 517266333 515977442 514749587 513561904 512343526 511062860 509788215 508546233
3179.7E08546233j276135j297832j286745j276851j262962j296223j344114j298607
$$ 508546233 507270098 505972266 504685521 503408670 502145708 500849485 499505371 498206764
3196D98206764j253396j321256j365185j324504j298666j271278j234591j248777j255214
$$ 498206764 496953368 495632112 494266927 492942423 491643757 490372479 489137888 487889111 486633897
3214.3D86633897j268864j315653j301080j290918j333355j290530j176686j129925
$$ 486633897 485365033 484049380 482748300 481457382 480124027 478833497 477656811 476526886
3230.7D76526886j162171j224995j230806j181006j167745j120060r90361r72718j102627
$$ 476526886 475364715 474139720 472908914 471727908 470560163 469440103 468449742 467477024 466374397
3249D66374397j130491j003832r13143r75668j047314j012116r74566r78887r70096
$$ 466374397 465243906 464240074 463326931 462351263 461303949 460291833 459317267 458338380 457368284
3267.4D57368284r26464r13918r23217r23305r69440r82732r40948r57639r84013r40442
$$ 457368284 456441820 455527902 454604685 453681380 452711940 451729208 450788260 449830621 448846608 447906166
3287.8D47906166q85278q81552r46075j011461j030803j053423j020848r23574r47356
$$ 447906166 447020888 446139336 445193261 444181800 443150997 442097574 441076726 440153152 439205796
3306.1D39205796j108528j237183j244158j181752j178473j277208j380652j403183
$$ 439205796 438097268 436860085 435615927 434434175 433255702 431978494 430597842 429194659
3322.4D29194659j399815j451671j511872j541764j578927j585602j546562j598001
$$ 429194659 427794844 426343173 424831301 423289537 421710610 420125008 418578446 416980445
3338.8D16980445j712322j713157j644015j553386j447887j457214j525521j447231
$$ 416980445 415268123 413554966 411910951 410357565 408909678 407452464 405926943 404479712
3355.1D04479712j327544j345813j395405j344532j182735j087516j215011j418143
$$ 404479712 403152168 401806355 400410950 399066418 397883683 396796167 395581156 394163013
3371.4C94163013j440406j273632j118601j064926j100570j059920r09805q39889q02279
$$ 394163013 392722607 391448975 390330374 389265448 388164878 387104958 386195153 385355264 384552985
3389.7C84552985p93606r47743j019538p82519n73099p02083r22084q80867o78539
$$ 384552985 383759379 382811636 381792098 381009579 380436480 379734397 378812313 377931446 377252907
3408.1C77252907n43118n14835n68569n94526m68225k76684k21402k68817k06172n9992
$$ 377252907 376709789 376194954 375626385 375031859 374563634 374286950 374065548 373796731 373590559 373530567
3428.5C73530567j7703L1054J38968P8798j08153r8884R9003K91497M67628M66228
$$ 373530567 373512864 373543918 373682886 373761684 373653531 373554647 373653650 373945147 374412775 374879003
3448.9C74879003L69250M24296M91917N50419O71149P24643P69675R27180J045883
$$ 374879003 375248253 375672549 376164466 376714885 377386034 378110677 378880352 379807532 380853415
3467.2C80853415Q84890N98788N86957P94202R30399R65983R98735J004010J038611
$$ 380853415 381738305 382337093 382924050 383718252 384648651 385614634 386613369 387617379 388655990
3485.6C88655990J100511J070916J040370J124441J246959J193375J112640J353204
$$ 388655990 389756501 390827417 391867787 392992228 394239187 395432562 396545202 397898406
3501.9C97898406J447558J055330J057506J513213J619488J397699J224607J211852
$$ 397898406 399345964 400401294 401458800 402972013 404591501 405989200 407213807 408425659
3518.2D08425659J345664J638860J743644J586527J642674J716912J582652J698613
$$ 408425659 409771323 411410183 413153827 414740354 416383028 418099940 419682592 421381205
3534.5D21381205J916677J714349J467943J643539K145379K304584J764029J653821
$$ 421381205 423297882 425012231 426480174 428123713 430269092 432573676 434337705 435991526
3550.9D35991526K166956K071917J738072J934707J934201J360952J888693L941118
$$ 435991526 438158482 440230399 441968471 443903178 445837379 447198331 449087024 453028142
3567.2D53028142L859133J879007J512706K296865K681315K643078K242297J630664
$$ 453028142 456887275 458766282 460278988 462575853 465257168 467900246 470142543 471773207
3583.5D71773207K266050M283905L972649J960188K194554L280967L169001L114134
$$ 471773207 474039257 478323162 482295811 484255999 486450553 489731520 492900521 496014655
3599.8D96014655L143072K197802J954138L526688M134893L307820K746462K100706
$$ 496014655 499157727 501355529 503309667 506836355 510971248 514279068 517025530 519126236
3616.1E19126236L435135N290747L147304K79605Q04782O248236Q292019L450275K092123
$$ 519126236 522561371 527852118 530999422 531279027 532083809 538332045 546624064 550074339 552166462
3634.5E52166462K872467K857804K851308J996457N43654J883090P399142Q356630
$$ 552166462 555038929 557896733 560748041 562744498 563288152 565171242 572570384 580927014
3650.8E80927014K169073P17819M089057L791213J817107J597464O54758J76727L381193
$$ 580927014 583096087 583813906 587902963 591694176 593511283 595108747 595763505 595940232 599321425
3669.2E99321425M349112J068891M317700O183207J169622n14328q24630j481116J095414
$$ 599321425 603670537 604739428 609057128 615240335 616409957 615895629 615070999 613589883 614685297
3687.5F14685297N180717L486156k80857j033723n22376P22647K932251K390206n95272
$$ 614685297 619866014 623352170 623071313 622037590 621515214 622237861 625170112 627560318 626965046
3705.9F26965046r56476K245367N456567K694606j422166j578928j28328P12931J076758
$$ 626965046 626008570 628253937 633710504 636405110 634982944 633404016 633275688 633988619 635065377
3724.2F35065377J106024q04544k385139l60787L444731M544914L77297m571199k740503
$$ 635065377 636171401 635366857 632981718 632620931 636065662 640610576 640987873 636416674 633676171
3742.6F33676171M488886K308309j813770L417492M452289j264453k442420O03616
$$ 633676171 638165057 640473366 638659596 642077088 646529377 645264924 642822504 643426120
3758.9F43426120J251459r98616q81195L30687J411378J890838k92718j887679p17342
$$ 643426120 644677579 643678963 642797768 643128455 644539833 646430671 646137953 644250274 643532932
3777.3F43532932J477599J121044l71575J63793L82483k64704q37207j247227m21345
$$ 643532932 645010531 646131575 645760000 645923793 646306276 646041572 645204365 643957138 643535793
3795.6F43535793n05328k07961L065586J232863o94991J940251j68741l735185k375125
$$ 643535793 643030465 642822504 645888090 647120953 646425962 648366213 648197472 644462287 642087162
3814F42087162J666367R12189N49078L374755J63973k063215j135886j002788o65844
$$ 642087162 643753529 644665718 645214796 648589551 648753524 646690309 645554423 644551635 643885791
3832.3F43885791q64565L48091L085911J989305o5386m09365k161622m769146m205883
$$ 643885791 643021226 643369317 646455228 648444533 648379147 647969782 645808160 641039014 636833131
3850.7F36833131M551947R959221K25842n003869l236056K9624J233339q29756J550
$$ 636833131 641385078 651344299 651570141 646566272 643330216 643359840 644593179 643763423 643764973
3869F43764973K413630Q28505p21216k058208j208127R06050N841J028955O74606j625300
$$ 643764973 646178603 647007108 646285892 644227684 643019557 643925607 643931448 644960403 645635009 644009709
3889.4F44009709N89490J025498k447963k651929J98364K036154K651990J623630r72569
$$ 644009709 644599199 645624697 643176734 640524805 640723169 642759323 645411313 647034943 646062374
3907.8F46062374j846433j310169j155734j31846J259864N50806p09295j65582K38121
$$ 646062374 644215941 642905772 641750038 641618192 642878056 643428862 642719567 642553985 642792106
3926.1F42792106p52449m60327J042485P08282p33077j128674n86867M19497L89815
$$ 642792106 642039657 641579330 642621815 643330097 642597020 641468346 640881479 641300976 641690791
3944.5F41690791l86834P2717M77016q9526m28081l37958k18332N067J28984j58191
$$ 641690791 641303957 641376674 641853690 641764164 641336083 640998125 640779793 640784860 640913844 640755653
3964.9F40755653l27289j68860o3002j9550P8738l4094k72691j95623L934l1948j45137
$$ 640755653 640428364 640259504 640196502 640176952 640255690 640221596 639948905 639753282 639757216 639725268 639580131
3987.3F39580131j06991k4199m8459p8440q0287
$$ 639580131 639473140 639448941 639400482 639322042 639241755
3997.5F39241755
$$ 639241755
##END=$$ End of the data block
