##TITLE=T3PT $$ Begin of the data block
##JCAMP-DX=5.00 $$ ACD/SpecManager v 10.08
##SPECTROMETER/DATA SYSTEM=Alpha
##DATE=11 Mar 2014 10:52:32
##DATA TYPE=INFRARED SPECTRUM
##DATA CLASS=XYDATA
##ORIGIN=
##OWNER=
##NPOINTS=1765
##FIRSTX=399.75695801
##LASTX=3997.56933594
##MAXX=3997.56933594
##MINX=399.75695801
##MAXY=0.77613539
##MINY=0.47059867
##XFACTOR=1.0000000000
##YFACTOR=1.000000000000000e-9
##FIRSTY=0.67036289
##DELTAX=2.03957629
##XUNITS=1/CM
##YUNITS=ARBITRARY UNITS
##XYDATA=(X++(Y..Y))
399.8F70362890K150655J139879N56588J237631K250492J950860R12190O49392J309395
$$ 670362890 672513545 673653424 674210012 675447643 677698135 679648995 680561185 681210577 682519972
418.1F82519972J630307O53088j23203k8849L59655N07295K63810j39773l6299O03258
$$ 682519972 684150279 684803367 684680164 684651315 685010970 685518265 685782075 685642302 685606003 686209261
438.5F86209261O51598q881j06990L20196J39713l53574k16842N39064P74086o5804
$$ 686209261 686860859 686851978 686744988 687065184 687204897 686851323 686634481 687173545 687947631 687881827
458.9F87881827l87966L13580N50747k13385p93099k76924M47810K15054m49777l05176
$$ 687881827 687493861 687807441 688358188 688144803 687351704 687074780 687522590 687737644 687287867 686982691
479.3F86982691M14372M27544j93358l26275K82049P02262J65283l43978J09315N88894
$$ 686982691 687397063 687824607 687631249 687304974 687587023 688289285 688454568 688110590 688219905 688808799
499.7F88808799K84135l85284n48780k5332K25127l34919p51019l11255J35660k63631
$$ 688808799 689092934 688707650 688158870 688133538 688358665 688023746 687272727 686961472 687097132 686833501
520.1F86833501p65443m59075L09765M07339k35379m42207J07109N53370K97189j85192
$$ 686833501 686068058 685608983 685918748 686326087 686090708 685648501 685755610 686308980 686606169 686420977
540.5F86420977n3108M29571J59562p26402q32796j13905O3300n75065q73804k08974
$$ 686420977 686367869 686797440 686957002 686230600 685397804 685283899 685347199 684772134 683898330 683689356
560.9F83689356M27484J9610p23421n94378R0182R9480n80132p16150O3360O39618
$$ 683689356 684116840 684136450 683413029 682818651 682908833 683008313 682428181 681712031 681775391 682415009
581.3F82415009L68356N3406M74811J016378O99401q5294j46926L92616L79145k73228
$$ 682415009 682783365 682836771 683311582 684327960 685027361 684942067 684795141 685187757 685566902 685293674
601.7F85293674n45740j89185J0491l13998n82456j95921M93110Q00251P49290Q47280
$$ 685293674 684747934 684558749 684569240 684255242 683672786 683476865 683969975 684770226 685519516 686366796
622.1F86366796J211167J327157R45091N54681P16805J210511J289845Q50022N64098
$$ 686366796 687577963 688905120 689850211 690404892 691121697 692332208 693622053 694472075 695036173
640.4F95036173Q33690J126349P49886J37508K03192O53148O00517J3947l39329l398
$$ 695036173 695869863 696996212 697746098 697883606 698086798 698739946 699340463 699354410 699015081 699011683
660.8F99011683L97146J73509l19600P8023R96291R54986N19693M53234R07898J076400
$$ 699011683 699408829 699582338 699262738 699340761 700337052 701292038 701811731 702264965 703172863 704249263
681.2G04249263N49435n9J16765N27442L32177m45426q86202q01980n00083l28482
$$ 704249263 704798698 704798639 704915404 705442846 705775023 705329597 704443395 703641415 703141332 702812850
701.6G02812850p44342j328111j751184k555967k864301j141667J247644K203524K282441
$$ 702812850 702068508 700740397 698989213 696433246 693568945 692427278 693674922 695878446 698160887
720F98160887K794444L887713M615069M059612K786935K036154J836538J307905L58224
$$ 698160887 700955331 704843044 709458113 713517725 716304660 718340814 720177352 721485257 721843481
738.3G21843481j3769O35147J313627J050890L85880M14789R35256P75099j37150n69999
$$ 721843481 721829712 722464859 723778486 724829376 725215256 725630045 726565301 727340400 727203250 726633251
758.7G26633251j27614J03831m90427q59916o9439J059711J258313P80046Q30889J488745
$$ 726633251 726505637 726609468 726119041 725259125 725189686 726249397 727507710 728287756 729118645 730607390
779.1G30607390J612544P97749J55628N74410J241505J019657M46021O58572J364112
$$ 730607390 732219934 733017683 733173311 733747721 734989226 736008883 736454904 737113476 738477588
797.5G38477588J432001P51019L81231P51436R72748M14312j65940O5327O11961N53131
$$ 738477588 739909589 740660608 741041839 741793275 742766023 743180335 743014395 743079722 743691683 744244814
817.9G44244814L4630m6968M26769N74768K0146m71771l69966k33948o78897j336694
$$ 744244814 744279444 744232476 744659245 745234013 745254159 744782388 744412422 744178474 743499577 742162883
838.3G42162883j601100j541078j786291k617836l051162l004193l763497m380882
$$ 742162883 740561783 739020705 737234414 734616578 731565416 728561223 724797726 720416844
854.6G20416844l175616j194179k92540j167655l979027r079874j6112268k1354317
$$ 720416844 717241228 716047049 715754509 714586854 710607827 701527953 685415685 664061368
870.9F64061368j9926072j1657953P74682J4261186K2565007K1778524J6087472J0857046
$$ 664061368 644135296 632477343 633252025 647513211 670078218 691856742 707944214 718801260
887.2G18801260P193506M594087K809406J841843J828134K334237K437592J909971
$$ 718801260 725994766 730588853 733398259 735240102 737068236 739402473 741840065 743750036
903.5G43750036J414716J365662J161158J56283j078606j592934j651227k216876l124118
$$ 743750036 745164752 746530414 747691572 747847855 746769249 745176315 743525088 741308212 738184094
921.9G38184094l218472k273678j361132j079321p02441M31478J577855J613378R34362
$$ 738184094 734965622 732691944 731330812 730251491 729549050 729980528 731558383 733171761 734106123
940.2G34106123P66337J060129O24597p22587j662851j535714j420080k252340l230811
$$ 734106123 734872460 735932589 736557186 735834599 734171748 732636034 731215954 728963614 725732803
958.6G25732803l182649k495349k411306k929389k914548k205670j997471k880871
$$ 725732803 722550154 720054805 717643499 714714110 711799562 709593892 707596421 704715550
974.9G04715550l877163l971398l704071m086852m681766m415631l494561l052771
$$ 704715550 700838387 696866989 693162918 689076066 684394300 679978669 676484108 673431337
991.2F73431337l359079l422022k668560j983285k197623k760887k810836k603173
$$ 673431337 670072258 666650236 663981676 661998391 659800768 657039881 654229045 651625872
1007.5F51625872k970279l790915m033863l381550k748728k733827k743840k130747
$$ 651625872 648655593 644864678 640830815 637449265 634700537 631966710 629222870 627092123
1023.9F27092123j280189j025676j345992j403928q38816k65837k71618n18144l81708
$$ 627092123 625811934 624786258 623440266 622036338 621197522 620931685 620660067 620141923 619760215
1042.2F19760215l7133r3282m75764m69685Q8156M97102L71516K59817P72774J443565
$$ 619760215 619723082 619629800 619154036 618684351 618772507 619269609 619641125 619900942 620673716 622117281
1062.6F22117281J318932M72128k45452n95868j021981j520693j461804p22110J87039
$$ 622117281 623436213 623908341 623662889 623067021 622045040 620524347 619062543 618340433 618527472
1081F18527472J132309K017081K627313L099442L206968K738595K312780K320349K251565
$$ 618527472 619659781 621676862 624304175 627403617 630610585 633349180 635661960 637982309 640233874
1099.3F40233874J713336J126170R90033J092553R43423O71029Q42154J425564J714885
$$ 640233874 641947210 643073380 644063413 645155966 646099389 646770418 647612572 649038136 650753021
1117.7F50753021J398564J001000J063466J359046J366675J199245J213133J249850
$$ 650753021 652151585 653152585 654216051 655575097 656941772 658141017 659354150 660604000
1134F60604000R18090J55747n85496r45687j175106j539886j768351j542687j059949
$$ 660604000 661522090 661677837 661092341 660146654 658971548 657431662 655663311 654120624 653060675
1152.4F53060675o61850l44575J30236Q44300J613259K257884K764881L190815L459573
$$ 653060675 652398825 652054250 652184486 653028786 654642045 656899929 659664810 662855625 666315198
1170.7F66315198L399253L108382K883077K736270K425730J886964J343429R77636
$$ 666315198 669714451 672822833 675705910 678442180 680867910 682754874 684098303 685075939
1187F85075939O94453L28958k4080j61767j51634k30491m10497n02110m03762k50101
$$ 685075939 685770392 686099350 686075270 685913503 685761869 685531378 685120881 684618771 684215009 683964908
1207.4F83964908k17974k76208l17276l50594m90069o85513p36893o42180o02663p00235
$$ 683964908 683746934 683470726 683153450 682802856 682312787 681627274 680890381 680248201 679645538 678945303
1227.8F78945303p80046p11322n73575n18144n59568n58913m25696l48330m18901m09007
$$ 678945303 678165257 677453935 676880360 676362216 675802648 675243735 674818039 674469709 674050808 673641801
1248.2F73641801k01404l100j4603r2506q106J79529K24292J41621J61767L36647M30405
$$ 673641801 673440397 673437297 673422694 673330188 673322082 673501611 673725903 673867524 674029291 674365938 674796343
1270.6F74796343L05891J67012K17676K97189J78993Q2373K16961L87192K45810j43409
$$ 674796343 675102234 675269246 675486922 675784111 675963104 676045477 676262438 676649630 676895440 676752031
1291F76752031l55721k68757k64943n92589r09984q99971p60197q93772j224399j350879
$$ 676752031 676396310 676127553 675862610 675270021 674360037 673460066 672699869 671806097 670581698 669230819
1311.4F69230819j158238j015842j092672j077950q33869o93262r98914j454055j612425
$$ 669230819 668072581 667056739 665964067 664886117 664052248 663358986 662360072 660906017 659293592
1329.8F59293592j546741j650810j848280j760900j357377j122117j333833j612007
$$ 659293592 657746851 656096041 654247761 652486861 651129484 650007367 648673534 647061527
1346.1F47061527j653016j634955j973629k449155k556503k327561k294660k648890
$$ 647061527 645408511 643773556 641799927 639350772 636794269 634466708 632172048 629523158
1362.4F29523158k935409k891720k836406k970576l099084l030539k758622k792120
$$ 629523158 626587749 623696029 620859623 617889047 614789963 611759424 609000802 606208682
1378.7F06208682l280640l599107l241718k881229l350913m069150m711032n438506
$$ 606208682 602928042 599328935 596087217 593205988 589855075 585785925 581074893 575636387
1395.1E75636387o134749o980240p454693p510543q012593q302808q216440q062005
$$ 575636387 569501638 562521398 555066705 547556162 539543569 531240761 523024321 514962316
1411.4E14962316p648230p102430o727338o127655m277200k443015j285613l51101
$$ 514962316 507314086 500211656 493484318 487356663 483079463 480636448 479350835 478999734
1427.7D78999734O34313J267582J383900J769036K003938J405716J059473Q50111O41644
$$ 478999734 479634047 480901629 482285529 484054565 486058503 487464219 488523692 489373803 490015447
1446D90015447P08372O88076M18901K74956R92179J832962J180589P36028J070828
$$ 490015447 490723819 491411895 491830796 492105752 493097931 494930893 496111482 496847510 497918338
1464.4D97918338J202404Q96961J100421J962721K312362K074719J966059J967072
$$ 497918338 499120742 500017703 501118124 503080845 505393207 507467926 509433985 511401057
1480.7E11401057K070964K165138K514899L142893L274978K641141K868712M090190
$$ 511401057 513472021 515637159 518152058 521294951 524569929 527211070 530079782 534169972
1497E34169972M257023L440559K907694M041671O439925N095839L453851L654897M243553
$$ 534169972 538426995 541867554 544775248 548816919 555256844 560352683 563806534 567461431 571704984
1515.4E71704984M663288M717589N490064N211294M131615L945172L366172L395379
$$ 571704984 576368272 581085861 586575925 591787219 595918834 599864006 603230178 606625557
1531.7F06625557M033208K981245K258718M167676M835666L325462K745390K671659
$$ 606625557 610658765 613640010 615898728 620066404 624902070 628227532 630972922 633644581
1548F33644581L027081L029406K630771K346217L983081M928588J941741J030564J419247
$$ 633644581 636671662 639701068 642331839 644678056 648661137 653589725 655531466 656562030 657981277
1566.4F57981277J815259J859844P45237M60803J319945Q44419k861j33753j20401
$$ 657981277 659796536 661656380 662401617 662862420 664182365 665026784 665023923 664890170 664769769
1584.7F64769769k60651o11782j041711j222133j220406j366555j644135j834452j888454
$$ 664769769 664509118 663897336 662855625 661633492 660413086 659046531 657402396 655567944 653679490
1603.1F53679490k010822k222181k492070k701998k737522k603113k621472k686620
$$ 653679490 651668668 649446487 646954417 644252419 641514897 638911784 636290312 633603692
1619.4F33603692k473772k250731k208352k159655j969039j749575j232207m21882
$$ 633603692 631129920 628879189 626670837 624511182 622542143 620792568 619560361 619138479
1635.7F19138479k82585l98219q8155L55839J351774J789987Q31127J836300L873587
$$ 619138479 618855894 618457675 618369520 618725359 620077133 621867120 622698247 624534547 628408134
1654.1F28408134K054691J142919J923979K846598K859116K184570K787053L599584
$$ 628408134 630462825 631605744 633529723 636376321 639235437 641420007 644207060 647806644
1670.4F47806644K810717K921283L450692K637208K066612K967238M864335L842116
$$ 647806644 650617361 653538644 656989336 659626544 661693156 664660394 669524729 673366845
1686.7F73366845K484083K624988K455414L283977M029751L991008M788101L467857
$$ 673366845 675850928 678475916 680931330 684215307 688245058 692236066 697024167 700492024
1703G00492024K763749L214597K594471K047479J929522K250910L075242K500295J197339
$$ 700492024 703255773 706470370 709064841 711112320 713041842 715292752 718367994 720868289 722065628
1721.4G22065628J107573J256824J060903R63568J070321K136469K066851P90000J130282
$$ 722065628 723173201 724430025 725490928 726454496 727524817 729661286 731728137 732518137 733648419
1739.7G33648419J557410J260996J187146J411974J936853J930416J178801J114607
$$ 733648419 735205829 736466825 737653971 739065945 741002798 742933214 744112015 745226622
1756.1G45226622J278698J186848J414239J029551O03855P44521R47714J362205R70125
$$ 745226622 746505320 747692168 749106407 750135958 750739813 751484334 752432048 753794253 754764378
1774.4G54764378O7532l1710K03133J53601M1962j47343l99053m4763N03004J09970
$$ 754764378 754831910 754800200 755003333 755156934 755198896 755051553 754652500 754607737 755110741 755220711
1794.8G55220711k73466P2897N72860O59585N47290O45339R07481J120686J031816
$$ 755220711 754947245 755020142 755593002 756252587 756799877 757445216 758352697 759473383 760505199
1813.2G60505199R03488R58323Q99375O60061O55652P64429N94676P34985P71284L43084
$$ 760505199 761408687 762367010 763266385 763926446 764582098 765346527 765941203 766676188 767447472 767790556
1833.6G67790556K86996L95060J88827J49072P00116P74860K25425J42276K53678K63035
$$ 767790556 768077552 768472612 768661439 768810511 769510627 770285487 770510912 770653188 770906866 771169901
1854G71169901K49207K61664K87831K05398L0517Q7619N23806N75959J12832R54J54912
$$ 771169901 771419108 771680772 771968603 772174001 772204518 772292137 772815943 773391902 773504734 773505688 773660600
1876.4G73660600J93477J40846J06930R8646Q4579K19941K62022P4208J01686J72495
$$ 773660600 773854077 773994923 774101853 774200499 774285078 774505019 774767041 774841249 774942935 775115430
1896.8G75115430O5387L8683J09315J19627Q0287J06752J10030l0935j01745R5189
$$ 775115430 775180817 775219500 775328815 775448442 775528729 775635481 775745511 775714576 775612831 775708020
1917.2G75708020J61230L4154R8467O3359m4465N424M6671J1742o1870r9599m8220
$$ 775708020 775869250 775903404 776001871 776065230 776020765 776026189 776072860 776084602 776022732 775923133 775874913
1939.6G75874913J22726J37746m7326m8757L5763j7881q7261k9684N6506K7299q9288
$$ 775874913 775997639 776135385 776088059 776039302 776075065 776057184 775969923 775940239 775996745 776024044 775934756
1962.1G75934756r6739P8261J51337l9101j53720k1518J01328M1068q7321r0599j6213
$$ 775934756 775838017 775916278 776067615 776028514 775874794 775853276 775954604 775995672 775908351 775817752 775801539
1984.5G75801539l7252j44423j01745N9307L3855j09911j88171j44184m3392o6400
$$ 775801539 775764287 775619864 775518119 775577426 775611281 775501370 775313199 775169015 775125623 775059223
2004.9G75059223j80185j72972o4075o8724j72318j89244j29104j05560j59919k44081
$$ 775059223 774879038 774706066 774641991 774573267 774400949 774211705 774082601 773977041 773817122 773573041
2025.3G73573041j99914o8486o5744j78635k20895j35362l8862p5996j96695j89960
$$ 773573041 773373127 773304641 773238897 773060262 772839367 772704005 772665143 772589147 772392452 772202492
2045.7G72202492n9486r536r5129j25409k6404J9252p3314j57535o7472O7710L3498
$$ 772202492 772143006 772133470 772038341 771912932 771886528 771905780 771832466 771674931 771607459 771675169 771708667
2068.1G71708667p5996q8572j8895J8001l3081q1599l4511L5346K1040m0173m5955
$$ 771708667 771632671 771544099 771525204 771543205 771510124 771428525 771394014 771429360 771450400 771410227 771364272
2090.5G71364272l755R059m2378p4149j2338L7790k1339r2506p1764j9968L696k0564
$$ 771364272 771360517 771369576 771327198 771253049 771240711 771278501 771257162 771164656 771092892 771072924 771076620 771056056
2115G71056056o6698m4941J5854n781p1526n9962k921N722l8862n8413j5020L7730
$$ 771056056 770989358 770944417 770960271 770954490 770882964 770823002 770820081 770825803 770786941 770728528 770713508 770751238
2139.5G70751238M8816M0352M7923O6876P2360L1948m649L1292J05560J31130Q8752
$$ 770751238 770800054 770840406 770888329 770955205 771027565 771059513 771054864 771086156 771191716 771322846 771411598
2161.9G71411598N8293Q7023J18971J08242Q6546J16646J87099J81496Q6725M3809
$$ 771411598 771469891 771556914 771675885 771784127 771870673 771987319 772174418 772355914 772442639 772486448
2182.3G72486448J10209J60337R2387J2994O3717J53065J37806N6147J5855N3227Q7261
$$ 772486448 772596657 772756994 772849381 772862375 772926092 773079157 773216963 773273110 773288965 773342192 773429453
2204.8G73429453N5850J4901L6001Q1718O2228L516j1861L7312N8890p16l5226J6332
$$ 773429453 773485303 773500204 773536205 773617923 773680151 773683667 773671806 773709118 773768008 773767292 773732066 773748398
2229.2G73748398O0737K3544j7643L636M0412M4644N066l0696J0073P2896O2525J8716
$$ 773748398 773809135 773832679 773815036 773818672 773859084 773903728 773908794 773878098 773888171 773961067 774023592 774042308
2253.7G74042308O080K8789N0306L2545J7762O0737J04070Q4400L1352J2040N2571
$$ 774042308 774048388 774077177 774127483 774160028 774177790 774238527 774342597 774426997 774458349 774470389 774522960
2276.1G74522960O4492M888m4227m0769j6332k7358q5056j08242m7684k1935r9658
$$ 774522960 774587452 774592340 774548113 774507344 774491012 774463654 774378598 774270356 774222672 774200737 774101079
2298.6G74101079j51277j39833j42276j80542k25365k06769j43588j68085k79188k91347
$$ 774101079 773949802 773809969 773667693 773487151 773261786 773055017 772911429 772743344 772464156 772172809
2319G72172809j40369k4498j11460k38240j25587Q7082j013k22147j86920M5657K97189
$$ 772172809 772032440 772007942 771896482 771658242 771532655 771619737 771618724 771396577 771209657 771255314 771552503
2341.4G71552503O67751O28829n98013j590133j244724l18348Q9943K26021L76105
$$ 771552503 772220254 772849083 772251070 770660937 769416213 769097865 769187808 769413829 769789934
2359.8G69789934L65794L84450M89712N38349M83632L48031K54631K19584J40726j7285
$$ 769789934 770155728 770540178 771029890 771568239 772051871 772399902 772654533 772874117 773014843 772997558
2380.2G72997558j76132k13563j56045j33574j68920j49190p2956o3062j28150j64866
$$ 772997558 772821426 772607863 772451818 772318244 772149324 772000134 771927178 771864116 771735966 771571100
2400.6G71571100j34647j00494j30534j93715j80602j13428j00135j68860k37108k09629
$$ 771571100 771436453 771335959 771205425 771011710 770831108 770717680 770617545 770448685 770211577 770001948
2421G70001948j54495j74284k29061k17974j58608j73450k44498k59697k16127j84715
$$ 770001948 769847453 769673169 769444108 769226134 769067526 768894076 768649578 768389881 768173754 767989039
2441.3G67989039k24709k79844k41756j74225k02357k71440k85029k61069k45094k94328
$$ 767989039 767764330 767484486 767242730 767068505 766866148 766594708 766309679 766048610 765803516 765509188
2461.7G65509188l63111l47674l12686l42667m15802m63307m60029m71353n29170n62132
$$ 765509188 765146077 764798403 764485717 764143050 763727248 763263941 762803912 762332559 761803389 761241257
2482.1G61241257n48005n61297o12914o43075o15060n56469n18084m91261m55320m32253
$$ 761241257 760693252 760131955 759519041 758875966 758260906 757704437 757186353 756695092 756239772 755807519
2502.5G55807519m16458m01675m43757n12660n10931m66704m33326l88741l22879k37405
$$ 755807519 755391061 754989386 754545629 754032969 753522038 753055334 752622008 752233267 751910388 751672983
2522.9G51672983j40369q5652o9379k325J12891J74463J53601J33991J40667J33932
$$ 751672983 751532614 751446962 751377583 751375258 751488149 751662612 751816213 751950204 752090871 752224803
2543.3G52224803J30713J10805Q3506J16468J49726R8527J5616j6629q405l1828p8738
$$ 752224803 752355516 752466321 752549827 752666295 752816021 752914548 752930164 752913535 752905130 752873302 752794564
2565.8G52794564p0989l2246l8922j02341j70649j76429j37747j41918j94669k09153
$$ 752794564 752723575 752691329 752652407 752550066 752379417 752202988 752065241 751923323 751728654 751519501
2586.2G51519501j57296j36674k05398k38895j77205j44720k03013k65658k39253j67668
$$ 751519501 751362205 751225531 751020133 750781238 750604033 750459313 750256300 749990642 749751389 749583721
2606.6G49583721j69277k29299k19524j50442j41204j94251k31505j95562j23024j30058
$$ 749583721 749414444 749185145 748965621 748815179 748673975 748479724 748248219 748052657 747929633 747799575
2626.9G47799575j94072j91689j46568j56283k15173k45988k17736j73390j75476k43425
$$ 747799575 747605503 747413814 747267246 747110963 746895790 746649802 746432066 746258676 746083200 745839775
2647.3G45839775k88666k49207k31683l00944l27229k52605k17795k70486l12448k93493
$$ 745839775 745551109 745301902 745070219 744769275 744442046 744189441 743971646 743701160 743388712 743095219
2667.7G43095219k62320k80917l16381l05235k65539k55466k93433l24190k90275k47478
$$ 743095219 742832899 742551982 742235601 741930366 741664827 741409361 741115928 740791738 740501463 740253985
2688.1G40253985k79844l48627l48032k80082k64764l24845l51608l20494l03269l23295
$$ 740253985 739974141 739625514 739277482 738997400 738732636 738407791 738056183 737735689 737432420 737109125
2708.5G37109125l45350l21209k70069k75731l17693l07381k67207k71678l15607l56018
$$ 737109125 736763775 736442566 736172497 735896766 735579073 735271692 735004485 734732807 734417200 734061182
2728.9G34061182l29972k45452k18510k68281k93672k35200j68800j89543k41041k43366
$$ 734061182 733731210 733485758 733267248 732998967 732705295 732470095 732301295 732111752 731870711 731627345
2749.3G31627345k45035k97188l27886k74479k08318k35140l21210l43680k97129k71857
$$ 731627345 731382310 731085122 730757236 730482757 730274439 730039299 729718089 729374409 729077280 728805423
2769.7G28805423k91109l27528l37541l16620l56972m32134m22060l66807l60370m28378
$$ 728805423 728514314 728186786 727849245 727532625 727175653 726743519 726321459 725954652 725594282 725165904
2790.1G25165904m98474m66347m21583m94063n93663n92827n44966n57542o02483o12617
$$ 725165904 724667430 724201083 723779500 723285437 722691774 722098947 721553981 720996439 720393956 719781339
2810.5G19781339o23047o71447p38382p99298q15332q12888q61466r24766r56416r79722
$$ 719781339 719158292 718486845 717748463 716949165 716133833 715320945 714459479 713534713 712578297 711598575
2830.9G11598575j046359j193345j354158j467764j632333j929820k268076k406001
$$ 711598575 710552216 709358871 708004713 706536949 704904616 702974796 700706720 698300719
2847.2F98300719k129793j548648r94801o54877m86910m22478m95135o81341q35538
$$ 698300719 696170926 694622278 693627477 692972600 692485690 692063212 691568077 690886736 690051198
2865.6F90051198r21726r99451j037002r78410q51035p81000q06510q12709q07822
$$ 690051198 689129472 688130021 687093019 686114609 685263574 684482574 683676064 682863355 682055533
2883.9F82055533q41320q78691r02772q66890p68125o75679o14583n68390n23984n19514
$$ 682055533 681214213 680335522 679432750 678565860 677797735 677122056 676507473 675939083 675415099 674895585
2904.3F74895585o25670q40664j076877j278460j425982j426518j199663q32796m62234
$$ 674895585 674269915 673429251 672352374 671073914 669647932 668221414 667021751 666188955 665726721
2922.7F65726721j59859P7784L18467N42343O64651P18058P99477R14573R57191Q88288
$$ 665726721 665566862 665644646 665963113 666505456 667170107 667888165 668687642 669602215 670559406 671447694
2943.1F71447694P91312P02202N96166M72188L27169K22683K60473L71456M22597M60922
$$ 671447694 672239006 672941208 673537374 674009562 674336731 674559414 674819887 675191343 675613940 676074862
2963.5F76074862N71371O91592P48694Q03352Q90016R49860J006424J075864J080036
$$ 676074862 676646233 677337825 678086519 678889871 679779887 680729747 681736171 682812035 683892071
2981.8F83892071J046717J024723R56417Q46207P56979O70135N41031L93391K78413
$$ 683892071 684938788 685963511 686919928 687766135 688523114 689193249 689734280 690127671 690406084
3000.2F90406084K17676J78159J01208R000j5258l1054j41859k55883k99096l37363
$$ 690406084 690623760 690801919 690903127 690912127 690896869 690865815 690723956 690468073 690168977 689831614
3020.6F89831614l88681m27127m69923n09143n10752n13494n72741o53923o63102o32822
$$ 689831614 689442933 689015806 688545883 688036740 687525988 687012494 686439753 685785830 685122728 684489906
3041F84489906o53267p17998p64131p38979p19726p74324q05318q07226q28981q03232
$$ 684489906 683836639 683118641 682354510 681615531 680895805 680121481 679316163 678508937 677679956 676876724
3061.4F76876724p37131o93083p12156p70628p83802p62701p16626o57976o80566p65621
$$ 676876724 676139593 675446510 674734354 673963726 673179924 672417223 671700597 671042621 670362055 669596434
3081.8F69596434q17716q11279p62105p76351q77738q89301p83026p30217p80940q73268
$$ 669596434 668778718 667967439 667205334 666428983 665551245 664661944 663878918 663148701 662367761 661494493
3102.2F61494493r14394q28624p82073r03070r46402q06332p42733q71480j048326
$$ 661494493 660580099 659751475 658969402 658066332 657119930 656313598 655570865 654699385 653651059
3120.5F53651059j141668j117527j066804j084030j118302j095235j048267r99272
$$ 653651059 652509391 651391864 650325060 649241030 648122728 647027493 645979226 644979954
3136.8F44979954j015127j150370j227200j217424j229465j158000j050472j147568
$$ 644979954 643964827 642814457 641587257 640369833 639140368 637982368 636931896 635784328
3153.2F35784328j344144j364887j289368j278877j315296j339614j320779j303018
$$ 635784328 634440184 633075297 631785929 630507052 629191756 627852142 626531363 625228345
3169.5F25228345j332521j367450j352966j311659j325071j409352j453340j399458
$$ 625228345 623895824 622528374 621175408 619863749 618538678 617129326 615675986 614276528
3185.8F14276528j348555j361906j396954j412809j385272j361727j407981j444936
$$ 614276528 612927973 611566067 610169113 608756304 607371032 606009305 604601324 603156388
3202.1F03156388j409173j384020j404285j414478j380742j329958j344622j420021
$$ 603156388 601747215 600363195 598958910 597544432 596163690 594833732 593489110 592069089
3218.4E92069089j432180j385450j382530j363695j280665j206935j186967j279234
$$ 592069089 590636909 589251459 587868929 586505234 585224569 584017634 582830667 581551433
3234.7E81551433j394153j361311j271009j209378j130939j138329j245439j275480
$$ 581551433 580157280 578795969 577524960 576315582 575184643 574046314 572800875 571525395
3251.1E71525395j207829j148343j161635j184821j176119j161098j100183r85741
$$ 571525395 570317566 569169223 568007588 566822767 565646648 564485550 563385367 562399626
3267.4E62399626r18269j012981j130998j125992j097500j087368j037836r79960r92179
$$ 562399626 561481357 560468376 559337378 558211386 557113886 556026518 554988682 554008722 553016543
3285.7E53016543j012325r72688r55999j020551j120507j174450j118064r90808r19521
$$ 553016543 552004218 551031530 550075531 549054980 547934473 546760023 545641959 544651151 543731630
3304.1E43731630j016259j225114j366139j401305j387000j354158j323521j341820
$$ 543731630 542715371 541490257 540124118 538722813 537335813 535981655 534658134 533316314
3320.4E33316314j390636j419663j486123j564562j608491j615346j516938j411438
$$ 533316314 531925678 530506015 529019892 527455330 525846839 524231493 522714555 521303117
3336.7E21303117j507938j678168j700879j648664j558006j442492j505971j696765
$$ 521303117 519795179 518117011 516416132 514767468 513209462 511766970 510260999 508564234
3353E08564234j694560j536489j462638j498461j496375j343905j259774j450211j686573
$$ 508564234 506869674 505333185 503870547 502372086 500875711 499531806 498272032 496821821 495135248
3371.4D95135248j671404j481056j338422j287491j273065j217962j125037r83239
$$ 495135248 493463844 491982788 490644366 489356875 488083810 486865848 485740811 484757572
3387.7D84757572p91937q26835j129300j184106q37713o24925q84205j176328j022934
$$ 484757572 483965635 483138800 482009500 480825394 479987681 479362756 478478551 477302223 476279289
3406.1D76279289p25806o32167o63489p15226p00444n45919l93242l82095l54082j90287
$$ 476279289 475553483 474921316 474257827 473542601 472842157 472296238 471902996 471520901 471166819 470976532
3426.5D70976532m2230n2631m2051P3313K4706j72585j66386L4362K60681M63277M09484
$$ 470976532 470934302 470881671 470839620 470912933 470937639 470765054 470598668 470633030 470893711 471356988 471766472
3448.9D71766472K73287L91781N58317O28680O93798P09504P33793R25511J084358
$$ 471766472 472039759 472431540 472989857 473618537 474312335 475021839 475755632 476681143 477765501
3467.2D77765501Q80658N54830N91427Q45194J010150J079410J021743R40263J017958
$$ 477765501 478646159 479200989 479792416 480637610 481647760 482727170 483748913 484689176 485707134
3485.6D85707134J098484J069397J075029J167476J260012J223177J230806J428336
$$ 485707134 486805618 487875015 488950044 490117520 491377532 492600709 493831515 495259851
3501.9D95259851J361758J026630J106173J439840J533508J421928J275957J259446
$$ 495259851 496621609 497648239 498754412 500194252 501727760 503149688 504425645 505685091
3518.2E05685091J410067J696944J755059J525760J500189J586080J595795J745581
$$ 505685091 507095158 508792102 510547161 512072921 513573110 515159190 516754985 518500566
3534.5E18500566J865566J666308J543820J800418K167046K112507J645685J653313
$$ 518500566 520366132 522032440 523576260 525376678 527543724 529656231 531301916 532955229
3550.9E32955229K014458J926959J806021K020180J970708J574517K044558L360808
$$ 532955229 534969687 536896646 538702667 540722847 542693555 544268072 546312630 549673438
3567.2E49673438L105998J842797J743019K246558K467573K509475K331912K032399
$$ 549673438 552779436 554622233 556365252 558611810 561079383 563588858 565920770 567953169
3583.5E67953169K568841L717602L130853J842856K254606K994656K837122K784550
$$ 567953169 570522010 574239612 577370465 579213321 581467927 584462583 587299705 590084255
3599.8E90084255K740681K115130K109349L141880L409326K964914K635360K171159
$$ 590084255 592824936 594940066 597049415 600191295 603600621 606565535 609200895 611372054
3616.1F11372054L107249M055262K353191N56350J228690M753828N347610K108455
$$ 611372054 614479303 618534565 620887756 621444106 622672796 627426624 632774234 634882689
3632.4F34882689J584291K145231K117812K107501J575530Q60274J970768N147040
$$ 634882689 636466980 638612211 640730023 642837524 644413054 645273328 647244096 652391136
3648.8F52391136M974007J071215P08282K791405K300799J158118J054346N07296N22017
$$ 652391136 657365143 658436358 659144640 661936045 664236844 665394962 666449308 666956604 667478621
3667.1F67478621K519548K577662Q14498L019214L374099M01140j58012k58029l50475
$$ 667478621 669998169 672575831 673390329 676409543 679783642 680184782 680026770 679768741 679418266
3685.5F79418266J640498L775359K098381r7990l33130l5644O17862J628101R52720
$$ 679418266 681058764 684834123 686932504 686834514 686501384 686465740 687083602 688711703 689664423
3703.8F89664423o56306n35071J406252K921999R52482j197755r25839M7266M71354
$$ 689664423 689008117 688473046 689879298 692801297 693753779 692556024 691630185 691677451 692148805
3722.2F92148805N34951L93153o76871j187384K03014K171874K386570l61979k878726
$$ 692148805 692683756 693076909 692400038 691212654 691415668 693587542 695974112 695612133 692733407
3740.5F92733407r55582L084958J028240q82745K302885K139807j106084j245677N40376
$$ 692733407 691777825 694862783 695891023 695008278 697311163 699450970 698344886 697099209 697639585
3758.9F97639585N55276o17683l02970L24369Q74161R22144l87848j029372j55449
$$ 697639585 698194861 697577178 697274208 697598577 698472738 699394882 699007034 697977662 697822213
3777.3F97822213R84609M97461l26217L6598J27613j60515m83930o35386r1612k66552
$$ 697822213 698806822 699304283 698978066 699014664 699142277 698981762 698497832 697862446 697770834 697504282
3797.7F97504282J41442J859009M05610l11256R88782n51164k130211r02951J141608
$$ 697504282 697645724 699504733 699910343 699599087 700587869 700036705 697906494 697003543 698145151
3816F98145151L80039N38588J782060l43085j237869o79433m88162j79589k79665M96149
$$ 698145151 698525190 699063778 700845838 700502753 699264884 698585451 698097289 697917700 697638035 698134184
3836.4F98134184J650929O77586k55764l54707j378298k648890j783609L278851N068839
$$ 698134184 699785113 700462699 700206935 699852228 698473930 695825040 694041431 697320282 702389121
3854.8G02389121p43151k926767j534640K33531N22315o35743J96338J312077K79903
$$ 702389121 701645970 698719203 697184563 697418094 697940409 697304666 697501004 698813081 699092984
3873.1F99092984n36024j220763m60267M81427o6281O37531J06156q83877N30601K63691
$$ 699092984 698556960 697336197 696875930 697357357 697291076 697928607 698034763 697150886 697681487 697945178
3893.5F97945178j578153j213610L85344J189828J366258N60343q37386j071274p38680
$$ 697945178 696367025 695153415 695538759 696728587 698094845 698655188 697817802 696746528 696007848
3911.9F96007848o15835O5624P49767K32399m45247j39892j6570m99964j58846N91457
$$ 696007848 695392013 695457637 696207404 696439803 695994556 695854664 695838094 695338130 695179284 695770741
3932.3F95770741K39789n06222o71089l47495K04980R0242k68042M7981J59502j67667
$$ 695770741 696010530 695504308 694833219 694485724 694690704 694780946 694512904 694560885 694720387 694552720
3952.7F94552720k76268j99020j25766K2054O7532j31607k31862j32263p6115n2094
$$ 694552720 694276452 694077432 693951666 693973720 694041252 693909645 693677783 693545520 693469405 693417311
3973.1F93417311K4020J669r1970r2744n4956j06871j58370p6294k0265p7069j17660
$$ 693417311 693441331 693443000 693351030 693258286 693203330 693096459 692938089 692861795 692841530 692764461 692646801
3995.5F92646801j13487
$$ 692646801 692533314
3997.5F92533314
$$ 692533314
##END=$$ End of the data block
