##TITLE=T3PR $$ Begin of the data block
##JCAMP-DX=5.00 $$ ACD/SpecManager v 10.08
##SPECTROMETER/DATA SYSTEM=Alpha
##DATE=11 Mar 2014 10:52:32
##DATA TYPE=INFRARED SPECTRUM
##DATA CLASS=XYDATA
##ORIGIN=
##OWNER=
##NPOINTS=1765
##FIRSTX=399.75695801
##LASTX=3997.56933594
##MAXX=3997.56933594
##MINX=399.75695801
##MAXY=0.80708110
##MINY=0.35481918
##XFACTOR=1.0000000000
##YFACTOR=1.000000000000000e-9
##FIRSTY=0.60342175
##DELTAX=2.03957629
##XUNITS=1/CM
##YUNITS=ARBITRARY UNITS
##XYDATA=(X++(Y..Y))
399.8F03421748K683103K770900L677309K497435J460135K621054K542734J264692
416.1F22939110K085805K654791J045405J104713J529396M79817M88281J468957R86457
434.4F34782732M91321J227676R59397K76148J121342J217664L47852J014412J512229
452.8F42950773K58208j40012Q31425N36383j9312P52151P28547k94983M3631O95884
473.2F46342695K45988N04673J129686M93646J80900Q96812O87957J75356P46727O85275
493.6F52089715j92583K68341R51230L27826K23815Q99196M12345k27929L10660K70247
514F55332863n89609k40505O34492L53098K63214R69529Q65758M45187Q70108R66549
534.4F59870684N02587P73906R75847K39790J06215O80626K42352m44471p4685M2200
$$ plain form
399.8 603421748 606104851 608875751 612553060 615050495 616510630 619131684 621674418 622939110
416.1 622939110 625024915 627679706 628725111 629829824 631359220 631839037 632327318 633796275 634782732
434.4 634782732 635274053 636501729 637461126 637737274 638858616 640076280 640424132 641438544 642950773
452.8 642950773 643208981 643068969 643900394 644436777 644417465 645169616 645898163 645603180 645646811 646342695
473.2 646342695 646588683 647093356 648223042 648716688 648897588 649794400 650482357 650657713 651404440 652089715
493.6 652089715 651897132 652165473 653116703 653444529 653668344 654567540 654979885 654751956 655062616 655332863
514 655332863 654743254 654502749 655137241 655490339 655753553 656723082 657588840 658034027 658904135 659870684
534.4 659870684 660373271 661147177 662123024 662362814 662469029 663149655 663392007 662947536 662872851 662915051
554.8F62915051n46813m31359Q6606j01328j20580L21328n96n03540r1672O9142m64440
577.2F61131799j59979N51284L90768L86655R38535O99699K62618P31468P27773n2929
597.6F65607691J132L55900l18826p26044k13444k09630m17351J91509N56291K97546
618F65124774Q40425J658321J400530J133383J557588J405478J011908J439035J589119
636.3F77160561J033545J115739J380920P34389L57211P52807N44011N2154M99249
654.7F83630586P56561K43307M58717J060545P09355J90079O65606Q17060M68969P65145
675.1F89765930R46224M33326M16159P05362J78277l23474k10226o96063j903534k954423
695.5F86357558m060745l361166j81198O18338k440154n587101p334471o383896q55744
$$ plain form
554.8 662915051 662368238 661936879 662023485 661922157 661801577 662122905 662122309 661618769 661527097 661596239 661131799
577.2 661131799 660971820 661523104 661913872 662300527 663239062 663938761 664201379 664932847 665660620 665607691
597.6 665607691 665608823 665964723 665645897 664919853 664706409 664496779 664079428 664270937 664827228 665124774
618 665124774 665965199 667623520 669024050 670157433 671715021 673120499 674132407 675571442 677160561
636.3 677160561 678194106 679309845 680690765 681425154 681782365 682535172 683079183 683131337 683630586
654.7 683630586 684387147 684630454 685089171 686149716 686859071 687049150 687714756 688531816 689000785 689765930
675.1 689765930 690712154 691145480 691561639 692267001 692445278 692121804 691911578 691215515 689311981 686357558
695.5 686357558 682296813 678935647 678754449 679372787 676932633 671345532 664011061 657627165 656771421
713.8F56771421M894376N893052M945636N659997P144868P627190P306397O809949
730.2G07052886N490542L493309K254128J703024Q94845L92794N11885K37942l12448
748.5G21718907k04026n1201m77731n68509k54989m54008o63579k10821l100k64227
768.9G18566716n7996K26200J0908J31070O42717N64993L17454O56247P39455L40402
789.3G22138166M36843O73056L77178L02851O01590M06146M053P5400J1444m30525
809.7G24596202l99828j83701n55635p53998m08590m95434q67367p70032q33929j397311
830.1G17930377j674235j800597k450943l151655l728152m156649l984034m409909
846.4F92574203o012201q435607j1542261j1839986o661832M01974M339635L593743
$$ plain form
713.8 656771421 661665797 667558849 672504485 678164482 685309350 692936540 700242937 707052886
730.2 707052886 712543428 716036737 718290865 719993889 720888734 721281528 721793413 722031355 721718907
748.5 721718907 721514881 721463680 720985949 720417440 720162451 719708443 719044864 718834043 718830943 718566716
768.9 718566716 718508720 718734920 718745828 718876898 719519615 720084608 720402062 721058309 721797764 722138166
789.3 722138166 722575009 723248065 723625243 723928094 724529684 724935830 724939883 725015283 725026727 724596202
809.7 724596202 724196374 724012673 723457038 722703040 722294450 721799016 720931649 720161617 719327688 717930377
830.1 717930377 716256142 714455545 712004602 708852947 705124795 700968146 696984112 692574203
846.4 692574203 686562002 678126395 666584134 654744148 648082316 648484290 652823925 656417668
862.7F56417668p84695q414448j9191682k7812600k6040256j3110042N467832K3909688
879.1E90441465L4421266L2852292K5230467J8488347J3090372Q242727M978895L591478
895.4G31337309L156125L059805L013611K637505J943588J350284R49264M26948k32220
913.7G47642219p36952j074791j349687j482845j408159j218856j099527j042008r70125
932.1G37259269r57608r87769r95993j101256j376569j665294j924753k335966k812624
950.4G23101437l111720l430128l859639m063249m062116m110277m083037l933609
966.8F92447662l909766l886402l651261l518462l665984l751636l710329l717005
983.1F62636817l558636l124356k706409k348721j885414j555026j507401j479268
$$ plain form
862.7 656417668 655632973 647218525 628026843 600214243 574173987 561063945 566531777 590441465
879.1 590441465 624862731 657715023 682945490 701433837 714524209 722766936 727745831 731337309
895.4 731337309 734493434 737553239 740566850 743204355 745147943 746498227 747447491 747874439 747642219
913.7 747642219 746905267 745830476 744480789 742997944 741589785 740370929 739271402 738229394 737259269
932.1 737259269 736301661 735313892 734317899 733216643 731840074 730174780 728250027 725914061 723101437
950.4 723101437 719989717 716559589 712699950 708636701 704574585 700464308 696381271 692447662
966.8 692447662 688537896 684651494 681000233 677481771 673815787 670064151 666353822 662636817
983.1 662636817 659078181 655953825 653247416 650898695 649013281 647458255 645950854 644471586
999.4F44471586j529753j916469k395272k733230l161669l636003l837704l867090
1015.7F21394396l909350l765523l461182l292442l183126k982914k839745k732753
1032E95227361k418816j994551j689493j439631j203835j090288r41813n97239k21848
1050.4E83629847Q5592M15861P34151R20594J134514J423717J462460J137912P00116
1068.7E91644764K21014l52263p83384r89437j527012j775682L14057L185034L536165
1087.1E93473256K530098K179086K065837J787543J508236J160205P21633M40717K90930
1105.4F06157541J23561J45733M46498P78795J103401J486003J719237J718998J782179
1123.8F15461946K013325K177477K324700K486825K304316J805663J416981J065195
$$ plain form
999.4 644471586 642941833 641025364 638630092 635896862 632735193 629099190 625261486 621394396
1015.7 621394396 617485046 613719523 610258341 606965899 603782773 600799859 597960114 595227361
1032 595227361 592808545 590813994 589124501 587684870 586481035 585390747 584448934 583851695 583629847
1050.4 583629847 583715439 584131300 584865451 585786045 586920559 588344276 589806736 590944648 591644764
1068.7 591644764 591865778 591513515 590730131 589740694 588213682 586438000 586752057 589937091 593473256
1087.1 593473256 596003354 598182440 600248277 602035820 603544056 604704261 605425894 605866611 606157541
1105.4 606157541 606281102 606426835 606873333 607652128 608755529 610241532 611960769 613679767 615461946
1123.8 615461946 617475271 619652748 621977448 624464273 626768589 628574252 629991233 631056428
1140.1F31056428M76658p0214l10242n19872q20458r93788j136839j319051j217962
1158.5F25144660p78138j94431N79477J524150K287865K784967L293276L707409L731310
1176.8F42080545L566087L363132K856732K124905J512468Q78096Q3148n17905q97944
1195.2F55049264j366376j706660j646638j544118j532972j295984j011431r78172
1211.5F43966913r21011p32958p58231q82745q10623q21769j055896j129329j089931
1229.9F35764420j243472j322448j186312j172125j246452j104772r48191r10342p13110
1248.2F25917196m32968l84152l88264k25485j73211k30730j12712K2173l1352R060
1268.6F23969555J76906J52052M2736P9990N1081j29938j35422p7843k32578m46856
$$ plain form
1140.1 631056428 631533086 631462872 631152630 630632758 629812300 628818512 627681673 626362622 625144660
1158.5 625144660 624366522 624172091 624751568 626275718 628563583 631348550 634641826 638349235 642080545
1176.8 642080545 645646632 649009764 651866496 653991401 655503869 656381965 656465113 655947208 655049264
1195.2 655049264 653682888 651976228 650329590 648785472 647252500 645956516 644945085 643966913
1211.5 643966913 643045902 642312944 641554713 640671968 639861345 639039576 637983680 636854351 635764420
1229.9 635764420 634520948 633198500 632012188 630840063 629593611 628488839 627540648 626630306 625917196
1248.2 625917196 625484228 625100076 624711812 624486327 624313116 624082386 623969674 623991847 623960495 623969555
1268.6 623969555 624146461 624298513 624341249 624421239 624472320 624342382 624206960 624129117 623896539 623449683
1289F23449683n90324q74937j224994j416684j662194k062858k381444k596080k953946
1307.4F07686222l315628l569603l869176m140377m065990l524304k623796j455367
1323.7E81121981k85506M96328P54595P33554M67181k6286m83155o80387p86602j031041
1344.1E80280662j282156j568854j892268k127469k269864k472818k644777k889097
1360.4E63133359l292501l437042l404141l580332l748416l877104m122376m175604
1376.7E33495843m332304m692673m916251m881203m938007n158305n395084o384254
1393D92797762p728666q399665r053052r380221r561896j0535300j0723502j0361850
1409.3D17053610j0428667j0162413r346455q973271q659899o249875l913641k591133
$$ plain form
1289 623449683 622859359 621984422 620759428 619342744 617680550 615617692 613236248 610640168 607686222
1307.4 607686222 604370594 600800991 596931815 592791438 588725448 585201144 582577348 581121981
1323.7 581121981 580836475 581332803 582087398 582820952 583288133 583261847 582778692 582098305 581311703 580280662
1344.1 580280662 578998506 577429652 575537384 573409915 571140051 568667233 566022456 563133359
1360.4 563133359 559840858 556403816 552999675 549419343 545670927 541793823 537671447 533495843
1376.7 533495843 529163539 524470866 519554615 514673412 509735405 504577100 499182016 492797762
1393 492797762 485069096 476669431 467616379 458236158 448674262 438138962 427415460 417053610
1409.3 417053610 406624943 396462530 387116075 378142804 369482905 363233030 359319389 356728256
1425.7C56728256j421005m88072J94072N30005O35713P51525N64635K14160o0350l00795
1446C57348144m59403m04179l18885m18633m75794M4167O40869N69582K89470J10239
1466.4C56925577J02490K60919Q20846J647472K143234K408952K613395K840936K973259
1484.8C72737080L174960L677309M277408M203230M179150M957616N477340N191564
1501.1D07875657M562348M898370O820827O697536N671262N610645N851955O289660
1517.4D54278260O531358P302255P328599O603152O669551O134629N767376O303906
1533.7E06919086N661964M627169N720555O678880N866944N344749M932165M825056
1550.1E50576568M622161M305244L832817M324972N397916M014075K988577K675354
$$ plain form
1425.7 356728256 355307251 354819179 355013251 355543256 356178969 356930494 357495129 357709289 357648939 357348144
1446 357348144 356888741 356484562 356165677 355747044 355271250 355315417 355956286 356525868 356815338 356925577
1466.4 356925577 357028067 357288986 358109832 359757304 361900538 364309490 366922885 369763821 372737080
1484.8 372737080 375912040 379589349 383866757 388069987 392249137 397206753 402684093 407875657
1501.1 407875657 412438005 417336375 424157202 430854738 436526000 442136645 447988600 454278260
1517.4 454278260 460809618 468111873 475440472 482043624 488713175 494847804 500615180 506919086
1533.7 506919086 512581050 517208219 522928774 529607654 535474598 540819347 545751512 550576568
1550.1 550576568 555198729 559503973 563336790 567661762 573059678 577073753 580062330 582737684
1566.4E82737684K462507K466857J964867J390278J449407J398265J058221P78317
1582.7E95706403M06206j83642o34968j000047j470685j871347k056361k289712k676189
1601.1E83929658k868295l013432l319800l572881l525317l519058m057944m405975
1617.4E55646956l341913k941668l387809l122807k813756k593339k043008j939416
1633.7E33463240k200961j328946l59535p4863J63674P72536J675546J799464K271951
1652E36182106M002869L909588L361761L621340M097998M340112L995717M090607M675984
1670.4E72278082M509449M570544M870355M437566L995478M124105N284250N341887
1686.7F09411716M546106M465342M178166M432440M827440M828393N766034N146623
$$ plain form
1566.4 582737684 585200191 587667048 589631915 591022193 592471600 593869865 594928086 595706403
1582.7 595706403 596112609 595928967 595293999 594293952 592823267 590951920 588895559 586605847 583929658
1601.1 583929658 581061363 578047931 574728131 571155250 567629933 564110875 560052931 555646956
1617.4 555646956 552305043 549363375 545975566 542852759 540039003 537445664 535402656 533463240
1633.7 533463240 531262279 529933333 529573798 529498935 529662609 530435145 532110691 533910155 536182106
1652 536182106 540184975 544094563 547456324 551077664 555175662 559515774 563511491 567602098 572278082
1670.4 572278082 576787531 581358075 586228430 590665996 594661474 598785579 604069829 609411716
1686.7 609411716 613957822 618423164 622601330 627033770 631861210 636689603 642455637 647602260
1703F47602260M234612M421353M109800L447831K981901K825618L051400L146351K773344
1721.4F78594470K421558K211213K066910J992762J681805J728892K255798K019226
1737.7F94972634J794279K036214K143144J995266J984715K312839K534926K260447
1754G12034464K078831K013385J712323J676082J740337J416266J128792J035512R57727
1772.4G25793719Q23975M69983p630l46720l64661l34263l85344k93911q0287K48074
1792.8G25522935M52519M72665N69582Q24630J186609J450002J454771J414955J665175
1811.1G35013843J886427J769841J693070J739800J522719J218260J235366J189530
1827.4G47268856R86874J130998J237750R55343P81536Q35538O63757M70341P92384
$$ plain form
1703 647602260 651836872 656258225 660368025 663815856 666797757 669623375 672674775 675821126 678594470
1721.4 678594470 681016028 683227241 685294151 687286913 688968718 690697610 692953408 694972634
1737.7 694972634 696766913 698803127 700946271 702941537 704926252 707239091 709774017 712034464
1754 712034464 714113295 716126680 717839003 719515085 721255422 722671688 723800480 724835992 725793719
1772.4 725793719 726617694 727087677 727080047 726733327 726368666 726034403 725649059 725355148 725274861 725522935
1792.8 725522935 725975454 726448119 727017701 727842331 729028940 730478942 731933713 733348668 735013843
1811.1 735013843 736900270 738670111 740363181 742102981 743625700 744843960 746079326 747268856
1827.4 747268856 748255730 749386728 750624478 751579821 752361357 753196895 753860652 754330993 755123377
1845.8G55123377J015365P98404O71983P30813O66618N49257O35087O61969M92275
1864.2G61345148L60429L99650N77628P07567P33018O07490M44949M80294N47171M34816
1884.6G66638160L69966M52637M88878M41670M70519N13911M12882M03166M59611L49641
1904.9G71001041K80023L95059M29869L30627L01122K82944K71737L43085M38690M08470
1925.3G74482667L04819L39508L40938K24173K66314L55303K01345J16169L15309L77774
1945.7G77324319K63750K92957L01183J80006J88529K57671J73449J20342K16663K26736
1966.1G79545605J97828K95103L30388K23279J75595K30551K04325J62721K10523J92225
1986.5G81768143Q4579P5340J67549J85192J47819J61946J47522J05619J36912J40965
$$ plain form
1845.8 755123377 756138742 756937146 757609129 758339942 759006560 759555817 760190904 760852873 761345148
1864.2 761345148 761705577 762105227 762682855 763390422 764123440 764730930 765175879 765656173 766203344 766638160
1884.6 766638160 767008126 767460763 767949641 768391311 768861830 769375741 769788623 770191789 770651400 771001041
1904.9 771001041 771281064 771676123 772105992 772436619 772737741 773020685 773292422 773635507 774074197 774482667
1925.3 774482667 774787486 775126994 775467932 775692105 775958419 776313722 776515067 776631236 776946545 777324319
1945.7 777324319 777588069 777881026 778182209 778362215 778550744 778808415 778981864 779102206 779318869 779545605
1966.1 779545605 779743433 780038536 780368924 780592203 780767798 780998349 781202674 781365395 781575918 781768143
1986.5 781768143 781852722 781928062 782095611 782280803 782428622 782590568 782738090 782843709 782980621 783121586
2006.9G83121586Q2254J09017J66476Q1599Q046R1434J32918Q1897Q1241J23918J09136
2029.4G84189522Q2791J06216J08242Q5830J07169J31190J06991R7632J28746J40607
2049.8G85284936J35303J65999J75357J32441J30117J63913J49131J38163J81854J92464
2070.2G86849678J55448J47105J81615J87934J64568J79052J96219J65701J41918J60933
2090.5G88530171J59144J47760J63377J52170J26422J46269J35303O4969O1989J14560
2110.9G89802134J05798O2824R4890J31905Q3804O7413J14262J06275P6354J05977
2131.3G90751636J05083O8784J03354J68979J60814J31905J58071J55211J07825J25348
2151.7G92037010J88828K12431K38061K79128K71440K32577K35081K52664K41756K57373
$$ plain form
2006.9 783121586 783203840 783312857 783479333 783560932 783568978 783660412 783793330 783875227 783956468 784080386 784189522
2029.4 784189522 784272313 784378529 784486771 784572601 784679770 784810960 784917951 785015583 785144329 785284936
2049.8 785284936 785420239 785586238 785761595 785894036 786024153 786188066 786337197 786475360 786657214 786849678
2070.2 786849678 787005126 787152231 787333846 787521780 787686348 787865400 788061619 788227320 788369238 788530171
2090.5 788530171 788689315 788837075 789000452 789152622 789279044 789425313 789560616 789625585 789687574 789802134
2110.9 789802134 789907932 789970756 790065646 790197551 790281355 790348768 790463030 790569305 790645659 790751636
2131.3 790751636 790856719 790925503 791028857 791197836 791358650 791490555 791648626 791803837 791911662 792037010
2151.7 792037010 792225838 792438269 792676330 792955458 793226898 793459475 793694556 793947220 794188976 794446349
2172.1G94446349K75612K47121K47955K92063K70307K31326K76744K76983J87933J82331
2192.5G96934724K47836K22743J80542K29120K28524J40131J49131J97947J44899J32978
2212.9G98808575J86860J45972Q7857J34468J55509J13368J32322J68324J23620J05381
2233.3H00162256J63376J35124O0558J12415J62720R1970Q0347J40310J25706J03950
2253.7H01338732J22309R3639N9545J20699J51635P5340Q9586J70707J22547P3612
2274.1H02418351J34349J25170P7009J38402J64151O3479K2531P4207O2168J0192J2517
2296.5H03302526J7286N96K7358M1366M947j0192k4140o6042p7248o3061q8930j00911
2321H02963555l7432N365k6226m6015j7405n483l1233m113M7386K3424J18196L91603
$$ plain form
2172.1 794446349 794721961 794969082 795217037 795509100 795779407 796010733 796287477 796564460 796752393 796934724
2192.5 796934724 797182560 797405303 797585845 797814965 798043489 798183620 798332751 798530698 798675597 798808575
2212.9 798808575 798995435 799141407 799229264 799363732 799519241 799632609 799764931 799933255 800056875 800162256
2233.3 800162256 800325632 800460756 800521314 800633729 800796449 800888419 800968766 801109076 801234782 801338732
2253.7 801338732 801461041 801554680 801614225 801734924 801886559 801961899 802051485 802222192 802344739 802418351
2274.1 802418351 802552700 802677870 802754879 802893281 803057432 803120911 803143442 803217649 803279817 803290009 803302526
2296.5 803302526 803319812 803320408 803347766 803389132 803394079 803383887 803359747 803293705 803216457 803153396 803064466 802963555
2321 802963555 802926123 802931488 802905262 802859247 802841842 802836359 802805126 802801013 802848399 802871823 802990019 803381622
2345.5H03381622M28557J11878k49445m08173l43621j72734J3769J02222J80721L28660
2365.9H03373456L97742L68535L86656M66644M61281L85701L45588L00348K47121J91152
2386.3H06924224J07527L9756R596j0252k4140k9444k5869j4782k8014o3300r2328
2408.7H06792974j02639r3162p4506o7830q4757j08183j34230j67489j67787j12354
2429.1H05680037r9719j58548j86444j82986k00748k08974j94490k18988k67446k71082
2449.5H03690612k70366l31104l88503m08471m58240n22554n53668n88715o61790p36893
2469.9G98770308q14199r22143j035214j129448j195014j236379j276016j316607j336575
2488.3G88508713j329839j298070j221955j074135q97944p75158p13289o55890o05046
$$ plain form
2345.5 803381622 803810179 803922057 803672612 803264439 802920818 802748084 802761853 802864075 803044796 803373456
2365.9 803373456 803771198 804139733 804526389 804993033 805454314 805840015 806185603 806485951 806733072 806924224
2386.3 806924224 807031751 807071507 807081103 807070851 807046711 807017267 806991398 806976616 806948602 806885302 806792974
2408.7 806792974 806690335 806597173 806522667 806454837 806370080 806261897 806127667 805960178 805792391 805680037
2429.1 805680037 805580318 805421770 805235326 805052340 804851592 804642618 804448128 804229140 803961694 803690612
2449.5 803690612 803420246 803089142 802700639 802292168 801833928 801311374 800757706 800168991 799507201 798770308
2469.9 798770308 797956109 797033966 795998752 794869304 793674290 792437911 791161895 789845288 788508713
2488.3 788508713 787178874 785880804 784658849 783584714 782686770 781911612 781198323 780542433 779937387
2506.6G79937387o39976p64548r17375j004518r53376p97808n86748l41237q9049J50800
2527G73993552L75151N47767O66142P44819P51019O80327N52297M43458M75824O05703
2547.4G79836059P05659P55191P46190O58453N19156L81172K93434K63333K47121K27332
2567.8G84633100K01523J49787Q2373J8299k6405m0233m2260m0471n1916q9943j14262
2590.2G84679592j14441j05024q6426j11819j54793j36733j11640j08957q0585m8697
2610.6G83620477m3392l4273j1742O914J7166N0068Q7321O5863K2173K0742L5346L4213
2635.1G83870876M0948N0068L8326K2888K861k9623m5061n7996j08719j69873j85966
2657.5G83428729j58847j62363k09927k43545k69949k92898k97844l10242l10302k81274
$$ plain form
2506.6 779937387 779297411 778532863 777615488 776610970 775657594 774859786 774273038 773931801 773842752 773993552
2527 773993552 774368703 774916470 775582612 776327431 777078450 777758777 778311074 778754532 779230356 779836059
2547.4 779836059 780541718 781296909 782043099 782701552 783220708 783601880 783895314 784158647 784405768 784633100
2567.8 784633100 784834623 784984410 785066783 785085082 785058677 785018444 784976184 784935713 784883797 784793854 784679592
2590.2 784679592 784565151 784460127 784373701 784261882 784107089 783970356 783858716 783749759 783669174 783620477
2610.6 783620477 783577085 783542812 783531070 783537984 783555150 783605218 783692539 783758402 783780575 783801317 783836663 783870876
2635.1 783870876 783911824 783961892 784000218 784023106 784025967 783996344 783951283 783893287 783784568 783614695 783428729
2657.5 783428729 783269882 783107519 782897592 782654047 782384098 782091200 781793356 781483114 781172812 780891538
2677.9G80891538k68102k94387l36945l39091l07739l07143l24547l31163l47615l69608
2698.3G77665198l73244l67165l76582l68715l36527l55661l97206m00185l97325l92079
2718.7G73900509l74198l75033l82363l78549l86238l98338l87907l30747k97069l39389
2739.1G70250678l67880l57747l45588l32236l27825l57092l92735m02987m22776m49180
2759.5G66494632m21405l95894m53889m80116m39346m69625n29289n09441n09798n68092
2779.9G61717737n64337n45859o02901o39677o08147n93006o33538o77705o90341o94632
2800.3G55467594p01070p16806p93993q91924r15587r30846r66727r61781r77814j048684
2820.7G46562362j098395j123726j175761j245797j325071j442611j595438j791119
$$ plain form
2677.9 780891538 780623436 780329049 779992104 779653013 779345274 779038131 778713584 778382421 778034806 777665198
2698.3 777665198 777291954 776924789 776548207 776179492 775842965 775487304 775090098 774689913 774292588 773900509
2718.7 773900509 773526311 773151278 772768915 772390366 772004128 771605790 771217883 770887136 770590067 770250678
2739.1 770250678 769882798 769525051 769179463 768847227 768519402 768162310 767769575 767366588 766943812 766494632
2759.5 766494632 766073227 765677333 765223444 764743328 764303982 763834357 763305068 762795627 762285829 761717737
2779.9 761717737 761153400 760607541 760004640 759364963 758756816 758163810 757530272 756852567 756162226 755467594
2800.3 755467594 754766524 754049718 753255725 752363801 751448214 750517368 749550641 748588860 747611046 746562362
2820.7 746562362 745463967 744340241 743164480 741918683 740593612 739151001 737555563 735764444
2837G35764444k049327k356946k739430l199756l461540l111958k206803j322806q35239
2855.4G14480639o82712p29084q43883r68158j162529j358092j412272j349271j197516
2873.7G04777122r65357p73490o75261o39260o63161p01427p12395p23660p47263p84457
2894.1F97391391p74503p05898p04765p58231q24392r90629j265824j591920j894177
2912.5F87881052k025485j845061j390636q70109m34220p0393K31803M58181O75082
2930.8F82610214Q91566J035869J104772J144350J168430J180946J166225J058340
2947.2F91360712Q44002O28471M82321L78966L54410M13119M76361N52594O24836O36816
2967.6F96752608O56664P38740Q37803R21726R86934J061201J129508J144230J116097
$$ plain form
2837 735764444 733715117 731358171 728618741 725418985 721957445 718845487 716638684 715315878 714480639
2855.4 714480639 713797927 713068843 712224960 711256802 710094273 708736181 707323909 705974638 704777122
2873.7 704777122 703811765 703038275 702363014 701723754 701060593 700359166 699646771 698923111 698175848 697391391
2894.1 697391391 696616888 695910990 695206225 694447994 693623602 692632973 691367149 689775229 687881052
2912.5 687881052 685855567 684010506 682619870 681749761 681315541 681245148 681476951 681935132 682610214
2930.8 682610214 683501780 684537649 685642421 686786771 687955201 689136147 690302372 691360712
2947.2 691360712 692204714 692833185 693315506 693694472 694048882 694462001 694938362 695490956 696115792 696752608
2967.6 696752608 697409272 698148012 698985815 699907541 700894475 701955676 703085184 704229414 705345511
2985.9G05345511J033187Q84056P34747O26266N17845M23312L45052K37762J57118
3004.3G10304856J09434J0133r7513j70946k39849k79367l15905l95953n16892o40809
3024.7G07767189o97434p19011p59900p70449p52211p95841q79407r16064r11832r11772
3045.1F99653268r56476j007736r90748r79543j021921j034916j025796j018345r79722
3063.4F90638065r55104r67503r76563r73761r48310r33468r54211r69708r72449r37939
3083.8F81049049q87513q90017r35793j003563j040876j001418r41932r33528r96649
3102.2F72417760j050472j025856j029432j100421j103222j060247j088024j159012
3118.5F63801074j254022j346588j332939j245677j226604j295686j353622j337349
$$ plain form
2985.9 705345511 706378698 707262754 707997501 708623767 709141612 709564924 709909976 710147738 710304856
3004.3 710304856 710414290 710424423 710326910 710155964 709916115 709636748 709320843 708924890 708407998 707767189
3024.7 707767189 707069755 706350744 705590844 704820395 704068184 703272343 702392936 701476872 700565040 699653268
3045.1 699653268 698696792 697689056 696698308 695718765 694696844 693661928 692636132 691617787 690638065
3063.4 690638065 689682961 688715458 687738895 686765134 685816824 684883356 683929145 682959437 681986988 681049049
3083.8 681049049 680161536 679271519 678335726 677332163 676291287 675289869 674347937 673414409 672417760
3102.2 672417760 671367288 670341432 669312000 668211579 667108357 666048110 664960086 663801074
3118.5 663801074 662547052 661200464 659867525 658621848 657395244 656099558 654745936 653408587
3134.8F53408587j284599j302660j413822j504421j510799j479805j450836j430869
3151.1F42030776j483202j612306j647890j576543j568198j625716j659394j637518
3167.4F29220009j605332j651645j719117j715302j683891j664162j675069j706183
3183.7F15799308j717866j705765j693786j720309j762628j771212j775980j809061
3200.1F01842701j783192j694321j663804j687110j701355j701474j683772j639723
3216.4E88287950j624406j677811j709163j690269j672983j632571j575470j557112
3232.7E75148165j597523j636267j612604j557588j517594j505375j523912j557708
3249E62639594j527190j443625j417994j435280j439929j440406j412868j345873j301348
$$ plain form
3134.8 653408587 652123988 650821328 649407506 647903085 646392286 644912481 643461645 642030776
3151.1 642030776 640547574 638935268 637287378 635710835 634142637 632516921 630857527 629220009
3167.4 629220009 627614677 625963032 624243915 622528613 620844722 619180560 617505491 615799308
3183.7 615799308 614081442 612375677 610681891 608961582 607198954 605427742 603651762 601842701
3200.1 601842701 600059509 598365188 596701384 595014274 593312919 591611445 589927673 588287950
3216.4 588287950 586663544 584985733 583276570 581586301 579913318 578280747 576705277 575148165
3232.7 575148165 573550642 571914375 570301771 568744183 567226589 565721214 564197302 562639594
3249 562639594 561112404 559668779 558250785 556815505 555375576 553935170 552522302 551176429 549875081
3267.4E49875081j280487j289606j357913j380324j300812j240015j273573j313388
3283.7E39438963j286745j241565j208186j198471j259088j343072j378178j371920
3300E29151738j320064j257360j335144j541019j663923j652241j603722j621128j684784
3318.4E15472353j699389j702606j760900j849175j908958j913726j898050j883805
3334.7E00855744j860589j896292j975328k015203k033532j971364j876026j936763
3351D85290647k081722k117426k037584j971841j994819j989633j847118j733899j825750
3369.3D67690855k010941k032489j853704j700968j652449j637489j590669j472771
3385.7D53739375j290232j120806j179516j403600j382262j074493q80986j061499
$$ plain form
3267.4 549875081 548594594 547304988 545947075 544566751 543265939 542025924 540752351 539438963
3283.7 539438963 538152218 536910653 535702467 534503996 533244908 531901836 530523658 529151738
3300 529151738 527831674 526574314 525239170 523698151 522034228 520381987 518778265 517157137 515472353
3318.4 515472353 513772964 512070358 510309458 508460283 506551325 504637599 502739549 500855744
3334.7 500855744 498995155 497098863 495123535 493108332 491074800 489103436 487227410 485290647
3351 485290647 483208925 481091499 479053915 477082074 475087255 473097622 471250504 469516605 467690855
3369.3 467690855 465679914 463647425 461793721 460092753 458440304 456802815 455212146 453739375
3385.7 453739375 452449143 451328337 450148821 448745221 447362959 446288466 445407480 444345981
3402D44345981j319498j239479r89168q55893q49635r08851q95322p21335n89669n84841
3422.4D35392290m83900l19779k24680j68711m7445Q3536m649k08199j73569R8199
3442.8D33943093L34203M12285L88682M39644N72294O73235P99268R13978Q29071P77035
3463.2D40082788J050562J318991J165450P94977P64787J047403J293957J367003J247972
3481.5D50133890J191795J343339J418025J382231J431734J515955J601308J632035
3497.8D61650312J634270J669586J601845J514315J639724J844108J956940J929074
3514.2D75440174J791865J760304J889914K079666K084076J950175K004832K148062
3530.5D91149068K215534K299846K313703K203643K258718K436340K476156K359211
$$ plain form
3402 444345981 443026483 441787004 440797836 439941943 439092308 438183457 437288135 436566800 435977131 435392290
3422.4 435392290 434908390 434588611 434363931 434195220 434147775 434231311 434226662 434018463 433844894 433943093
3442.8 433943093 434277296 434689581 435078263 435517907 436090201 436763436 437562704 438476682 439305753 440082788
3463.2 440082788 441133350 442452341 443617791 444412768 445177555 446224958 447518915 448885918 450133890
3481.5 450133890 451325685 452669024 454087049 455469280 456901014 458416969 460018277 461650312
3497.8 461650312 463284582 464954168 466556013 468070328 469710052 471554160 473511100 475440174
3514.2 475440174 477232039 478992343 480882257 482961923 485045999 486996174 489001006 491149068
3530.5 491149068 493364602 495664448 497978151 500181794 502440512 504876852 507353008 509712219
3546.8E09712219K305448K431453K578675K596855K580166K637506K637982K480746
3563.1E29961050K512037L079295L392339L035486K817810K972245L155946L272832
3579.4E54199040L306687L155172L113269L427983L569603L287792L247738L499925
3595.7E80807209L650606L671050L612995L416359L240824L416419L641784L651977
3612.1F09109223L575802L372252L581941M012346L603041K888561K753198L632247
3628.4F36528611M234076L516435L152371L171921L110051K995431K743423K400637
3644.7F61852956K430796L287375L715098K813936K414286K840399K775014K300084
3661F84429944J990616J723707J555204J842737J985550J525819J752377K138615J848399
$$ plain form
3546.8 509712219 512017667 514449120 517027795 519624650 522204816 524842322 527480304 529961050
3563.1 529961050 532473087 535552382 538944721 541980207 544798017 547770262 550926208 554199040
3579.4 554199040 557505727 560660899 563774168 567202151 570771754 574059546 577307284 580807209
3595.7 580807209 584457815 588128865 591741860 595158219 598399043 601815462 605457246 609109223
3612.1 609109223 612685025 616057277 619639218 623651564 627254605 630143166 632896364 636528611
3628.4 636528611 640762687 644279122 647431493 650603414 653713465 656708896 659452319 661852956
3644.7 661852956 664283752 667571127 671286225 674100161 676514447 679354846 682129860 684429944
3661 684429944 686420560 688144267 689699471 691542208 693527758 695053577 696805954 698944569 700792968
3679.4G00792968J615286J320303J063525J293838J600445J405835J213372J151740
3695.7G11457312R87172Q55208R21309Q95381O38187M02927M55260Q66175R66191O28650
3716.1G19073772L58344K51352K32697L04639M56691L79026N0545p4387K66254Q03411
3736.5G22102344P19309M1246k29001K87831M38690J24693M86970Q67784N46515K38359
3756.9G25624740K95758M05968K70724J31190O7115J69575L84271L15666R7573Q2612
3777.3G27845192K22623J60277K0027R5606J65642J38819N7816j02877j52767j86682
3797.7G28263676k31385R1970K73347J97708L54767K36869k11656m33385j90020k2411
3818G28329480J4364L34323L02136M4703o5148r5844m2558n9723j10090o56J25349
$$ plain form
3679.4 700792968 702408254 703728557 704792082 706085920 707686365 709092200 710305572 711457312
3695.7 711457312 712444484 713299692 714221001 715116382 715754569 716157496 716612756 717478931 718445122 719073772
3716.1 719073772 719432116 719683468 719916165 720220804 720677495 721056521 721107066 721032679 721298933 722102344
3736.5 722102344 722821653 722862899 722633898 722921729 723360419 723485112 723972082 724839866 725386381 725624740
3756.9 725624740 725920498 726326466 726597190 726728380 726795495 726965070 727349341 727665007 727762580 727845192
3777.3 727845192 728067815 728228092 728248119 728343725 728509367 728648186 728706002 728603125 728450358 728263676
3797.7 728263676 728032291 728124261 728397608 728595316 728950083 729186952 728975296 728541911 728351891 728329480
3818 728329480 728343844 728678167 728980303 729025006 728959858 728864014 728821456 728761733 728651643 728650987 728776336
3840.5G28776336K16007K59638Q34m73976p66575k77221O28411M38929m0054k12729
3860.9G28549600j83344r9957k06530j71841J17898K34902J78039r2983k68101j22488
3881.3G27935195j9908J07586O0320j71721q2135k2769k61605l58641k73764j74403
3901.7G26738155P5281L03626K09868n305j72854k63810k03967m9472r775o6102l3676
3924.1G26521969l0637j61588j86622k0683M7028o4671j49548j69635j15156p3075
3944.5G25597382r5547m6849j1444m2021m4644q7559k09451j99556O675R8706r299
3966.9G24956393q7380j22607j60038q9646P034o855l3975l1709j08540j75715r6738
3989.4G24050224k9981o2168o0737j4365
$$ plain form
3840.5 728776336 728992343 729251981 729252815 728778839 728012264 727735043 728363454 728802383 728762329 728549600
3860.9 728549600 728366256 728266299 728059769 727887928 728005826 728240728 728418767 728325784 728057683 727935195
3881.3 727935195 727915287 728022873 728083193 727911472 727829337 727806568 727544963 727186322 726912558 726738155
3901.7 726738155 726813436 727117062 727326930 727321625 727148771 726884961 726680994 726631522 726621747 726555645 726521969
3924.1 726521969 726491332 726329744 726143122 726122439 726169467 726104796 725955248 725785613 725670457 725597382
3944.5 725597382 725501835 725454986 725443542 725401521 725356877 725269318 725059867 724860311 724866986 724965692 724956393
3966.9 724956393 724869013 724746406 724586368 724496722 724503756 724496901 724462926 724431217 724322677 724146962 724050224
3989.4 724050224 724020243 723958075 723897338 723882973
3997.5G23882973
$$ plain form
3997.5 723882973
##END=$$ End of the data block
