##TITLE=T3PP $$ Begin of the data block
##JCAMP-DX=5.00 $$ ACD/SpecManager v 10.08
##SPECTROMETER/DATA SYSTEM=Alpha
##DATE=11 Mar 2014 10:52:32
##DATA TYPE=INFRARED SPECTRUM
##DATA CLASS=XYDATA
##ORIGIN=
##OWNER=
##NPOINTS=1765
##FIRSTX=399.75695801
##LASTX=3997.56933594
##MAXX=3997.56933594
##MINX=399.75695801
##MAXY=0.75540972
##MINY=0.07077062
##XFACTOR=1.0000000000
##YFACTOR=1.000000000000000e-9
##FIRSTY=0.35018775
##DELTAX=2.03957629
##XUNITS=1/CM
##YUNITS=ARBITRARY UNITS
##XYDATA=(X++(Y..Y))
399.8C50187749J1119604J0467469R449840R802789J1040508J0399014Q527637Q090019
416.1D29084629R945124J0224790P736563P802427Q570850O911278N487710O419718
432.4D92183089P265002N885869M382610N123437O300211N148232L650725M435956
448.7E34375131N359948M126489K590477L539384M932165L692806K439916L231585
465E64287901M072606L110350K102971L003716L837288K836942J830101K469302L411352
483.4E90962529K780020J667262K079844L070235K640963J639902J786232K336741
499.7F08963728K059400J513124J749634K345145K127528J269937J092613J745760
516F22866869J961350J333714J038849J498401J760483J314521J026154J453280J805484
$$ y = [350187749, 361307353, 371774822, 381224662, 391027451, 402067959, 412466973, 420994610, 429084629, 439029753, 449254543, 456991106, 464793533, 473364383, 480275661, 485763371, 492183089, 499448091, 505333960, 509716570, 514840007, 521140218, 526288450, 529939175, 534375131, 539735079, 543861568, 546452045, 549991429, 554923594, 558616400, 561056316, 564287901, 568360507, 571470857, 573573828, 576577544, 580414832, 583251774, 585081875, 587551177, 590962529, 593742549, 595409811, 597489655, 600559890, 603200853, 604840755, 606626987, 608963728, 611023128, 612536252, 614285886, 616631031, 618758559, 620028496, 621121109, 622866869, 624828219, 626161933, 627200782, 628699183, 630459666, 631774187, 632800341, 634253621, 636059105]
534.4F36059105J378179P21931Q40009J375913J091540L23653M16756J103997Q83639
552.7F44194722j31011k12788P06076Q90911K42114L58879J332820J457512L49820
571.1F49189055j49369O41882J043737K34306j07050R25004J388491K38478m13239
589.4F52991295O81519J358807K38240n94854K27928O79553q04067j995325r94206
607.8F51788890K16246k75731p60555N10335J784265J091718R6798Q46267J770437
626.1F57068670Q15272l59714N93722K256215K032578Q82089J270652K301335J552641
644.5F68413460k1994L6895J043499N54383q68023p77483L29435R1911j103580j215816
664.9F66482687l62754R6738m50491k77997O59645N26905q03172j114667j90556j97828
$$ y = [636059105, 637437284, 638159215, 638999224, 640375137, 641466677, 641790330, 642207086, 643311083, 644194722, 644063711, 643850923, 644556999, 645447910, 645690024, 646048903, 647381723, 648839235, 649189055, 649039686, 649681568, 650725305, 650959611, 650852561, 651777565, 653166056, 653404534, 652991295, 653672814, 655031621, 655269861, 654675007, 654902935, 655582488, 654778421, 652783096, 651788890, 652005136, 651729405, 650968850, 651479185, 653263450, 654355168, 654451966, 655298233, 657068670, 657883942, 657524228, 658117950, 660374165, 662406743, 663288832, 664559484, 666860819, 668413460, 668391466, 668428361, 669471860, 670026243, 669158220, 668380737, 668710172, 668802083, 667698503, 666482687, 666119933, 666216671, 665766180, 665488183, 666147828, 666674733, 665871561, 664756894, 664566338, 664368510]
685.3F64368510j630604k505839k329945l048063n193889o987452p447303q110404
701.6F27115011j0382950j2725473j3211429j1984408r819984p608294o010294m201889
717.9E51170290m30942N696952J2773633J8559277K1265924K1000743J9040823J5970528
734.2F65047228J2134493Q518636O020427M434704L060759J879274J286805J040518
750.6G03422844O60062L17455K03490J01805m7386j23739j76788k64525l28958l16203
771G03448057l64899n04315m51804k70843l21150n78165o50883m19080l49164p86364
791.4F98751390j092136p55191n44965r66966j257181r45986q00669j323998j761973
809.7F89302325j420200j110911j691520k307356k062678j741171k330601l108144
$$ y = [664368510, 662737906, 660232067, 657902122, 654854059, 649660170, 642672718, 635225415, 627115011, 616732061, 604006588, 590795159, 578810751, 568990767, 561382473, 555372179, 551170290, 550739348, 556436300, 569209933, 587769210, 609035134, 630035877, 649076700, 665047228, 677181721, 685700357, 691720784, 696155488, 699216247, 701095521, 702382326, 703422844, 704082906, 704400361, 704603851, 704705656, 704658270, 704534531, 704357743, 704093218, 703764260, 703448057, 703083158, 702578843, 702127039, 701856196, 701535046, 700956881, 700305998, 699886918, 699537754, 698751390, 697659254, 696904063, 696359098, 695392132, 694134951, 693188965, 692388296, 691064298, 689302325, 687882125, 686771214, 685079694, 682772338, 680709660, 678968489, 676637888, 673529744]
826F73529744l077984k956986l859937n059362n304634n420983o957531r631336j2735009
844.4F18525982j4730036j1567772n271315m265488r510934j5654087k0562708k5285125
860.7E11678517l2026708m3285489n9212745p0427417o0753271l2283351n461812J2913152
877B21140876K9917792M6314537N7823301O3902288O5086991N8915764M5600891L1419456
893.3F20121896K1882832J6488314J2296677Q742213O924093O241321M914284L118992
909.6G00730622K394080K495348J826287N12182P8381N36739L07560p22408r86576
928G07172215l10004k27272j029909j268208o09696m39525j246929j670658j118243
946.4F99251771q84473j586378k045035j635611j417041k039790k574087k317786k078593
$$ y = [673529744, 670451760, 667494774, 663634837, 658575475, 653270841, 647849858, 640892327, 631260991, 618525982, 603795946, 592228174, 586956859, 582691371, 573180437, 557526350, 536963642, 511678517, 479651809, 436366320, 377153575, 306726158, 245972887, 213689536, 208227724, 221140876, 251058668, 297373205, 355196506, 419098794, 484185785, 543101549, 588702440, 620121896, 642004728, 658493042, 670789719, 679531932, 686456025, 692697346, 697611630, 700730622, 703124702, 705620050, 707446337, 707958519, 708036900, 708573639, 708881199, 708158791, 707172215, 706862211, 706634939, 705605030, 704336822, 703727126, 703287601, 702040672, 700370014, 699251771, 698367298, 696780920, 694735885, 693100274, 691683233, 689643443, 687069356, 684751570, 682672977]
964.7F82672977k532780l040194k962828k803624l254294l951311m153729m081726
981F55892491m360497m740715m597127m092753l916442m037738l874243l428399l273845
999.4F19570732l579438l918230m056335m213571m511535m656554m434108m038334
1015.7E86162627l725887l380596k866507k359867k033770j875281j682818j338661
1032E66899240j064360j156807j516938j864136k136826k431274k682268k571583j996934
1050.4E49478114j285136p13885k26259K19524M05609Q2076m96924r43541j438261
1068.7E45081317k247154l046990l368497l380835l532231l542482k567232q27968
1085E22567928P14719K078176L511488M326522L738821K089322O29067J788k84135
$$ y = [682672977, 680140197, 677100003, 674137175, 671333551, 668079257, 664127946, 659974217, 655892491, 651531994, 646791279, 642194152, 638101399, 634184957, 630147219, 626272976, 622844577, 619570732, 615991294, 612073064, 608016729, 603803158, 599291623, 594635069, 590200961, 586162627, 582436740, 579056144, 576189637, 573829770, 571796000, 569920719, 568237901, 566899240, 565834880, 564678073, 563161135, 561296999, 559160173, 556728899, 554046631, 551475048, 549478114, 548192978, 547479093, 547252834, 547472358, 547877967, 547960043, 547463119, 546519578, 545081317, 542834163, 539787173, 536418676, 533037841, 529505610, 525963128, 523395896, 522567928, 523282647, 525360823, 528872311, 533198833, 536937654, 539026976, 539656043, 539657831, 539373696]
1103.4E39373696n79894n59509p4565K78950J1325m08531m97520o28590j152158j579761
1123.8E34183443j477421j291692j530230j839936j701534j440048j647353k019644
1140.1E21235585j815140j207113r51052j065552r41456o24835p51615j201093j186609
1158.5E11491120o17564j98245j59562J0193M29451N20408J67728Q7202N51700Q28982
1178.9E13111413M21762j34885l50774o16133j293719j926958k043307k004385k282381
1197.2E02880633k573967k407819k098769k180606k473474k517402k437115k669900
1213.5D83521581l109038l272921l132969l169835l471643l579437l382743l322273
1229.9D57080722l511131l544748l331125l267884l504008l651202l518551l389716
$$ y = [539373696, 538793802, 538234293, 538159728, 538438678, 538450003, 538041472, 537543952, 536915362, 535763204, 534183443, 532706022, 531414330, 529884100, 528044164, 526342630, 524902582, 523255229, 521235585, 519420445, 518213332, 517262280, 516196728, 515255272, 514630437, 513878822, 512677729, 511491120, 510873556, 510675311, 510515749, 510525942, 510955393, 511475801, 511643529, 511730731, 512282431, 513111413, 513533175, 513398290, 513047516, 512431383, 511137664, 509210706, 507167399, 505163014, 502880633, 500306666, 497898847, 495800078, 493619472, 491145998, 488628596, 486191481, 483521581, 480412543, 477139622, 474006653, 470836818, 467365175, 463785738, 460402995, 457080722, 453569591, 450024843, 446693718, 443425834, 439921826, 436270624, 432752073, 429362357]
1246.2D29362357l518343l690392l643334l542662l627926l799319l786057l665716
1262.5D00088608l694653l834814l844500l794610l869951m010051m069627m043281
1278.8C68927121m075616m199952m315704m344583m400939m543364m685610m729748
1295.1C33631605m745782m834800m946799m986554m950583m991710n038202n007118
1311.4B94130057m933476m879982m925668m984707m927575m928082n087346n219460
1327.8B54243761n249455n142167n019799n090043n404860n556941n307421n156011
1344.1B12317064n238339n287558n297646n317360n316123n267739n145565n190134
1360.4A70256600n400822n219802m832596m821032m776999m706905m777744m529163
$$ y = [429362357, 425844014, 422153622, 418510288, 414967626, 411339700, 407540381, 403754324, 400088608, 396393955, 392559141, 388714641, 384920031, 381050080, 377040029, 372970402, 368927121, 364851505, 360651553, 356335849, 351991266, 347590327, 343046963, 338361353, 333631605, 328885823, 324051023, 319104224, 314117670, 309167087, 304175377, 299137175, 294130057, 289196581, 284316599, 279390931, 274406224, 269478649, 264550567, 259463221, 254243761, 248994306, 243852139, 238832340, 233742297, 228337437, 222780496, 217473075, 212317064, 207078725, 201791167, 196493521, 191176161, 185860038, 180592299, 175446734, 170256600, 164855778, 159635976, 154803380, 149982348, 145205349, 140498444, 135720700, 131191537]
1376.7A31191537m287407m237376m070804l879688l935270l859751l500901l563643
1393I9856697l853112l689766l479958l231928k916902k759464k372801j921162j578391
1411.4G4053213j242295r45389p29032l65876J30274M65080O93269Q28817R98319J117654
1431.8G5004034J068897J116894J285561J131847R21421P90373O93746O76393O56076
1450.1H3345242N76094M36224M69431Q23878R85153R01423J015946J226344J204058
1468.5I0983793J170203J486399J864627J900523J898051J966931K098813K124384
1484.8A05493724K205931K570197L009737K907097K847783L425226L783375L580689
1501.1A29823759L130824L331601M764736M845753M134670M031211M099071M233584
$$ y = [131191537, 126904130, 122666754, 118595950, 114716262, 110780992, 106921241, 103420340, 99856697, 96003585, 92313819, 88833861, 85601933, 82685031, 79925567, 77552766, 75631604, 74053213, 72810918, 71865529, 71136497, 70770621, 70900895, 71365975, 72059244, 72888061, 73886380, 75004034, 76072931, 77189825, 78475386, 79607233, 80528654, 81319027, 82012773, 82689166, 83345242, 83921336, 84357560, 84826991, 85650869, 86636022, 87537445, 88553391, 89779735, 90983793, 92153996, 93640395, 95505022, 97405545, 99303596, 101270527, 103369340, 105493724, 107699655, 110269852, 113279589, 116186686, 119034469, 122459695, 126243070, 129823759, 132954583, 136286184, 141050920, 145896673, 150031343, 154062554, 158161625, 162395209]
1517.4A62395209M254416M748657M904985M478634M593551M340172M151121M572466
1533.7A98439211M201412L612891M623606N514339N059421M911080M743204M896149
1550.1B36001313N093202N207196N066931O480306Q754194O823719N814790N936414
1566.4B85178065N990476O283283N418479M663289N252033N022049M243881L982574
1582.7C26034129L773659L568620L397941L164739K906739K775848K631545K396673
1599C50649893K199650K145857K043217J858235J714170J584500J309752J038700J262635
1617.4C65806609J524836J424819J442641J555354J594722J746863J701534J509607
1633.7C78306985J943529K649724K688915K571493K452850K781958L493130L023147
$$ y = [162395209, 166649625, 171398282, 176303267, 180781901, 185375452, 189715624, 193866745, 198439211, 202640623, 206253514, 210877120, 216391459, 221450880, 226361960, 231105164, 236001313, 241094515, 246301711, 251368642, 257848948, 266603142, 273426861, 279241651, 285178065, 291168541, 297451824, 302870303, 307533592, 312785625, 317807674, 322051555, 326034129, 329807788, 333376408, 336774349, 339939088, 342845827, 345621675, 348253220, 350649893, 352849543, 354995400, 357038617, 358896852, 360611022, 362195522, 363505274, 364543974, 365806609, 367331445, 368756264, 370198905, 371754259, 373348981, 375095844, 376797378, 378306985, 380250514, 382900238, 385589153, 388160646, 390613496, 393395454, 396888584, 399911731]
1650C99911731K885938M391849M243136L396541L269285L564417L801316L376424L250450
1668.4D32091087L737927L612905L532857L835946L545940L033698K973229L986895
1684.7D60350484M234135L589064L542691L243059L093839L274917L392846M190445
1701D88911480L955722L334760L533006L451317L010810K547264K366364K927661L414333
1719.3E17452717K966463K624929K646149K453029K135813J875281K263248K900541
1735.7E37318170K471805K212166K399922K339423K072393J907945K192438K607941
1752E55522203K310813J939535K026320K031624J971483J887739J704097J575589J309216
1770.3E72278619J225769J481772J255095N21004j98841o29306j064002j609922k131879
$$ y = [399911731, 402797669, 407189518, 411432654, 414829195, 418098480, 421662897, 425464213, 428840637, 432091087, 435829014, 439441919, 442974776, 446810722, 450356662, 453390360, 456363589, 460350484, 464584619, 468173683, 471716374, 474959433, 478053272, 481328189, 484721035, 488911480, 492867202, 496201962, 499734968, 503186285, 506197095, 508744359, 511110723, 514038384, 517452717, 520419180, 523044109, 525690258, 528143287, 530279100, 532154381, 534417629, 537318170, 539789975, 542002141, 544402063, 546741486, 548813879, 550721824, 552914262, 555522203, 557833016, 559772551, 561798871, 563830495, 565801978, 567689717, 569393814, 570969403, 572278619, 573504388, 574986160, 576241255, 576762259, 576563418, 575934112, 574870110, 573260188, 571128309]
1788.7E71128309k691925k694011j976370j604557j348973n30958M30107J004040J550138
1807E63265800K377928L231048L663838L817499M107237M265308L891826L465652L484428
1825.4E95570564L299058K937913K882898K744793K472282K186775J835048J558125
1841.7F15487456J698554J988590J831472J694560J740515J578390J322747J314461
1858F28656745J502812J490176J195252R49502J124858J522124J478672J282454J296997
1876.4F40499592J273572J081407J011134J153767J146853R50515R64999J134932J155377
1894.7F50372148J065969R80794J014889J037538R26137Q23736R12726J062870R64165
1913.1F59160972P34210P31110R53078R25422Q21829R43065R88483Q54671P36535P64131
$$ y = [571128309, 568436384, 565742373, 563766003, 562161446, 560812473, 560281515, 560711622, 561715662, 563265800, 565643728, 568874776, 572538614, 576356113, 580463350, 584728658, 588620484, 592086136, 595570564, 598869622, 601807535, 604690433, 607435226, 609907508, 612094283, 613929331, 615487456, 617186010, 619174600, 621006072, 622700632, 624441147, 626019537, 627342284, 628656745, 630159557, 631649733, 632844985, 633794487, 634919345, 636441469, 637920141, 639202595, 640499592, 641773164, 642854571, 643865705, 645019472, 646166325, 647116840, 648081839, 649216771, 650372148, 651438117, 652418911, 653433800, 654471338, 655397475, 656221211, 657133937, 658196807, 659160972, 659895182, 660626292, 661579370, 662504792, 663326621, 664269686, 665258169, 666112840, 666849375, 667613506]
1933.5F67613506Q22783P78377O31988O21498Q19802Q86440P77006P34091P37190O70433
1953.9F75093114N73218N46575O04153O08742N44190N68986P39753Q10385P10368O70016
1974.3F81469500P04229O95109O41346O50227O77348O06000M90963N01752O43075O78539
1994.7F87758088N76139N67078O43194N97298M79877M66168N44071N62549N09441M89711
2015.1F93193614N39184N73218N24938M84347N10276N36561M93288M71413N18441N33402
2035.5F98378682M70996M21047M81844N45144N01037M69685N28991N48422M52161L70443
2055.9G03168452M33743N09560M72605M49300N02706N16951M38213L93748M47929N01752
2076.3G07834959M66585M21465M66406N22256M79102L93271L89994M25279M14848L87430
$$ y = [667613506, 668436289, 669214666, 669846654, 670468152, 671287954, 672174394, 672951400, 673685491, 674422681, 675093114, 675666332, 676212907, 676817060, 677425802, 677969992, 678538978, 679278731, 680089116, 680799484, 681469500, 682173729, 682868838, 683510184, 684160411, 684837759, 685443759, 685934722, 686436474, 687079549, 687758088, 688334227, 688901305, 689544499, 690141797, 690621674, 691087842, 691631913, 692194462, 692703903, 693193614, 693732798, 694306016, 694830954, 695315301, 695825577, 696362138, 696855426, 697326839, 697845280, 698378682, 698849678, 699270725, 699752569, 700297713, 700798750, 701268435, 701797426, 702345848, 702798009, 703168452, 703602195, 704111755, 704584360, 705033660, 705536366, 706053317, 706491530, 706885278, 707333207, 707834959, 708301544, 708723009, 709189415, 709711671, 710190773, 710584044, 710974038, 711399317, 711814165, 712201595]
2096.7G12201595M06027M38690M14431L49582L07142L21091L31640L10421L11494L56972
2117.1G15749085L61323K87533K38299K56360K88129K94924K83539K84731L17872L19362
2137.5G18681157K71439K46167K70307L10123L26991L41237L50773L45469L72529M07875
2157.9G21924067L86655L82185M32789M56035M24087M05372M53472M63724L99887L93689
2178.2G26121962M62294M72367M13000M04298M55022M61400L80754L33131M02271M67897
2198.6G30374396L97563K96056L20673L97265L47972K41578K98976M15087L76284K73347
2219G33739197K83659L77655L78608K51890K35855L85285M12583K67565K31684L70264
2239.4G36934245L97622K57135K12907L34859M02630L01778K20716L05712L98338L09348
$$ y = [712201595, 712607622, 713046312, 713460743, 713810325, 714117467, 714438558, 714770198, 715080619, 715392113, 715749085, 716110408, 716397941, 716636240, 716892600, 717180729, 717475653, 717759192, 718043923, 718361795, 718681157, 718952596, 719198763, 719469070, 719779193, 720106184, 720447421, 720798194, 721143663, 721516192, 721924067, 722310722, 722692907, 723125696, 723581731, 724005818, 724411190, 724864662, 725328386, 725728273, 726121962, 726584256, 727056623, 727469623, 727873921, 728328943, 728790343, 729171097, 729504228, 729906499, 730374396, 730771959, 731068015, 731388688, 731785953, 732133925, 732375503, 732674479, 733089566, 733465850, 733739197, 734022856, 734400511, 734779119, 735031009, 735266864, 735652149, 736064732, 736332297, 736563981, 736934245, 737331867, 737589002, 737801909, 738136768, 738539398, 738841176, 739061892, 739367604, 739765942, 740075290]
2259.8G40075290K12074L19778M26710L09050J81496K70665L98040L19123J58727K24650
2280.2G42895603L84271L14355J27971J31667K90692K89857R7156L5286K10166K85625
2300.6G45062649J06752n662J06513J83165O2704o1750P987J16408K2769j27733l4213
2323.1G45439589J58310J27196J3173P7605K45869K46466P5757Q2791L02017M15444
2343.5G47184217M68969M32253J40906j67311l45587l67403r4355K10524K34485K37882
2363.8G47934580M72963O76572O46949O12616P00832P15256N63621M40002M46081M58777
2384.2G53668249L25501J38580J07766J82807J61231N1260L9517J44423J71065P3016
2404.6G55063415M1365J04904J05381J9014k7895K7359O6697R478n0486k0265K5391
$$ y = [740075290, 740287364, 740607142, 741033852, 741342902, 741524398, 741795063, 742193103, 742512226, 742670953, 742895603, 743279874, 743594229, 743722200, 743853867, 744144559, 744434416, 744531572, 744566858, 744777024, 745062649, 745169401, 745163739, 745270252, 745453417, 745516121, 745454371, 745462358, 745578766, 745601535, 745473802, 745439589, 745597899, 745725095, 745738268, 745815873, 746061742, 746308208, 746383965, 746466756, 746768773, 747184217, 747653186, 748085439, 748226345, 748059034, 747713447, 747346044, 747251689, 747462213, 747696698, 747934580, 748407543, 749084115, 749731064, 750343680, 751044512, 751759768, 752323389, 752763391, 753209472, 753668249, 753993750, 754132330, 754240096, 754422903, 754584134, 754635394, 754674911, 754819334, 754990399, 755063415, 755104780, 755209684, 755315065, 755334079, 755306184, 755333543, 755400240, 755409718, 755359232, 755338967, 755364358]
2427.1G55364358m1604j49726j43826p7725r7096j99020k70486k39968k13027l16143
2447.5G53615737m52459m72426m44234n34355o96779p85947q41796r75251j160920
2465.8G47251570j279235j339852j507223j765847j929641k007008k169132k438784
2482.1G32814848k639889k675534k668082k731860k746880k566814k318323k192915
2498.5G12274551k113044j931131j734078j695752j768112j736939j603961j545668
2514.8F98145866j536965j373649j009583o67453m57227j64390K93136O89506R37343
2533.1F94856584J213670J588285J889705J968146J959324K096355K263367K173960
2549.4G10009396J934469J836419J803815J601398J303673J150310J146317J039445
$$ y = [755364358, 755322754, 755173028, 755029202, 754951477, 754854381, 754655361, 754384875, 754144907, 753931880, 753615737, 753163278, 752690852, 752246618, 751712263, 751015484, 750229537, 749387741, 748412490, 747251570, 745972335, 744632483, 743125260, 741359413, 739429772, 737422764, 735253632, 732814848, 730174959, 727499425, 724831343, 722099483, 719352603, 716785789, 714467466, 712274551, 710161507, 708230376, 706496298, 704800546, 703032434, 701295495, 699691534, 698145866, 696608901, 695235252, 694225669, 693558216, 693100989, 692936599, 693229735, 693919241, 694856584, 696070254, 697658539, 699548244, 701516390, 703475714, 705572069, 707835436, 710009396, 711943865, 713780284, 715584099, 717185497, 718489170, 719639480, 720785797, 721825242]
2565.8G21825242P76947O32643O71089O25849M28617L12686L63290L89457K74837J86145
2586.2G26486802K51711K80439J44542Q1718K09927L12865K57432J83225K57313M00067
2606.6G28866041M46796M36247N21719O80149P32719O94752P48635Q78989R05991Q41498
2626.9G35753536Q66056R75609R79185Q51929P83861Q47280Q76426P74861P08282P57575
2647.3G44174600P27057N25057L54648L53277L70502K54154Q6487L9398Q7142O7890
2667.7G47040212l3796p2360j6927l5704j26183j21593n2333m8876j08003j60814j54614
2690.2G46109009j03712j10865j79529j79112j24455j60932k35200k22683j81794j71244
2710.6G44439483j76370j90080j85132j96397k81036l52502l22699k22028j46627j61231
$$ y = [721825242, 722602189, 723234832, 723905921, 724531770, 724960387, 725273073, 725636363, 726025820, 726300657, 726486802, 726738513, 727018952, 727163494, 727245212, 727455139, 727768004, 728025436, 728208661, 728465974, 728866041, 729312837, 729749084, 730270803, 730950952, 731683671, 732378423, 733127058, 734006047, 734912038, 735753536, 736619592, 737595201, 738574386, 739426315, 740210176, 741057456, 741933882, 742708743, 743417025, 744174600, 744901657, 745426714, 745781362, 746134639, 746505141, 746759295, 746845782, 746885180, 746972322, 747040212, 747006416, 746934056, 746917129, 746881425, 746755242, 746633649, 746581316, 746532440, 746424437, 746263623, 746109009, 746005297, 745894432, 745714903, 745535791, 745411336, 745250404, 745015204, 744792521, 744610727, 744439483, 744263113, 744073033, 743887901, 743691504, 743410468, 743057966, 742735267, 742513239, 742366612, 742205381]
2731G42205381k20596k54810k49565k36750k47657k61962k73049k99931k96592k36869
2751.4G39627600j98424k52366l25561l22222k95878l09884l57092l86178l76583m26411
2771.8G36377001n10216m57227l46184l60191m63784n20408n09143n49137o21796o12795
2792.2G31426120n78761o13988o69300o67692o38306o70552q07702r11534q48472p68960
2812.5G24250853q49605r85384r99033r55105j025498j151561j174987j160979j261175
2830.9G14687526j448095j573205j624703j693189j829028k074302k399563k623499
2847.2F99421942k472400j911939j284957r50396r65118j063168j065672j130104j322746
2865.6F87255442j463830j489222j451373j307726j081229r13024q31186q18968q48413
$$ y = [742205381, 741984785, 741729975, 741480410, 741243660, 740996003, 740734041, 740460992, 740161061, 739864469, 739627600, 739429176, 739176810, 738851249, 738529027, 738233149, 737923265, 737566173, 737179995, 736803412, 736377001, 735866785, 735409558, 735063374, 734703183, 734239399, 733718991, 733209848, 732660711, 732038915, 731426120, 730847359, 730233371, 729564071, 728896379, 728258073, 727587521, 726779819, 725868285, 725019813, 724250853, 723401248, 722415864, 721416831, 720461726, 719436228, 718284667, 717109680, 715948701, 714687526, 713239431, 711666226, 710041523, 708348334, 706519306, 704445004, 702045441, 699421942, 696949542, 695037603, 693752646, 692802250, 691837132, 690773964, 689708292, 688578188, 687255442, 685791612, 684302390, 682851017, 681543291, 680462062, 679549038, 678717852, 677898884, 677050471]
2883.9F77050471p96795o72340o15001o30200n88476m26710l21627l84509m14491l63171
2904.3F71837151m18425o54339r74954j216471j279235j138329q28385m36843j29819
2922.7F64760351q166K4617J28508L55363M98414M67181M85301N54144M57883K82765
2943.1F68006361K71558L49701K50756K99j01924p3135j42277k36094k02775q4221
2963.5F68038249l3557q4579p7308J4127J15990K76208M34935N58853P22409P77721
2983.9F70743048O29008M39048K84552K17677K95639L38256L04878L25858L83199M73380
3004.3F74434543N23865M01199K36392K48849L78966M42446L85344K50459R2923j8835
3024.7F77376151p5996j63197k66254l15070l03865l15487m41194n47528n03779m41074
$$ y = [677050471, 676253676, 675581336, 674966335, 674336135, 673747659, 673320949, 672999322, 672614813, 672200322, 671837151, 671418726, 670764387, 669789433, 668572962, 667293727, 666155398, 665327013, 664890170, 664760351, 664752185, 664776802, 664905310, 665260673, 665759087, 666226268, 666711569, 667265713, 667723596, 668006361, 668277919, 668627620, 668878376, 668878675, 668776751, 668703616, 668561339, 668325245, 668122470, 668038249, 668004692, 667920113, 667842805, 667856932, 667972922, 668249130, 668684065, 669242918, 669965327, 670743048, 671372056, 671811104, 672095656, 672313333, 672608972, 672947228, 673252106, 673577964, 673961163, 674434543, 674958408, 675359607, 675595999, 675844848, 676223814, 676666260, 677051604, 677302063, 677394986, 677376151, 677300155, 677136958, 676870704, 676555634, 676251769, 675936282, 675495088, 674947560, 674443781, 674002707]
3045.1F74002707m82321n68628n91815n63025n67973n97775o19471o40690o66320p04229
3065.5F68000460o68943n46456n12838o10232p34389p84934p36058o73532o32942o17444
3085.8F61482692o60241p05838o85513o55234o79314p44104p73669p33077p21693p96914
3106.2F54327095q44241p93337p88570q84652r18448q54671p88748p75516q49605r45747
3126.6F45883560r73582r50873r35674r79125j052559j056194r88424r72569j036405
3145F36938155j103163j174927j222491j183927j132906j157760j191736j175880j187742
3163.4F26407623j248002j295686j305341j310647j350462j396895j383960j329005
3179.7F15787625j329243j390278j436830j438617j401604j406789j469016j472354
$$ y = [674002707, 673520386, 672951758, 672359943, 671796918, 671228945, 670631170, 670011699, 669371009, 668704689, 668000460, 667331517, 666785061, 666272223, 665661991, 664927602, 664142668, 663406610, 662733078, 662100136, 661482692, 660822451, 660116613, 659431100, 658775866, 658096552, 657352448, 656578779, 655845702, 655124009, 654327095, 653482854, 652689517, 651900947, 651016295, 650097847, 649243176, 648454428, 647678912, 646829307, 645883560, 644909978, 643959105, 643023431, 642044306, 640991747, 639935553, 638947129, 637974560, 636938155, 635834992, 634660065, 633437574, 632253647, 631120741, 629962981, 628771245, 627595365, 626407623, 625159621, 623863935, 622558594, 621247947, 619897485, 618500590, 617116630, 615787625, 614458382, 613068104, 611631274, 610192657, 608791053, 607384264, 605915248, 604442894]
3196F04442894j442372j453400j468241j459837j453221j473248j478255j449466j416087
3214.3E91348767j431763j500726j517474j479328j463950j459300j458764j497209
3230.7E79540253j507879j454532j435995j457333j446963j430154j409948j368224
3247E68029225j376093j402080j383185j371443j369596j353621j347959j363218j362026
3265.3E55700004j330197j307726j329064j339972j289785j249373j265287j276613
3281.6E45311987j261413j264214j289487j299977j288593j324952j395047j384139
3298E34804165j326739j337111j413703j475931j481711j492262j562655j627386j650631
3316.3E21436036j722932j815677j830697j835763j911760k003074k041578k074837
$$ y = [604442894, 603000522, 601547122, 600078881, 598619044, 597165823, 595692575, 594214320, 592764854, 591348767, 589917004, 588416278, 586898804, 585419476, 583955526, 582496226, 581037462, 579540253, 578032374, 576577842, 575141847, 573684514, 572237551, 570807397, 569397449, 568029225, 566653132, 565251052, 563867867, 562496424, 561126828, 559773207, 558425248, 557062030, 555700004, 554369807, 553062081, 551733017, 550393045, 549103260, 547853887, 546588600, 545311987, 544050574, 542786360, 541496873, 540196896, 538908303, 537583351, 536188304, 534804165, 533477426, 532140315, 530726612, 529250681, 527768970, 526276708, 524714053, 523086667, 521436036, 519713104, 517897427, 516066730, 514230967, 512319207, 510316133, 508274555, 506199718]
3332.6E06199718k112568k105117k105534k157479k176255k148748k142906k094448
3348.9D89156663k039760k115399k203345k159476k091378k119005k158493k087712
3365.3D72182095j990557k008021k071738k006590j833081j727641j686245j601726
3381.6D57256496j473934j392006j347930j235842j138628j150817j165032j076013
3397.9D47276294r29594r00924r92954r60558p86990o52910o07282o15507n90652m71443
3418.3D39767480l86566l79086k58505j8269J33783J23382J90436L74645L97176L10451
3438.7D40254927L65138N24550O69033P98374Q79765R55999J054883J128405J213074
3457D47844148J300394J296848J294971J414209J546055J541377J426905J414269J528472
$$ y = [506199718, 504087150, 501982033, 499876499, 497719020, 495542765, 493394017, 491251111, 489156663, 487116903, 485001504, 482798159, 480638683, 478547305, 476428300, 474269807, 472182095, 470191538, 468183517, 466111779, 464105189, 462272108, 460544467, 458858222, 457256496, 455782562, 454390556, 453042626, 451806784, 450668156, 449517339, 448352307, 447276294, 446346700, 445445776, 444452822, 443492264, 442705274, 442052364, 441445082, 440829575, 440238923, 439767480, 439380914, 439001828, 438743323, 438725054, 438858837, 438982219, 439172655, 439547300, 439944476, 440254927, 440620065, 441144615, 441813648, 442612022, 443491787, 444447786, 445502669, 446631074, 447844148, 449144542, 450441390, 451736361, 453150570, 454696625, 456238002, 457664907, 459079176, 460607648]
3475.4D60607648J658469J704306J643538J637936J759320J861006J862675J829684
3491.7D74564582J838088J913875J939595J930148J995176K039551J967818J972169
3508D90161002K128780K260983K265065K180219K166957K206743K226650K239585K318859
3526.4E10154843K494634K607762K548218K492547K574086K630055K617479K607822
3542.7E30727446K664089K768755K792895K801180K923965K970577K911985K942562
3559E53503454K963006K790988K759933L382862L858268L561556L312052L388583L489137
3577.4E83009839L586948L642678L446877L320337L780424M135668L785491L675044
3593.7F12383306L904223L917337L855705L859461L703713L513217L686130L817558
$$ y = [460607648, 462266117, 463970423, 465613961, 467251897, 469011217, 470872223, 472734898, 474564582, 476402670, 478316545, 480256140, 482186288, 484181464, 486221015, 488188833, 490161002, 492289782, 494550765, 496815830, 498996049, 501163006, 503369749, 505596399, 507835984, 510154843, 512649477, 515257239, 517805457, 520298004, 522872090, 525502145, 528119624, 530727446, 533391535, 536160290, 538953185, 541754365, 544678330, 547648907, 550560892, 553503454, 556466460, 559257448, 562017381, 565400243, 569258511, 572820067, 576132119, 579520702, 583009839, 586596787, 590239465, 593686342, 597006679, 600787103, 604922771, 608708262, 612383306, 616287529, 620204866, 624060571, 627920032, 631623745, 635136962, 638823092, 642640650]
3610F42640650L682733L644168L426790L464699M005075L817200L029585K541364L121614
3628.4F73373878L956258L417552K964198K898157K717018K564609K316594J830101
3644.7F96038365J573325K251446L037929K474189J863182K136528K193153J766741
3661G13334858J468897J120866O87718P99119J215101Q64506R11772J534879J376092
3679.4G23313808J079917Q79884N50509N19514R89675J239836J059652Q20041N42283
3697.7G30995119L32415M71890O26146L56973P0214J15752N30660P42734M46200J16945
3718.1G34805048k6465Q643J25169K98083L18528l0637m04954j91570N76020P07984
3738.5G36185849m9889n82695o1453L98040J0312K09152P16687M56690J19806K30729
$$ y = [642640650, 646323383, 649967551, 653394341, 656859040, 660864115, 664681315, 667710900, 670252264, 673373878, 677330136, 680747688, 683711886, 686610043, 689327061, 691891670, 694208264, 696038365, 697611690, 699863136, 702901065, 705375254, 707238436, 709374964, 711568117, 713334858, 714803755, 715924621, 716612339, 717411458, 718626559, 719491065, 720402837, 721937716, 723313808, 724393725, 725273609, 725824118, 726343632, 727333307, 728573143, 729632795, 730452836, 730995119, 731327534, 731799424, 732425570, 732782543, 732852757, 732968509, 733499169, 734241903, 734688103, 734805048, 734778583, 734787226, 734912395, 735210478, 735529006, 735498369, 735093415, 734901845, 735477865, 736185849, 736135960, 735553265, 735491812, 735889852, 735900164, 736109316, 736826003, 737282693, 737402499, 737633228]
3758.9G37633228L77536J06216j22905o1035J57892L80397K27571n4300q1122M0114
3779.3G38603592L3021m3690Q0406J80543J19269k444k55823l96013l41893k77579
3799.7G37699389J18614K74718K861K18689L35753p7963m61936m13716k95579k47061
3820.1G37153769K95400M55678J72376L4511j71125l00467k91168k35677M5121K98142
3840.5G37456560K98441K39491j0669m97043r61602n96941O65963O70970L7253k24472
3860.9G37077951k41279r9361j29998j68145J09733K15590J92761J1444k72035j90020
3881.3G36506641j12236n781J17957j42872j39892J23799n1856m26531n36263k88785
3901.7G35044181K14219N60403L72827P4804n4955k37644l57330j85132k0563q1897
$$ y = [737633228, 738010764, 738116980, 737994075, 737933040, 738090932, 738471329, 738698900, 738644600, 738563478, 738603592, 738636613, 738592923, 738673329, 738853872, 738973141, 738970697, 738714874, 738318861, 737976968, 737699389, 737818003, 738092721, 738095582, 738314271, 738650024, 738572061, 738110125, 737696409, 737400830, 737153769, 737449169, 737904847, 738077223, 738111734, 737940609, 737640142, 737348974, 737113297, 737158418, 737456560, 737755001, 737994492, 737983823, 737486780, 736525178, 735928237, 736594200, 737265170, 737302423, 737077951, 736836672, 736737311, 736607313, 736439168, 736548901, 736764491, 736957252, 736968696, 736696661, 736506641, 736394405, 736388624, 736506581, 736363709, 736223817, 736347616, 736295760, 735869229, 735332966, 735044181, 735258400, 735818803, 736191630, 736266434, 736211479, 735973835, 735616505, 735431373, 735410810, 735328913]
3922.1G35328913q4639L6121l6538j78933o5208P5519L3975j05858k72453j78337M9234
3944.5G34601796k6822j22667l2425K3902J6808j8775o9201q3387m0591k2530n5969
3966.9G34170139n9784l1590k1100l7134l7432k1934j3411J192j0133o6340q4460m0352
3991.4G33747661J788K5928K3306
3997.5G33798683
$$ y = [735328913, 735244274, 735280395, 735243857, 735064924, 734999716, 735075235, 735109210, 735003352, 734730899, 734552562, 734601796, 734574974, 734452307, 734419882, 734443784, 734460592, 734441817, 734372616, 734289229, 734248638, 734226108, 734170139, 734110355, 734078765, 734057665, 734020531, 733983099, 733961165, 733947754, 733948946, 733938813, 733872473, 733788013, 733747661, 733749449, 733775377, 733798683]
##END=$$ End of the data block
