##TITLE=T3PF $$ Begin of the data block
##JCAMP-DX=5.00 $$ ACD/SpecManager v 10.08
##SPECTROMETER/DATA SYSTEM=Alpha
##DATE=11 Mar 2014 10:52:32
##DATA TYPE=INFRARED SPECTRUM
##DATA CLASS=XYDATA
##ORIGIN=
##OWNER=
##NPOINTS=1765
##FIRSTX=399.75695801
##LASTX=3997.56933594
##MAXX=3997.56933594
##MINX=399.75695801
##MAXY=0.75263375
##MINY=0.10556291
##XFACTOR=1.0000000000
##YFACTOR=1.000000000000000e-9
##FIRSTY=0.40715933
##DELTAX=2.03957629
##XUNITS=1/CM
##YUNITS=ARBITRARY UNITS
##XYDATA=(X++(Y..Y))
399.8D07159328Q514911R117425R474546Q386582Q100420R056330Q599639O307035
416.1D74716216O289065Q762181Q007616N835652N213916O163955O392360M320383
432.4E25701344L279269N091190N993724M124880K821088L993213M906297L417313
448.7E59328318J887023L025770M665733L800690J869261K214849L774643L351450
465E83917737J587093J654148L376603L364205J329601J041055K908587L309429J279831
483.4F03768289M52459K507448L710568J807153K62022J801014L292263J827001R954
501.7F19438171J125873K954065J974821r5844M40836K351165J882970k31087m3809
520.1F29797161K061188K187848J53422k93314J698851K552808P97093l48688J205147
$$ y = [407159328, 415674239, 424791664, 434266210, 442652792, 450753212, 459809542, 468409181, 474716216, 481005281, 489767462, 497775078, 503610730, 508824646, 514988601, 521380961, 525701344, 528980613, 534071803, 540065527, 544190407, 547011495, 551004708, 555911005, 559328318, 561215341, 564241111, 568906844, 572707534, 574576795, 576791644, 580566287, 583917737, 585504830, 587158978, 590535581, 593899786, 595229387, 596270442, 599179029, 602488458, 603768289, 604220748, 606728196, 610438764, 612245917, 612507939, 614308953, 617601216, 619428217, 619438171, 620564044, 623518109, 625492930, 625397086, 625837922, 628189087, 630072057, 629840970, 629797161, 631858349, 634046197, 634199619, 633906305, 635605156, 638157964, 638955057, 638606369, 639811516]
538.4F39811516K474904R23753p57039L64482J985431P91490j238167m39882J572430
556.8F45488918R11116j207947p89225J483798J557409o37769j157344P81060J526415
575.2F47956431k72334j179099O08087K017259P36058p40528L10600J940787R97960
593.5F52375221r99748n93842J112819N52833j728892k090633l19242L41534q13007
611.9F47837043j041770O89208J864791Q29101j74225Q91686K070606J073539l55542
630.2F53684437M35949K283096K196431O79195O86169K076626K011597K46644m85897
648.6F63814247O48737J192212j78099j317084l90291P43091q1539j352847j023769
666.9F62054658O90639N29349p61986o87718O51717Q67486o43194j425624m77075m0293
$$ y = [639811516, 642286420, 643210173, 642453134, 642817616, 644803047, 645594537, 644356370, 643916488, 645488918, 646400034, 645192087, 644402862, 645886660, 647444069, 646806300, 645648956, 646430016, 647956431, 647684097, 646504998, 647113085, 649130344, 649866402, 649125874, 649436474, 651377261, 652375221, 651375473, 650781631, 651894450, 652447283, 650718391, 648627758, 648308516, 648650050, 647837043, 646795273, 647484481, 649349272, 650178373, 650004148, 650895834, 652966440, 654039979, 653684437, 654120386, 656403482, 658599913, 659279108, 659965277, 662041903, 664053500, 664300144, 663814247, 664462984, 665655196, 665477097, 664160013, 663769722, 664512813, 664431274, 663078427, 662054658, 662745297, 663274646, 662512660, 661824942, 662476659, 663344145, 662700951, 661275327, 660798252, 660757959]
687.3F60757959j567841l219723l473998m001617o250322p793128o980419o928802
703.7F20542109r643674j2702703j3064981r990394n750537l254771j404703L056467
720E67786813R057402J3452173J6082942J7900348J8146753J5509188J1285007Q449436
736.3F77670062P279992N500972K747834J327753J860857J939416M03642o59763J97947
754.6F98268712J088440J45853j131237o29485N96226L43561q16882o36935O78003
773F97906256P96437m83334q98361K40922Q07881l42309j280606m55261M90487k63035
793.4F96519077j423776r84490J95980r0659j444697j608849n58793m33505j660764
811.7F88509524k281726j459836r89914k005995k943218k445280j783788k627075m022598
$$ y = [660757959, 659190118, 655970395, 652496397, 648494780, 642244458, 634451330, 627470911, 620542109, 610898435, 598195732, 585130751, 575140357, 569389820, 566135049, 564730346, 567786813, 576844215, 590296388, 606379330, 624279678, 642426431, 657935619, 669220626, 677670062, 684950054, 690451026, 693198860, 694526613, 696387470, 698326886, 698730528, 698070765, 698268712, 699357152, 699503005, 698371768, 697742283, 698338509, 698682070, 697865188, 697228253, 697906256, 698702693, 698219359, 697320998, 697561920, 698369801, 698027492, 696746886, 696291625, 696782112, 696519077, 695095301, 694110811, 694306791, 694216132, 692771435, 691162586, 690603793, 690170288, 688509524, 686227798, 684767962, 683778048, 681772053, 678828835, 676383555, 674599767, 671972692, 667950094]
830.1F67950094m162491l699720m553437o406545p563889q242488j0540963j3411939
846.4F09368622j1321425o058335o464184j1819660j5047193j5678108j7761111k3731411
862.7E01487195l3915609m8080533n9872091n5251897l3076673q888454J1259050L1579703
879.1C05240691M9022466N7887911N9679151N7015866M8663497L6100268K5030494
893.3F38640344J8282235J3855874R943068P220507O167293N412995L848613K375901
909.6G05746830K087235K138972J186311j46508l83854J36674j33634j115262j284242
928G08232522m45545j06096q68082j335979o35862l7372o94811j555264j275540o19352
948.4G00658619j048565k107203k279460j678705j778960k784133l264070k743781
$$ y = [667950094, 663787603, 660087883, 655534446, 649127901, 641564012, 633321524, 622780561, 609368622, 598047197, 591988862, 585524678, 573705018, 558657825, 542979717, 525218606, 501487195, 467571586, 419491053, 359618962, 304367065, 271290392, 262401938, 273660988, 305240691, 354263157, 412151068, 471830219, 528846085, 577509582, 613609850, 638640344, 656922579, 670778453, 680721521, 687942028, 694109321, 699522316, 703370929, 705746830, 707834065, 709973037, 711159348, 711012840, 710628986, 710765660, 710632026, 709516764, 708232522, 707786977, 707680881, 706812799, 705476820, 704840958, 704803586, 704108775, 702553511, 701277971, 700658619, 699610054, 697502851, 695223391, 693544686, 691765726, 688981593, 685717523, 682973742]
964.7F82973742k541005l383458m127264l884971l645360m480720n599856n756259
981F49554849n370558n621791o318211o219864n277455m740774m972876m943251m185021
999.4F01905048l653467m111886m844844m895508m703045n089164n563796n136549
1015.7E63906789m029334l250897k968251k331913j136064l22640l64244m99308o3062
1034.1E48941076K90215k22027j096488j350104j080752j144826j502812j226544j63675
1052.4E41444063O69837P68125Q67665J422226J612545P67052n23627j444697k227068
1070.8E43356121l368795m279018m149616l426551k754748j411975P57337K623916
1087.1E27346671L732502M052103L689348L039420K033591N84185n51760n79297Q3327
$$ y = [682973742, 680432737, 677049279, 672922015, 669037044, 665391684, 660910964, 655311108, 649554849, 644184291, 638562500, 632244289, 626024425, 620746970, 616006196, 611033320, 606090069, 601905048, 598251581, 594139695, 589294851, 584399343, 579696298, 574607134, 569043338, 563906789, 559877455, 556626558, 553658307, 551326394, 550190330, 549867690, 549503446, 549004138, 548941076, 549231291, 549009264, 547912776, 546562672, 545481920, 544337094, 542834282, 541607738, 541444063, 542113900, 542882025, 543749690, 545171916, 546784461, 547551513, 547027886, 545583189, 543356121, 539987326, 535708308, 531558692, 528132141, 525377393, 523965418, 524722755, 527346671, 531079173, 535131276, 538820624, 541860044, 543893635, 544477820, 543926060, 543346763, 543430090]
1105.4E43430090L41773R6083J85370O77526O59824j38343q02100p16269n30541r37640
1125.8E42265773j386285j156092p99119j170039j909852k120257j854777j820684
1142.2E30048668k023577j795531j096487o93619q72433r65178m78387J78814M96626
1160.5E22798896P41660J371026J994193J895189J313031J175881J619219J786113
1176.8E34695208J299203P86662O37054L12507n46574j343608j536012j552284j971900
1195.2E30780256k456486k393067k020061k009034k298177k303064k029538k084076
1211.5E13186753k577484k896249k781868k698541k998084l295064l157228k870291
1227.8D89911944k927751l167331l091454k789557k749592k990514l033370k782792
$$ y = [543430090, 543771863, 543867946, 544053316, 544730842, 545390666, 545252323, 544450223, 543733954, 543203413, 542265773, 540879488, 539723396, 538924277, 537754238, 535844386, 533724129, 531869352, 530048668, 528025091, 526229560, 525133073, 524439454, 523567021, 522601843, 522123456, 522302270, 522798896, 523540556, 524911582, 526905775, 528800964, 530113995, 531289876, 532909095, 534695208, 535994411, 536781073, 537418127, 537730634, 537184060, 535840452, 534304440, 532752156, 530780256, 528323770, 525930703, 523910642, 521901608, 519603431, 517300367, 515270829, 513186753, 510609269, 507713020, 504931152, 502232611, 499234527, 495939463, 492782235, 489911944, 486984193, 483816862, 480725408, 477935851, 475186259, 472195745, 469162375, 466379583]
1244.1D66379583k635390k809643k983273k866894k724856k856105l082633l047437
1260.4D43373352k844572k845645l053784l091008k958148k988160l226429l360480
1276.8D19005126l245741l200561l405661l615409l604382l578156l728420l966570
1293.1C90660226m049360l996760m086971m285843m344999m244685m233718m337997
1309.4C57079893m412949m319519m186242m267365m445344m426807m351229m481465
1325.7C22188973m677206m736274m585475m464418m601806m953772n106121m881680
1342B84182221m774839m907727m982561m956931n000323n105525n108476m952505n036026
1360.4B39357308n411387n355105m968434m962564n022719n073861n241468n044967
$$ y = [466379583, 463744193, 460934550, 457951277, 455084383, 452359527, 449503422, 446420789, 443373352, 440528780, 437683135, 434629351, 431538343, 428580195, 425592035, 422365606, 419005126, 415759385, 412558824, 409153163, 405537754, 401933372, 398355216, 394626796, 390660226, 386610866, 382614106, 378527135, 374241292, 369896293, 365651608, 361417890, 357079893, 352666944, 348347425, 344161183, 339893818, 335448474, 331021667, 326670438, 322188973, 317511767, 312775493, 308190018, 303725600, 299123794, 294170022, 289063901, 284182221, 279407382, 274499655, 269517094, 264560163, 259559840, 254454315, 249345839, 244393334, 239357308, 233945921, 228590816, 223622382, 218659818, 213637099, 208563238, 203321770, 198276803]
1376.7A98276803m904419n050406n009234m811600m929781n023792m739359m938469
1393A58869743n523830n598560n564496n341292m979699m961506m542016l881461l433764
1411.4A15043119l003896k513908k077199j434691m50515K94254Q11316J187630J503005
1429.7A09359115J621642J507289J576081J734302J424461J120493R57199Q64438Q72411
1448.1A21037431Q11309O81184N69209P21529J107291J125306R83059J066521J138091
1466.4A29240930R99928R89228J342118J650616J609251J598373J689107J819834J838520
1484.8A42777905J959994K394796K899497K890513L009990L795027M244015M023224
1501.1A67994961L580138M040122N886376N739182M778803M728406M957423N245552
$$ y = [198276803, 193372384, 188321978, 183312744, 178501144, 173571363, 168547571, 163808212, 158869743, 153345913, 147747353, 142182857, 136841565, 131861866, 126900360, 122358344, 118476883, 115043119, 112039223, 109525315, 107448116, 106013425, 105562910, 105857164, 106668480, 107856110, 109359115, 110980757, 112488046, 114064127, 115798429, 117222890, 118343383, 119300582, 120165020, 121037431, 121848740, 122529924, 123099133, 123820662, 124927953, 126053259, 127036318, 128102839, 129240930, 130240858, 131230086, 132572204, 134222820, 135832071, 137430444, 139119551, 140939385, 142777905, 144737899, 147132695, 150032192, 152922705, 155932695, 159727722, 163971737, 167994961, 171575099, 175615221, 181501597, 187240779, 192019582, 196747988, 201705411, 206950963]
1517.4B06950963N247533N719468N723685N180851N301788M936427M784703N321235
1533.7B49166653M737034M058391N398214O260633N467683N195707N021960N238384
1550.1B90544659N414367N398959N133479O467313Q193552N884409M915089N070090
1566.4C37021917N171031N389392M488319L901422M561156M274339L586858L458828
1582.7C71853262L313631L089577K884895K638071K377183K225518K094328J908392
1599C92384857J675367J552761J473993J301616J024247P76797O00904M99130N24014
1617.4D01813686M99427M71026N41240N54740N19008O65813P73222Q31961J180679
1635.7D07850802J521289J578123J652598J693875K089351K614200K164275K340853
$$ y = [206950963, 212198496, 217917964, 223641649, 228822500, 234124288, 239060715, 243845418, 249166653, 253903687, 257962078, 263360292, 269620925, 275088608, 280284315, 285306275, 290544659, 295959026, 301357985, 306491464, 312958777, 321152329, 327036738, 331951827, 337021917, 342192948, 347582340, 352070659, 355972081, 360533237, 364807576, 368394434, 371853262, 375166893, 378256470, 381141365, 383779436, 386156619, 388382137, 390476465, 392384857, 394060224, 395612985, 397086978, 398388594, 399412841, 400189638, 400790542, 401289672, 401813686, 402313113, 402784139, 403325379, 403880119, 404399127, 405064940, 405838162, 406670123, 407850802, 409372091, 410950214, 412602812, 414296687, 416386038, 419000238, 421164513, 423505366]
1652D23505366L593176L120333K600640K829910L274709L484487L164441L318488L792435
1670.4D52683985L462315L558606L978014L524065L054976L391296M611164M280687
1686.7D82545108L423392L547550L431826L645480L924251L893614M585802L984273
1703E12981296L298819L450274L270090L007233K705812K529860K968490L100574K470195
1721.4E39782643K165139K216697K224445K153099J935482K261936K616883K150118
1737.7E57506442K047062K141476K134084K183915K136647K161980K279818K124727
1754E74716151J987219J881063J780033K016782J960457J548290J360118J402200J561820
1772.4E90214133J265943N61655J41680p9155n15759j192152j618266j639247j791358
$$ y = [423505366, 427098542, 430218875, 432819515, 435649425, 438924134, 442408621, 445573062, 448891550, 452683985, 456146300, 459704906, 463682920, 467206985, 470261961, 473653257, 478264421, 482545108, 485968500, 489516050, 492947876, 496593356, 500517607, 504411221, 508997023, 512981296, 516280115, 519730389, 523000479, 526007712, 528713524, 531243384, 534211874, 537312448, 539782643, 541947782, 544164479, 546388924, 548542023, 550477505, 552739441, 555356324, 557506442, 559553504, 561694980, 563829064, 566012979, 568149626, 570311606, 572591424, 574716151, 576703370, 578584433, 580364466, 582381248, 584341705, 585889995, 587250113, 588652313, 590214133, 591480076, 592041731, 592183411, 592104256, 591588497, 590396345, 588778079, 587138832, 585347474]
1790.7E85347474k036572j807749j315832q50022l14891L42547J098752J859129K443135
1809.1E84765971K900123L319443L626227L677547L444850L172994L134429L138781
1825.4F11180365K674222K367556K498150K333820J936555J672685J598537J589179
1841.7F27851069J634836J576126J460314J545488J496196J189113J105428J357734
1858F39216304J464903J177609R14991J003861J277805J286805J003325J022458J258790
1876.4F49626851J181841Q74042Q65818J136303J137673Q59321P85470J000821J138210
1894.7F58606350R70364P37786Q48413J042068Q96633O40988P34448J033008R64463
1913.1F66474521O23822O17504R51350R76861P00414N98490Q07107R53018P33972N17309
$$ y = [585347474, 583310902, 581503153, 580187321, 579337299, 579022408, 579364955, 580463707, 582322836, 584765971, 587666094, 590985537, 594611764, 598289311, 601734161, 604907155, 608041584, 611180365, 613854587, 616222143, 618720293, 621054113, 622990668, 624663353, 626261890, 627851069, 629485905, 631062031, 632522345, 634067833, 635564029, 636753142, 637858570, 639216304, 640681207, 641858816, 642773807, 643777668, 645055473, 646342278, 647345603, 648368061, 649626851, 650808692, 651682734, 652548552, 653684855, 654822528, 655681849, 656467319, 657468140, 658606350, 659576714, 660314500, 661162913, 662204981, 663101614, 663742602, 664477050, 665510058, 666474521, 667098343, 667715847, 668667197, 669644058, 670344472, 670942962, 671750069, 672703087, 673437059, 673954368]
1933.5F73954368O68466Q76486O94931M40836N95808Q86678Q17478N18441M77672P09355
1953.9F80640519P39693M44413L03208N28574P13468N98371M94659O51240Q41320P34746
1974.3F86690211M63903M80414P26103P28071M43042L71634O07014O94215M84944L54707
1994.7F92044258N18382O61969N21183L60489M70638O14643N27084L52025L78251N59151
2015.1F97008073N80609L92974L17275M85122N69761M17292L00110M17709N49734M59253
2035.5G01497912L25859L93152N39661M94003L22402L16143M90129N48124M10497L24667
2055.9G05662549M13835N01096M30882L21925L63290M78208M49896L47554L58522M51863
2076.3G09779620M54545L59059L19421L91364M63724L97503K94149L22044M13120L95656
$$ y = [673954368, 674622834, 675499320, 676194251, 676635087, 677230895, 678117573, 678935051, 679453492, 679931164, 680640519, 681380212, 681824625, 682127833, 682656407, 683369875, 683968246, 684462905, 685114145, 685955465, 686690211, 687154114, 687634528, 688360631, 689088702, 689531744, 689903378, 690510392, 691204607, 691689551, 692044258, 692562640, 693224609, 693745792, 694106281, 694576919, 695191562, 695718646, 696070671, 696448922, 697008073, 697588682, 697981656, 698298931, 698784053, 699353814, 699771106, 700071216, 700488925, 701038659, 701497912, 701823771, 702216923, 702756584, 703250587, 703572989, 703889132, 704379261, 704927385, 705337882, 705662549, 706076384, 706577480, 707008362, 707330287, 707693577, 708171785, 708621681, 708969235, 709327757, 709779620, 710234165, 710593224, 710912645, 711304009, 711767733, 712165236, 712459385, 712781429, 713194549, 713590205]
2096.7G13590205K97308K84671L59536L77297K94745K43366L02851L73721L11315J93179
2117.1G16628194K05040K99990L02613K16484J88589K56002L08156K61962K02597K35080
2137.5G19104707L01779K80261K02000K21014L25203L29911K27154K17974L48747M49240
2157.9G22007990L82841K99394L86297M83454M08828L08394L51668M50551M46677L42489
2178.2G25868583L22699M25220M64499L79622L25501L96132M38154L38852K45989L24070
2198.6G29529321M42445L92557K44498K36034L65258L87013K66492K16663L15428L78727
2219G32774436K99693K28762K99633L69727K82705J84655K44678L50773L19242K17796
2239.4G35572100K19285L32117L77178K73645K14994L26574L83675K48194J78814K91824
$$ y = [713590205, 713887513, 714172184, 714531720, 714909017, 715203762, 715447128, 715749979, 716123700, 716435015, 716628194, 716833234, 717133224, 717435837, 717652321, 717840910, 718096912, 718405068, 718667030, 718869627, 719104707, 719406486, 719686747, 719888747, 720109761, 720434964, 720764875, 720992029, 721210003, 721558750, 722007990, 722390831, 722690225, 723076522, 723559976, 723968804, 724277198, 724628866, 725079417, 725526094, 725868583, 726191282, 726616502, 727081001, 727460623, 727786124, 728182256, 728620410, 728959262, 729205251, 729529321, 729971766, 730364323, 730608821, 730844855, 731210113, 731597126, 731863618, 732080281, 732395709, 732774436, 733074129, 733302891, 733602524, 733972251, 734254956, 734439611, 734684289, 735035062, 735354304, 735572100, 735791385, 736123502, 736500680, 736774325, 736989319, 737315893, 737699568, 737947762, 738126576, 738418400]
2259.8G38418400L68715K80559K05159K65777L46184L19779K15649J99080K72333K92898
2280.2G41184533K30074J85608K21670K48909J81437J26063J93120K40862J78039J20521
2300.6G43110836J46448J75953J23978M3213N0426J41680J68919J09792P5162J02400
2321G44248807J41621J16706P7128J46389K36631K22385J92940K14636K16425J63257
2341.4G45976925K33710L95715K38240q7381j82926m3571R3281J19567J12593J85967
2361.8G47042120L60608M75049M24683L89695M03941L87966L84331L71158L01659K18511
2382.2G50759721J98185K06530J83940J32680R7156J08301J30773J12057O0618P2062
2402.6G52062023J37150J28508M6432K0980Q2136J01804K6763l3379Q345N2988r775
$$ y = [738418400, 738787115, 739067674, 739272833, 739538610, 739884794, 740204573, 740420222, 740619302, 740891635, 741184533, 741414607, 741600215, 741821885, 742070794, 742252231, 742378294, 742571414, 742812276, 742990315, 743110836, 743257284, 743433237, 743557215, 743600428, 743650854, 743792534, 743961453, 744071245, 744146407, 744248807, 744390428, 744507134, 744584262, 744730651, 744967282, 745189667, 745382607, 745597243, 745813668, 745976925, 746210635, 746606350, 746844590, 746757209, 746574283, 746530712, 746623993, 746743560, 746856153, 747042120, 747402728, 747877777, 748302460, 748692155, 749096096, 749484062, 749868393, 750239551, 750541210, 750759721, 750957906, 751164436, 751348376, 751481056, 751578212, 751686513, 751817286, 751929343, 751989961, 752062023, 752199173, 752327681, 752374113, 752395093, 752477229, 752579033, 752605796, 752572417, 752580762, 752633750, 752623975]
2425G52623975p2956k5928K8372l1054j35303j36494o4492q8573k11060k71440k37464
2447.5G51377583k60175l98695m99010m73261m65453n80191p38323q28088q68856r99213
2467.9G45266318j211822j330793j394808j593828j853347k005279k080798k205312
2484.2G31590331k391100k479375k384066k245367k192438k132892j942337j707494
2500.5G14115262j620889j640916j577258j476347j497567j622855j641453j429856
2516.8G01608121j149177r46224o99043k92897J25050M08828O38128R56833J329720
2535.2G01979339J548410J580178J627624J768411J876771J850486J765132J722634
2551.5G15718985J652658J439750J179874J069605J059651R49622P37667O18160O24001
$$ y = [752623975, 752551019, 752525091, 752553463, 752522409, 752387106, 752250612, 752186120, 752097547, 751886487, 751615047, 751377583, 751117408, 750718713, 750219703, 749746442, 749280989, 748700798, 747962475, 747134387, 746265531, 745266318, 744054496, 742723703, 741328895, 739735067, 737881720, 735876441, 733795643, 731590331, 729199231, 726719856, 724335790, 722090423, 719897985, 717765093, 715822756, 714115262, 712494373, 710853457, 709276199, 707799852, 706302285, 704679430, 703037977, 701608121, 700458944, 699512720, 698813677, 698520780, 698645830, 699054658, 699692786, 700649619, 701979339, 703527749, 705107927, 706735551, 708503962, 710380733, 712231219, 713996351, 715718985, 717371643, 718811393, 719991267, 721060872, 722120523, 723070145, 723807812, 724425972, 725049973]
2569.8G25049973N79655M28021L06785L29196L71039K71022J44959J76609K55763J89483
2590.2G28102505P4685J02997K30372K67684J73211J19388K11895L17693L25858L42906
2610.6G30269194M66764N82456N71370N31197O10828P72119Q01086O80626O42001P41780
2631G36669421Q04484P21693O20723O54817P16328O37829N22376N48362O10650M99785
2651.4G43006468K80022J94788K54810K29776O7115l3319K3544P3612l9816j57595
2671.8G43899405q4698J3351o2823j59323r4652n901n0783j72556k03609r5904m9234
2694.3G42933273j69933k48372j33157m8339j57058k81275k53618j50322j65165k67148
2714.6G41058886k42233j31309j60456l09706l55065k31444j23024j61052k39790k37047
$$ y = [725049973, 725629628, 726057649, 726364434, 726693630, 727064669, 727335691, 727480650, 727657259, 727913022, 728102505, 728177190, 728280187, 728510559, 728778243, 728951454, 729070842, 729282737, 729600430, 729926288, 730269194, 730735958, 731318414, 731889784, 732420981, 733031809, 733803928, 734605014, 735285640, 735927641, 736669421, 737473905, 738195598, 738816321, 739471138, 740187466, 740825295, 741347671, 741896033, 742506683, 743006468, 743286490, 743481278, 743736088, 743965864, 744032979, 743999660, 744023204, 744096816, 744057000, 743899405, 743814707, 743828058, 743765235, 743605912, 743511260, 743505359, 743454576, 743282020, 743078411, 742982507, 742933273, 742763340, 742514968, 742381811, 742333472, 742176414, 741895139, 741641521, 741491199, 741326034, 741058886, 740816653, 740685344, 740524888, 740215182, 739860117, 739628673, 739505649, 739344597, 739104807, 738867760]
2735G38867760j96040k27094k91884k59399j74344k03728l16799l19839k12311j98901
2755.4G36467421k96950l21567k59400k47061l17693l76284l68893l66449l93212l86954
2775.8G33132958l64899l58939l77775m53353n42819n62728n10454m90307n53489o07550
2796.2G28310645n96047n96165o39439o54101o71506p62880q38280q05199p85768q65519
2816.6G21095741r43661r72748r78589j014292j113474j205564j262426j357019j517475
2835G10730493j715839j887023k065003k444625l008127l297091k849936j869142j020968
2853.3F90572739o32286n83649o38485o94573q59320j117885j291156j397491j476526
2871.7F81881368j356959j062036q82685q62420q39710q06629p96020p64788p19010
$$ y = [738867760, 738671720, 738444626, 738152742, 737893343, 737718999, 737515271, 737198472, 736878633, 736666322, 736467421, 736170471, 735848904, 735589504, 735342443, 735024750, 734648466, 734279573, 733913124, 733519912, 733132958, 732768059, 732409120, 732031345, 731577992, 731035173, 730472445, 729961991, 729471684, 728918195, 728310645, 727714598, 727118433, 726478994, 725824893, 725153387, 724390507, 723552227, 722747028, 721961260, 721095741, 720152080, 719179332, 718200743, 717186451, 716072977, 714867413, 713604987, 712247968, 710730493, 709014654, 707127631, 705062628, 702618003, 699609876, 696312785, 693462849, 691593707, 690572739, 689940453, 689356804, 688718319, 688023746, 687164426, 686046541, 684755385, 683357894, 681881368, 680524409, 679462373, 678579688, 677717268, 676877558, 676070929, 675274909, 674510121, 673791111]
2890.1F73791111p24853p41958o63817n68092n95510o91056p66874q98003j208127
2908.4F66932821j693606k128720k220929j933336j425267q48710l68476m1544J79290
2926.8F56451523L66271O16252Q15690Q46863Q70525R43423R01639P45893O63101O84023
2947.2F63905203N63562K23935j0431K503P5400J06514J42574K78413M77672N74648
2967.6F66339993N61357N48840N88655O28710N87761N55277O42061P16150O18756M48406
2987.9F72235966L29077L06010L72887L57091L20435L88086L99887L46244L20375K86698
3008.3F75662756K33650J81735J70767K16007K27690J24276p1943j97291j99318k60890
3028.7F76087439m28736n36561m54962l86537n59270p31170o84202n76496n88298p08043
$$ y = [673791111, 673066258, 672324300, 671660483, 671092391, 670496881, 669805825, 669038951, 668140948, 666932821, 665239215, 663110495, 660889566, 658956230, 657530963, 656682253, 656313777, 656272233, 656451523, 656817794, 657434046, 658249736, 659096599, 659967124, 660910547, 661812186, 662558079, 663221180, 663905203, 664468765, 664692700, 664682269, 664684772, 664760172, 664866686, 665009260, 665287673, 665765345, 666339993, 666901350, 667450190, 668038845, 668667555, 669255316, 669810593, 670452654, 671168804, 671787560, 672235966, 672565043, 672871053, 673243940, 673601031, 673921466, 674309552, 674709439, 675055683, 675376058, 675662756, 675896406, 676078141, 676248908, 676464915, 676692605, 676816881, 676744938, 676547647, 676348329, 676087439, 675658703, 675122142, 674667180, 674280643, 673721373, 672990203, 672306001, 671729505, 671141207, 670433164]
3049.1F70433164p56383o89745o70493p23541p59303p50959p45118p96318q02874o85215
3069.5F63053215o14048p18951q90672r13143p44522o58035p44998p66993p14123p36296
3089.9F55551434p87080p80105p58767q01743q55386q51929q39829q73924r33170r45628
3110.3F47123873r46224r69052r72807r83119r51052q89540r54985j096666j152039
3128.7F38208389j111269j087427j149118j200020j168311j144707j206338j281619
3145F28859580j301349j308500j316011j317621j337409j340687j324475j369714j461387
3163.4F16782427j490832j470088j462579j445413j436591j463056j520514j585901
3179.7F04907453j595914j570523j565933j575649j545489j499176j526177j601279
$$ y = [670433164, 669676781, 668987036, 668316543, 667593002, 666833699, 666082740, 665337622, 664541304, 663738430, 663053215, 662439167, 661720216, 660829544, 659916401, 659171879, 658513844, 657768846, 657001853, 656287730, 655551434, 654764354, 653984249, 653225482, 652423739, 651568353, 650716424, 649876595, 649002671, 648069501, 647123873, 646177649, 645208597, 644235790, 643252671, 642301619, 641412079, 640457094, 639360428, 638208389, 637097120, 636009693, 634860575, 633660555, 632492244, 631347537, 630141199, 628859580, 627558231, 626249731, 624933720, 623616099, 622278690, 620938003, 619613528, 618243814, 616782427, 615291595, 613821507, 612358928, 610913515, 609476924, 608013868, 606493354, 604907453, 603311539, 601741016, 600175083, 598599434, 597053945, 595554769, 594028592, 592427313]
3196E92427313j636207j596331j537741j529693j558781j573205j556814j543164j543581
3214.3E78351796j530052j488685j477659j535356j586914j561701j507700j504719
3230.7E66159010j511335j478792j455664j485110j520216j500428j472711j447678
3247E54287076j417518j416504j431167j458466j479507j453042j413941j407981j411498
3265.3E41397452j381516j312792j277864j302958j322031j310110j276135j244009
3281.6E30970037j240611j237094j212657j195490j202166j223326j214385j179576
3298E21264732j190603j223683j220465j214266j229822j274527j360237j399815j367629
3316.3E09783685j382768j456380j493156j510858j568616j614868j628489j662582
$$ y = [592427313, 590791106, 589194775, 587657034, 586127341, 584568560, 582995355, 581438541, 579895377, 578351796, 576821744, 575333059, 573855400, 572320044, 570733130, 569171429, 567663729, 566159010, 564647675, 563168883, 561713219, 560228109, 558707893, 557207465, 555734754, 554287076, 552869558, 551453054, 550021887, 548563421, 547083914, 545630872, 544216931, 542808950, 541397452, 540015936, 538703144, 537425280, 536122322, 534800291, 533490181, 532214046, 530970037, 529729426, 528492332, 527279675, 526084185, 524882019, 523658693, 522444308, 521264732, 520074129, 518850446, 517629981, 516415715, 515185893, 513911366, 512551129, 511151314, 509783685, 508400917, 506944537, 505451381, 503940523, 502371907, 500757039, 499128550, 497465968]
3332.6D97465968j699537j694202j684279j693427j669467j639336j632601j584560
3348.9D84168559j551717j606405j636088j583397j551807j580626j580268j494378
3365.3D71583873j426369j453876j503468j458853j326919j237810j206010j192391
3381.6D60778177j138270j016826r08285q33660q11756q53360q59677p63238o29425
3399.9D52963680o25730p39544p23809n60284m28200l97622m11093m02064l34709k35409
3420.3D48105216j87606j36196M77J47104J93536K43157L42220L50207L11077L46542
3440.7D49715734M35143N46217O78778P42555P57098Q03470Q88676J017928J109421
3459.1D56695020J086146J090765J198917J273334J234591J150758J187264J296998
$$ y = [497465968, 495766431, 494072229, 492387950, 490694523, 489025056, 487385720, 485753119, 484168559, 482616842, 481010437, 479374349, 477790952, 476239145, 474658519, 473078251, 471583873, 470157504, 468703628, 467200160, 465741307, 464414388, 463176578, 461970568, 460778177, 459639907, 458623081, 457714796, 456881136, 456069380, 455216020, 454356343, 453593105, 452963680, 452337950, 451598406, 450874597, 450314313, 449886113, 449488491, 449077398, 448675334, 448340625, 448105216, 447917610, 447781414, 447781891, 447928995, 448122531, 448365688, 448707908, 449058115, 449369192, 449715734, 450150877, 450697094, 451375872, 452118427, 452875525, 453678995, 454567671, 455585599, 456695020, 457781166, 458871931, 460070848, 461344182, 462578773, 463729531, 464916795, 466213793]
3475.4D66213793J397728J486660J476436J414240J448571J555741J614601J614868
3491.7D78222638J611740J661032J697213J700550J757443J788199J754761J822322
3508D92015898J934648J995355K029448K000750J963675J968443K068758K135038K092004
3526.4E10204017K136946K245366K275944K313555K373814K350986K352476K450466
3542.7E28703570K583802K573013K431989K461851K612114K642035K645135K733052
3559E49386561K759218K638936K730787L250897L345251K922356K845585L071309L199935
3577.4E76150835L257393L235102L035367L130972L677666L663480L169895L209650
3593.7F02530360L453076L473699L523231L495455L219902L164589L542185L642619
$$ y = [466213793, 467611521, 469098181, 470574617, 471988857, 473437428, 474993169, 476607770, 478222638, 479834378, 481495410, 483192623, 484893173, 486650616, 488438815, 490193576, 492015898, 493950546, 495945901, 497975349, 499976099, 501939774, 503908217, 505976975, 508112013, 510204017, 512340963, 514586329, 516862273, 519175828, 521549642, 523900628, 526253104, 528703570, 531287372, 533860385, 536292374, 538754225, 541366339, 544008374, 546653509, 549386561, 552145779, 554784715, 557515502, 560766399, 564111650, 567034006, 569879591, 572950900, 576150835, 579408228, 582643330, 585678697, 588809669, 592487335, 596150815, 599320710, 602530360, 605983436, 609457135, 612980366, 616475821, 619695723, 622860312, 626402497, 630045116]
3610F30045116L455102L343344L145456L472805L903151L250599K448261K533495L762901
3628.4F59360230M115999K955615K671778K761841K651513K581239K347350K029001
3644.7F81474566K275467L306091L350437J985133J667618K297044K173901J726091
3661G00256348J530766J228333J087486J572252J610398J060426J677454J824021R28521
3679.4G12776005P54297P30991O43671J148105J672625J146376N83113N22434N01693
3697.7G20479310N65111P96616N90980J27554J67549O77764J045227N79417K4974R537
3718.1G25064039K26379L44991L31402K95401J08659k0981J82152N98252Q18133K06590
3738.5G28155017o44803l83914O92249L81291j45555N37872N96166q9049j44899K83360
$$ y = [630045116, 633500218, 636843562, 639989018, 643461823, 647364974, 650615573, 653063834, 655597329, 659360230, 663476229, 666431844, 669103622, 671865463, 674516976, 677098215, 679445565, 681474566, 683750033, 687056124, 690406561, 692391694, 694059312, 696356356, 698530257, 700256348, 701787114, 703015447, 704102933, 705675185, 707285583, 708346009, 710023463, 711847484, 712776005, 713530302, 714261293, 714904964, 716053069, 717725694, 718872070, 719455183, 719977617, 720479310, 721044421, 721841037, 722432017, 722559571, 722727120, 723404884, 724450111, 725029528, 725054502, 725064039, 725290418, 725635409, 725966811, 726262212, 726370871, 726349890, 726532042, 727130294, 727948427, 728155017, 727510214, 727126300, 727818549, 728199840, 728054285, 728592157, 729188323, 729099274, 728954375, 729237735]
3758.9G29237735K93494q3924q7797R9062L42370M20332J6033k79486l9160L29196
3779.3G30247855R8229j93060K5153J93537J48773j5497k09928j49250j41382n126
3799.7G29999304M03583N0008n1141L70264p093m87804k63929J94132l3975O5625N31197
3822.1G30770171O1512k15888j58429j46330o0379j18792L7252L87311K55228L0934
3842.5G30842590m6074l35455p26640o26743O36399J254439r7632o69599l70860Q7023
3862.9G29947448J68860k21372n1379L25560J41383p0989l23296k35975j7643p6771
3883.3G29585826J66953K4974k44319J49846J18434m03642m30823j14560J25230L25977
3903.7G29303896K32220j12951j63674j41025k71082j51693J02937j7762j98901j5974
$$ y = [729237735, 729531229, 729447305, 729359508, 729458570, 729800940, 730221272, 730237305, 729957819, 729918659, 730247855, 730346084, 730153024, 730178177, 730371714, 730520487, 730504990, 730295062, 730145812, 730004430, 729999304, 730402887, 730452895, 730401754, 730772018, 730764925, 730277121, 730013192, 730207324, 730173349, 730238974, 730770171, 730831683, 730615795, 730457366, 730311036, 730250657, 730131865, 730169117, 730556428, 730811656, 730842590, 730796516, 730461061, 729734421, 729107678, 729744077, 730998516, 730900884, 730231285, 729860425, 729947448, 730116308, 729894936, 729843557, 730169117, 730310500, 730239511, 729916215, 729680240, 729662597, 729585826, 729752779, 729777753, 729533434, 729683280, 729801714, 729398072, 728967249, 728852689, 728977919, 729303896, 729536116, 729423165, 729259491, 729118466, 728847384, 728695691, 728798628, 728780866, 728581965, 728565991]
3924.1G28565991P1168j55032j54316O1810M1485j17243k02656j71482j79K6047q2254
3946.5G27883339o4552l9101l3557q345j0311k0743j3113l0100j07706j22785n2869
3969G27380157k9743l7372N483M5717J192m2677l1113o1512j05322n1677L0875P272
3993.4G27111280m7207l4511
3997.5G27029562
$$ y = [728565991, 728637159, 728482127, 728327811, 728389621, 728431106, 728313863, 728111207, 727939725, 727939546, 727965593, 727883339, 727818787, 727779686, 727746129, 727737784, 727727473, 727706730, 727693617, 727663517, 727555811, 727433026, 727380157, 727350414, 727313042, 727318525, 727364242, 727365434, 727322757, 727291644, 727230132, 727124810, 727073133, 727104008, 727111280, 727064073, 727029562]
##END=$$ End of the data block
