##TITLE=T2PT $$ Begin of the data block
##JCAMP-DX=5.00 $$ ACD/SpecManager v 10.08
##SPECTROMETER/DATA SYSTEM=Alpha
##DATE=11 Mar 2014 10:52:32
##DATA TYPE=INFRARED SPECTRUM
##DATA CLASS=XYDATA
##ORIGIN=
##OWNER=
##NPOINTS=1765
##FIRSTX=399.75695801
##LASTX=3997.56933594
##MAXX=3997.56933594
##MINX=399.75695801
##MAXY=0.75426477
##MINY=0.38831520
##XFACTOR=1.0000000000
##YFACTOR=1.000000000000000e-9
##FIRSTY=0.65306950
##DELTAX=2.03957629
##XUNITS=1/CM
##YUNITS=ARBITRARY UNITS
##XYDATA=(X++(Y..Y))
399.8F53069496L526569L179788L653169K962649J647711K047479K196848R33170R21250
418.1F74138129J816153R73523M42922P79331K72810l79383k50519j33335K12908J371026
438.5F79243565J772046P83145M39167Q62122N17785M14729R83179M34756o16371N6266
458.9F84890389R85504M67479K39313O28829J98602k76089J63496J89841k26915L14891
479.3F87575340P73907o0856l19124M92990M09186K3961N35369O26087N9486J91748
499.7F90308094L58284l71218n15998J14441j52349p90417p13230r41038j402855m45544
520.1F85448170R22143Q19862K35260K26795Q524j92523K14517J81794m72307m90904
540.5F86901331k67088q47579j347422j102388j200080j693785j469553q72254m76599
$$ y = [653069496, 656596065, 659775853, 663429022, 666391671, 668039382, 670086861, 672283709, 673216879, 674138129, 675954282, 676927805, 677370727, 678150058, 678422868, 678043485, 677792966, 677659631, 677872539, 679243565, 681015611, 681798756, 682237923, 683100045, 683617830, 684032559, 685015738, 685450494, 684834123, 684890389, 685875893, 686343372, 686582685, 687211514, 687410116, 687134027, 687297523, 687487364, 687260449, 687575340, 688349247, 688288391, 687969267, 688462257, 688871443, 688895404, 689430773, 690056860, 690116346, 690308094, 690666378, 690295160, 689779162, 689893603, 689741254, 688950837, 688237607, 687296569, 685893714, 685448170, 686370313, 687190175, 687425435, 687652230, 687660754, 687468231, 687682748, 687864542, 687392235, 686901331, 686634243, 685786664, 684439242, 683336854, 682136774, 680442989, 678973436, 678101182, 677624583]
558.8F77624583L90232J316607J106500M23074L50118L10361k70307n21183j27256
577.2F80602729j58190l84212J09375M05848K2888j2756J93477j22487k92957N9247
597.6F80422962j68264q70705q70943q69870j564622j601100q63910p94053q57115
616F71962380J43290J080394J119077J390636J655936J127243J112104K009749K197266
634.3F83798075J692831J645446J368105M89891M47691R64283M97878r6261M5657m94242
654.7F90359354j685321j883924j649976j888812j560032o90818K36988J099348J785040
673.1F84121847J916051J382470J544774K017557J406253R62615J423418R61423j72496
691.4F95563912k45154o30080k195478j965701j38462n81741k418757l022074l720642
$$ y = [677624583, 678014815, 679331422, 680437922, 680860996, 681211114, 681521475, 681251168, 680729985, 680602729, 680444539, 680060327, 680169702, 680575550, 680598438, 680585682, 680779159, 680656672, 680363715, 680422962, 680254698, 679383993, 678513050, 677643180, 676078558, 674477458, 673613548, 672819495, 671962380, 672105670, 673186064, 674305141, 675695777, 677351713, 678478956, 679591060, 681600809, 683798075, 685490906, 687136352, 688504457, 688994348, 689442039, 690406322, 690904200, 690807939, 690853596, 690359354, 688674033, 686790109, 685140133, 683251321, 681691289, 681000471, 681237459, 682336807, 684121847, 686037898, 687420368, 688965142, 690982699, 692388952, 693351567, 694774985, 695736408, 695563912, 695318758, 694688678, 692493200, 690527499, 690389037, 689807296, 687388539, 684366465, 680645823]
709.8F80645823l889381q08776K588272K893091L074049M783690N436242N184650N645335
728.1G05552995N342603L455877K292872K103269J026153K39671R32753R71555J15574
746.5G22033322N63025J243472M99368L67820J343668J050651K36452Q23080J112759
764.8G29273617K46704M18842J304745Q18015L35097J146793J169682K79486O43194
783.2G35636175J202285L42011O0499Q59797M93229k20180M67062P65145q3983L159
803.6G39525199N61535j90019p88331j66238k30968r34660m43459R9540n99027p74622
824G36058950r6142m46319j086593n76556m51505j285613j296162r66192j612067k165735
844.4G26076066k338528k928913l780544m609406m875838l875018j929044q89182k429426
$$ y = [680645823, 676756442, 675947666, 678535938, 681429029, 684503078, 689286768, 694723010, 699907660, 705552995, 710895598, 714351475, 716644347, 718747616, 719773769, 720013440, 720946193, 721917748, 722033322, 722596347, 723839819, 724339187, 724707007, 726050675, 727101326, 727337778, 728160858, 729273617, 729520321, 729939163, 731243908, 732061923, 732397020, 733543813, 734713495, 734992981, 735636175, 736838460, 737180471, 737240970, 738100767, 738593996, 738373816, 738840878, 739606023, 739522040, 739525199, 740086734, 739896715, 739108384, 738942146, 738711178, 737776518, 737333059, 737432599, 736833572, 736058950, 735962808, 735516489, 734429896, 733853340, 733401835, 732116222, 730820060, 729853868, 728241801, 726076066, 723737538, 720808625, 717028081, 712418675, 707542837, 703667819, 701738775, 700849593, 698420167]
862.7F98420167o042123j1451900j8898308k3611784j9572735q872092L510058J5957773
879.1F29439056K4803162K5724530K1174848J6272008J1865497P468164M457772L278672
895.4G44483709K552748J875818J734674J570761R16660N37872N28813O3717n63026
913.7G53701746p36534r22859j344144j445651j263082j309395j365721j107514r03428
932.1G43303418q36849n98073m40538o42061q78275r66429j193047j616001j941860
950.4G34190285k166807k521456k886057l010392l028691l127992l153860l027916
966.8G11267114k983690l051221l095746l304660l854573m465401m929543n220055
983.1F80362225m963935m166245l677547l863752m030585l744960l256440k582312
$$ y = [698420167, 692378044, 680926144, 662027836, 638416052, 618843317, 609971225, 613481283, 629439056, 654242218, 679966748, 701141596, 717413604, 729279101, 736747265, 741205037, 744483709, 747036457, 748912275, 750646949, 752217710, 753134370, 753672242, 754201055, 754264772, 753701746, 752965212, 752042353, 750698209, 749252558, 747989476, 746680081, 745314360, 744206846, 743303418, 742466569, 741868496, 741427958, 740785897, 739907622, 738941193, 737748146, 736132145, 734190285, 732023478, 729502022, 726615965, 723605573, 720576882, 717448890, 714295030, 711267114, 708283424, 705232203, 702136457, 698831797, 694977224, 690511823, 685582280, 680362225, 675398290, 671232045, 667554498, 663690746, 659660161, 655915201, 652658761, 650076449]
999.4F50076449j753509j347840j560152j981318k597272l279984l043771j751184
1015.7F32761419r65357j424253k143860k608001l169179l735721l997803l897250
1032F10819995k894163n13196K221704L698468L442347J810968o19411k883018m194676
1050.4F10889018m636109m510284l696501k158940k39372J695216L226757L720760
1066.7F04290545L066659K093732J444757R78470P10189P73252J001298J682520K612471
1085F18653893K917529K846300K959371K867043K108574J105845M05967l01659j342237
1103.4F32220626k347231k945662k943337j915752Q6784J920044K629221K538621K186835
1121.8F31430149J811028J987338K793073L273845K896965K325892J993120J358270
$$ y = [650076449, 648322940, 646975100, 645414948, 643433630, 640836358, 637556374, 634512603, 632761419, 631796062, 630371809, 628227949, 625619948, 622450769, 618715048, 614717245, 610819995, 607925832, 607412636, 609634340, 613332808, 616775155, 618586123, 617966712, 615083694, 610889018, 606252909, 601742625, 598046124, 595887184, 595647812, 597343028, 600569785, 604290545, 607357204, 609450936, 610895693, 611874163, 612584352, 613357604, 614358902, 616041422, 618653893, 621571422, 624417722, 627377093, 630244136, 632352710, 633458555, 633864522, 633562863, 632220626, 629873395, 626927733, 623984396, 622068644, 622155428, 624075472, 626704693, 629243314, 631430149, 633241177, 635228515, 638021588, 641295433, 644192398, 646518290, 648511410, 649869680]
1138.1F49869680L04580o23047j244247j605570j701475j778245j952350j961350k001703
1156.4F37306273k505302k836049j820445N55098L170431N118489O132781O185890
1172.7F51307166N587160M871726M179180L373086K552927J827478J029790J30772
1189.1F74859285n93125j119972j711189k253533k507269k658963k833546k618372
1205.4F58563316j771271q54671m66824n66304r21964j302719j381040j265109j308739
1223.7F48724675j366794j273990j342594j552701j355231p75516m47750m75764n71728
1242.1F39562607q38399j136303j022101o15298l06845j25468o4432k48194l83556
1260.4F34822011j68264O2883K3365P689N2810j35362l83079m81546o63996n62072
$$ y = [649869680, 650174260, 649551213, 648306966, 646701396, 644999921, 643221676, 641269326, 639307976, 637306273, 634800971, 631964922, 630144477, 630699575, 633870006, 638988495, 645121276, 651307166, 656894326, 661766052, 665945232, 669318318, 671871245, 673698723, 674728513, 674859285, 674266160, 673146188, 671434999, 669181466, 666674197, 664015234, 661181688, 658563316, 656792045, 655937374, 655470550, 654904246, 653982282, 652679563, 651298523, 650033414, 648724675, 647357881, 646083891, 644741297, 643188596, 641833365, 641057849, 640610099, 640134335, 639562607, 638724208, 637587905, 636565804, 635950506, 635643661, 635518193, 635453761, 635205567, 634822011, 634653747, 634716630, 634739995, 634747684, 634800494, 634665132, 634282053, 633800507, 633136511, 632574439]
1280.8F32574439N58853J792491J848459J171112O41167K94447J53899K68221J14978
1299.2F39418066n25117j086355j390397j916945k509535k801954k999783k975523
1315.5F23212457k163232r87529n01156n92470p82073j428962k631426l525197l701449
1333.9F06898963l322124k301157q22722J74701L25382M0829p80642k110839l249824
1352.2E94852567l676832l605902l309667k902210k480865k284586k614141l377199
1368.5E70601165l886223l566801k731204k145827k241969k629817k999544l104567
1384.9E47295213l055454l279209l770470m653216n602061o098509o672561o885410
1401.2E07278323o784320p230341p154375o582261o387561o235510n759210n484551
$$ y = [632574439, 633133292, 634925783, 636774242, 637945354, 638586521, 638880968, 639034867, 639303088, 639418066, 638892949, 637806594, 636416197, 634499252, 631989717, 629187763, 626187980, 623212457, 621049225, 620061696, 619560540, 618968070, 618185997, 616757035, 614125609, 610600412, 606898963, 603576839, 601275682, 600452960, 600627661, 600953043, 600993872, 600213230, 598102391, 594852567, 591175735, 587569833, 584260166, 581357956, 578877091, 576592505, 573978364, 570601165, 566714942, 563148141, 560416937, 558271110, 556029141, 553399324, 550399780, 547295213, 544239759, 540960550, 537190080, 532536864, 526934803, 520836294, 514163733, 507278323, 500494003, 493263662, 486109287, 479527026, 473139465, 466903955, 461144745, 455660194]
1417.5D55660194n418151m129976k579064j591503p25210K62946J185655J698196K224714
1435.9D46587801K421409J615524R71168O82712M24027J97500Q3745N1022M4524M06295
1456.2D53485727J033157J036525R17703J149535J272619J142442J393318K158136
1472.6D63589162K503156K295167K176880K116502K138257K237051K503247K886533
1488.9D82445955L066212K737671K677530L232032L482849L143161K661586L038883
1505.2E06485879M345239L770470K869249K922415L181041L448426L614247M048944
1521.5E34685910L771424L176153L218531K827883K538502K739072K295375J892626
1537.8E57145476K936662L803014L386498L203928L201187L326356L224075L113985
$$ y = [455660194, 450242043, 446112067, 443533003, 441941500, 441216290, 441479236, 442664891, 444363087, 446587801, 449009210, 450624734, 451595902, 452278614, 452702641, 452900141, 452983886, 453034908, 453079432, 453485727, 454518884, 455555409, 456473112, 457622647, 458895266, 460037708, 461431026, 463589162, 466092318, 468387485, 470564365, 472680867, 474819124, 477056175, 479559422, 482445955, 485512167, 488249838, 490927368, 494159400, 497642249, 500785410, 503446996, 506485879, 510831118, 514601588, 517470837, 520393252, 523574293, 527022719, 530636966, 534685910, 538457334, 541633487, 544852018, 547679901, 550218403, 552957475, 555252850, 557145476, 560082138, 563885152, 567271650, 570475578, 573676765, 577003121, 580227196, 583341181]
1554.1E83341181K991736L693760M304945K729356K006114J925528J888335J737416
1570.5F04618371J026153P65145J148343J021266Q13961R02772P43151K93910M3512
1588.8F11376584j18673m67301p42495p99775r63926j298607j460731j607954j946330
1607.2F01970792k231002k326131k499759k865553l104568k722978k590001k763092
1623.5E80867708k512336k284706k051949j530945j185179j055599n94735j72019l3021
1641.8E69447219K02358Q98898J304328Q39591J357019K684295K000928J581133K118110
1660.2E82433879K705694K784788K517402K890945L335535K975703L214597L539265
1676.5F06397808K997934K731741L249526M294038L887295L267289L331124L088057
$$ y = [583341181, 586332917, 590026677, 594331622, 597060978, 599067092, 600992620, 602880955, 604618371, 605644524, 606409669, 607558012, 608579278, 609393239, 610296011, 611039162, 611333072, 611376584, 611257911, 610790610, 610048115, 609248340, 608284414, 606985807, 605525076, 603917122, 601970792, 599739790, 597413659, 594913900, 592048347, 588943779, 586220801, 583630800, 580867708, 578355372, 576070666, 574018717, 572487772, 571302593, 570246994, 569652259, 569480240, 569447219, 569649577, 570548475, 571852803, 572692394, 574049413, 576733708, 578734636, 580315769, 582433879, 585139573, 587924361, 590441763, 593332708, 596668243, 599643946, 602858543, 606397808, 609395742, 612127483, 615377009, 619671047, 623558342, 626825631, 630156755, 633244812]
1692.8F33244812L621161M211188M150092M770399M006326L284573L418684L121794
1709.2F63829029K664029K258063K278864K725601K341747J634062J613617J589834
1725.5F80934846J310051J287222J371383J635313J606763J270592J383066J488388
1741.8F92287624J521170J551926J503945J784026J959801J460552J241148J379907
1758.1G04690099J303971J192212J046717R55582Q39233P87854J071632Q35717J93774
1776.5G12916791O7831J15215q2433k04563k17855l42250k61843J01268M7922j94549
1796.9G11945534J4961M58121N84423N84185P99597R77218J009107J062572J118302
1815.2G18554020J035929R28938Q82089Q15571P03454O27279P38859O76572M58956
$$ y = [633244812, 636865973, 641077161, 645227253, 649997652, 654003978, 657288551, 660707235, 663829029, 666493058, 668751121, 671029985, 673755586, 676097333, 677731395, 679345012, 680934846, 682244897, 683532119, 684903502, 686538815, 688145578, 689416170, 690799236, 692287624, 693808794, 695360720, 696864665, 698648691, 700608492, 702069044, 703310192, 704690099, 705994070, 707186282, 708232999, 709188581, 710027814, 710815668, 711887300, 712723017, 712916791, 712984622, 713099837, 713017404, 712812841, 712594986, 712252736, 711990893, 712092161, 712140083, 711945534, 711960495, 712418616, 713003039, 713587224, 714386821, 715364039, 716373146, 717435718, 718554020, 719589949, 720518887, 721400976, 722216547, 722920001, 723547280, 724286139, 724962711, 725421667]
1833.6G25421667M71711M39644K53499K78532N35011N41330L83913L62933K81334K37167
1854G29206741L12984K95222K20418K44856K09450J18494L07679M63188K24590J11342
1874.4G31714964K13802J89900R5427J56939K03073R9063J43111K57313J30773L9816
1894.7G33244181J30236J47819O8665Q4162J51753R1553M1425J04010M2677o9976Q0228
1917.2G34116733J82867O080J7643J46806O3479m9174J2338N3704o4254r7334j0550
1939.6G34378338J5557n067K8849J907j04129o4075J8895o2108q5056L2127j9133j34707
1964.1G34001398k8551N5254o9499r6917J3232j1802p4923j3053k6167j53958j28687
1986.5G33466327m7564j08779j25885n3108j00135j93596j03891k980j03474j64688
$$ y = [725421667, 725893378, 726333022, 726586521, 726865053, 727400064, 727941394, 728325307, 728688240, 728969574, 729206741, 729519725, 729814947, 730035365, 730280221, 730489671, 730608165, 730915844, 731379032, 731603622, 731714964, 731928766, 732118666, 732214093, 732371032, 732574105, 732673168, 732816279, 733073592, 733204365, 733244181, 733374417, 733522236, 733590901, 733675063, 733826816, 733918369, 733959794, 734063804, 734106481, 734036505, 734116733, 734299600, 734305680, 734323323, 734470129, 734533608, 734484434, 734496772, 734550476, 734486222, 734388888, 734378338, 734393895, 734388828, 734417677, 734419584, 734315455, 734251380, 734270275, 734208167, 734123111, 734155238, 734136105, 734001398, 733972847, 734028101, 733958602, 733861685, 733874917, 733863115, 733788192, 733775139, 733748972, 733595014, 733466327, 733418763, 733309984, 733184099, 733130991, 733030856, 732837260, 732733369, 732730389, 732626915, 732462227]
2006.9G32462227q1300j25230k33710j51991q2374k07186k44021j27912j59204k60591
2027.3G30788708k01702j57476k26915j98662j26541j94311j97291o5923q4758j95682
2047.7G29139447j37627n3823j07765j20342l6538o3598j54495j07586o7592j57952
2068.1G28132129j46389k4557l6121r2804m0651k5868j03235r7812m4882j05738j35303
2090.5G27278769n1498o0261j57654j27912n8472j01804j24038p2658r8526j83225
2110.9G26242721j51753r0659j27077j45912j07765j19091j59025j29997j02222j40012
2131.3G24969208j40488p7248o8306q5056l2306J0371k5928m5955j6332j8775l4690
2153.8G24434495k1935P272K9147L3080M3214N0902L4273M3511Q2732P1704N4836O9380
$$ y = [732462227, 732380927, 732255697, 732021987, 731869996, 731787622, 731580436, 731336415, 731208503, 731049299, 730788708, 730587006, 730429530, 730202615, 730003953, 729877412, 729683101, 729485810, 729419887, 729335129, 729139447, 729001820, 728947997, 728840232, 728719890, 728683352, 728619754, 728465259, 728357673, 728290081, 728132129, 727985740, 727961183, 727925062, 727832258, 727791607, 727765739, 727662504, 727564692, 727519810, 727414072, 727278769, 727227271, 727167010, 727009356, 726881444, 726822972, 726721168, 726597130, 726524472, 726425946, 726242721, 726090968, 726000309, 725873232, 725727320, 725619555, 725500464, 725341439, 725211442, 725109220, 724969208, 724828720, 724751472, 724683166, 724598110, 724565804, 724576175, 724550247, 724504292, 724487960, 724469185, 724434495, 724412560, 724419832, 724448979, 724482059, 724525273, 724576175, 724610448, 724653959, 724736691, 724808395, 724863231, 724932611]
2178.2G24932611M9353J9490K9922M0412K7180L218j0073K563P868J1623K5570q464
2202.7G25131273o3956n5074m1485p5936p9155n5671p9572j05381p9930j01388j58131
2225.2G24235594j24275n1380n4240r1314p5281n0902o0618o4016n5909p1644r4593
2247.6G23441422p5698n0783o5863o9380n5015p2539o3121j1623r239l3796L517L6836
2272.1G22974718k7776r9421o8009k861k1934q1837j26481j76013j72973j23918j21772
2294.5G21951723j32143j19985j54793k21669k50400k61068k78950k59936k14695k73884
2314.9G19784200m07517m23670l30925k67446k60770k87533k74241k04682k02835k55286
2335.3G16869295k75016j77324O0976M07099N41747j03891q99851j087308p75039m14253
$$ y = [724932611, 724981964, 725001454, 725031376, 725071788, 725098968, 725102186, 725092113, 725094676, 725102544, 725114167, 725139737, 725131273, 725067317, 725012243, 724970758, 724894822, 724815667, 724759996, 724680424, 724575043, 724495113, 724393725, 724235594, 724111319, 724059939, 724005699, 723914385, 723839104, 723788202, 723727584, 723663568, 723607659, 723536015, 723441422, 723365724, 723314941, 723249078, 723179698, 723124683, 723052144, 722989023, 722977400, 722968161, 722934365, 722937882, 722974718, 722946942, 722847521, 722779512, 722776651, 722754717, 722672880, 722546399, 722370386, 722197413, 722073495, 721951723, 721819580, 721699595, 721544802, 721323133, 721072733, 720811665, 720532715, 720272779, 720058084, 719784200, 719376683, 718953013, 718622088, 718354642, 718093872, 717806339, 717532098, 717327416, 717124581, 716869295, 716594279, 716416955, 716477931, 716885030, 717426777, 717322886, 716423035, 715335727, 714560688, 714146435]
2355.7G14146435j86324m291J82926K98977L35813M43041N53250N09680M16040L43740
2376.1G17039287K32935J12653L2902l6478j04726j50084j79947j69337j28328j38164
2396.5G16510713j92463k02954j63019j59681k01106k15649k07603k14517k02954j74940
2416.9G14575827j82867k24352k42173k34366k59459k69771k46942k66969l00169k96354
2437.3G12052405k81036k76864k85208l11732l44932l35157l07143l50058l88145l35992
2457.7G08836138l12567l80039m28855m28736m65215n18560n24759n68033o79016p24852
2478.1G03805506p29203q02875q50737q00371p89702q49008q25107p50661p49350p45892
2498.5F95912600o85275o54697o63162o41584o34372o97077p19309o54399o06656n56648
$$ y = [714146435, 713960111, 713955820, 714138746, 714437723, 714773536, 715216577, 715769827, 716279507, 716695547, 717039287, 717272222, 717384875, 717417777, 717381299, 717276573, 717126489, 716946542, 716777205, 716648877, 716510713, 716318250, 716115296, 715952277, 715792596, 715591490, 715375841, 715168238, 714953721, 714750767, 714575827, 714392960, 714168608, 713926435, 713692069, 713432610, 713162839, 712915897, 712648928, 712348759, 712052405, 711771369, 711494505, 711209297, 710897565, 710552633, 710217476, 709910333, 709560275, 709172130, 708836138, 708523571, 708143532, 707714677, 707285941, 706820726, 706302166, 705777407, 705209374, 704530358, 703805506, 703076303, 702273428, 701422691, 700622320, 699832618, 698983610, 698158503, 697407842, 696658492, 695912600, 695227325, 694572628, 693909466, 693267882, 692633510, 691936433, 691217124, 690562725, 689956069, 689399421]
2518.9F89399421m43041l38674k79367j91986p7188l577O1751J46985J75118J50383
2539.2F88599825J63495J60754J07587J14798J68085J73331J45316J34647J06036J7882
2559.6F89891756l2127n305p570m3213m6850o9618j54316k04086j97232k26498k47180
2582.1F88657761j98245j99855k84970l02791k53022k44319k52962k39909k56896l14415
2602.5F86110377l29315k86401k65956k56002k11179j99199k27391k15888j98901k24411
2622.9F83695734k20955j77979j84477k23875k28703k27451k31087k06411k02298k58506
2643.3F81533992k88307k79904l09109l37601l24488l25680l59118l61740l18110k97725
2663.7F78332210l16918l29554l32892l48091l75808l70502l48509l83198m09901m01258
$$ y = [689399421, 688956380, 688617706, 688338339, 688146353, 688069165, 688065588, 688127339, 688274324, 688449442, 688599825, 688763320, 688924074, 689031661, 689146459, 689314544, 689487875, 689633191, 689767838, 689873874, 689891756, 689859629, 689854324, 689846754, 689803541, 689756691, 689687073, 689532757, 689328671, 689131439, 688904941, 688657761, 688459516, 688259661, 687974691, 687671900, 687418878, 687174559, 686921597, 686681688, 686424792, 686110377, 685781062, 685494661, 685228705, 684972703, 684761524, 684562325, 684334934, 684119046, 683920145, 683695734, 683474779, 683296800, 683112323, 682888448, 682659745, 682432294, 682201207, 681994796, 681792498, 681533992, 681245685, 680965781, 680656672, 680319071, 679994583, 679668903, 679309785, 678948045, 678629935, 678332210, 678015292, 677685738, 677352846, 677004755, 676628947, 676258445, 675909936, 675526738, 675116837, 674715579]
2684.1F74715579m30346m67181m68016m72009m95732m72128m30167m65691m93169m69685
2704.5F70051455m81843n04494m79996m40419m47691m62770m24087l96073m05669l74496
2724.8F65633917l40223l96014m36127l88026l58284l46839k80142k31266k60115k76684
2745.2F62320197k77162l29971l62277l27409l28421l88623m09126l85225l86357m00782
2765.6F58724844l85344l78608m16220m09185l67284m15445m70280m44055m38213m80652
2786F54519558m99487m92275n15878n61774n86807o21438o75858o90281o88851p30753
2806.4F48456156p63833p77483q50559r33229r36211r33587r93014j049220j062036
2824.8F40156984j109600j214325j309633j410485j557946j763701k039314k393841
$$ y = [674715579, 674285233, 673818052, 673350036, 672878027, 672382295, 671910167, 671480000, 671014309, 670521140, 670051455, 669569612, 669065118, 668585122, 668144703, 667697012, 667234242, 666810155, 666414082, 666008413, 665633917, 665293694, 664897680, 664461553, 664073527, 663715243, 663368404, 663088262, 662856996, 662596881, 662320197, 662043035, 661713064, 661350787, 661023378, 660694957, 660306334, 659897208, 659511983, 659125626, 658724844, 658339500, 657960892, 657544672, 657135487, 656768203, 656352758, 655882478, 655438423, 655000210, 654519558, 654020071, 653527796, 653011918, 652450144, 651863337, 651241899, 650566041, 649875760, 649186909, 648456156, 647692323, 646914840, 646064281, 645131052, 644194841, 643261254, 642268240, 641219020, 640156984, 639047384, 637833059, 636523426, 635112941, 633554995, 631791294, 629751980, 627358139]
2841.1F27358139k836407l264010l384649k903045j881837q57592l10302j74463j58608
2859.5F11587226k25722m44115o79910q12471q62896p94053o03140m82797n41210o59407
2879.9F05481505q12351j053155j328170j594305j772881j715779j424134j053750
2896.2E94726980p01189l83735j98007k72870n69999r50098j354754j716852j816273
2914.5E86763203j516640r83417m52459J3352L95655O12795P05302P90477Q65340Q82447
2934.9E88076055P95066O07431M33803L98159M89593N77330O00457N28694L25381J06216
2955.3E92938185M6670J23680J73509J76907J95026K71499N40376R92954J336038J399755
2975.7E98194599J340211J276373J143456R58025Q25644P30753N92112M36426L24249
$$ y = [627358139, 624521732, 621257722, 617873073, 614970028, 613088191, 612230599, 611920297, 611745834, 611587226, 611361504, 610917389, 610237479, 609425008, 608562112, 607768059, 607164919, 606682122, 606140912, 605481505, 604669154, 603615999, 602287829, 600693524, 598920643, 597204864, 595780730, 594726980, 594025791, 593642056, 593444049, 593171179, 592601180, 591651082, 590296328, 588579476, 586763203, 585246563, 584263146, 583810687, 583824039, 584219694, 584832489, 585537791, 586328268, 587193608, 588076055, 588871121, 589478552, 589912355, 590310514, 590800107, 591377437, 591977894, 592506588, 592831969, 592938185, 592984855, 593108535, 593282044, 593458951, 593653977, 593925476, 594465852, 595458806, 596794844, 598194599, 599534810, 600811183, 601954639, 602912664, 603738308, 604469061, 605061173, 605497599, 605821848]
2994.1F05821848K01881O4492k0266r6321j78456k19166k34187k48670k74480k97427
3014.5F04519248l23892l74376m11392m47511n11527n79358o10590n95271n92768o46472
3034.9E99426091p32780p71105p31349p07328p71642q37028q12471q03888q50141q29637
3055.3E91578722q08597q75949q78513p74503p18534p62701q11577q08537p93040p52210
3075.6E83594561o81878o86347p78079q25524q27134q45373q20458p88271q26597q45373
3096E75669527p85828p72416q67069r20892q56161q08000q60751q95560q57055q59022
3116.4E67186773r31502j044333j152694j158595j075446j032889j080156j105785
3132.8E58605373j053572j028776j088917j196087j286089j306057j254797j148999
$$ y = [605821848, 606023729, 606088221, 606067955, 605971634, 605793178, 605574012, 605339825, 605091155, 604816675, 604519248, 604195356, 603820980, 603409588, 602962077, 602450550, 601871192, 601260602, 600665331, 600072563, 599426091, 598693311, 597922206, 597190857, 596483529, 595711887, 594874859, 594062388, 593258500, 592408359, 591578722, 590770125, 589894176, 589015663, 588241160, 587522626, 586759925, 585948348, 585139811, 584346771, 583594561, 582912683, 582226336, 581448257, 580622733, 579795599, 578950226, 578129768, 577341497, 576514900, 575669527, 574883699, 574111283, 573244214, 572323322, 571467161, 570659161, 569798410, 568902850, 568045795, 567186773, 566255271, 565210938, 564058244, 562899649, 561824203, 560791314, 559711158, 558605373, 557551801, 556523025, 555434108, 554238021, 552951932, 551645875, 550391078, 549242079]
3149.1E49242079j086354j197875j378178j426697j376212j322746j288295j316428
3165.4E38849294j386583j417339j408815j409233j402020j373172j396119j464844
3181.7E27591169j484752j480341j488626j478970j475215j501202j514197j527786
3198E15640080j582861j606047j591504j609504j630127j653314j683891j727164j806855
3216.4E00748813j835018j827240j881719j913786j865059j758546j558661j365006
3232.7D86743778j357704j400501j267493j074582r37700q33482q53479r79543j051902
3251.1D76987392j046092j064330j200587j353412j377672j313091j204490j052022
3267.4D67375696r12965q87960r29087r39369r48579r45419r43958r84937j025468
$$ y = [549242079, 548155725, 546957850, 545579672, 544152975, 542776763, 541454017, 540165722, 538849294, 537462711, 536045372, 534636557, 533227324, 531825304, 530452132, 529056013, 527591169, 526106417, 524626076, 523137450, 521658480, 520183265, 518682063, 517167866, 515640080, 514057219, 512451172, 510859668, 509250164, 507620037, 505966723, 504282832, 502555668, 500748813, 498913795, 497086555, 495204836, 493291050, 491425991, 489667445, 488108784, 486743778, 485386074, 483985573, 482718080, 481643498, 480705798, 479872316, 479018837, 478039294, 476987392, 475941300, 474876970, 473676383, 472322971, 470945299, 469632208, 468427718, 467375696, 466462731, 465574771, 464645684, 463706315, 462757736, 461812317, 460868359, 459883422, 458857954]
3285.7D58857954j028479r95278j021236j147837j238167j260877j215368j032710
3302D49918002q85904r77665j164109j264304j295447j266658j222849j262277j364530
3320.4D39214259j425117j472950j658738j888185j959294j904011j811236j737714
3336.7D25357014j762390j801849j714795j563698j361609j097679r78619j037776
3353D14038599j038164r31144q65400r49502j038551r47565r29415j154662j331776
3371.4D04852420j239866r97156p96437p10130p36356p51853o87062n91785n09024
3389.7C97832751o09845r32574j076370q23349o00368p90477j035690q59588n20111
3408.1C90584379l77148l54737l89397m11600k73108j27048j61230j61589K5481J46777
$$ y = [458857954, 457829475, 456834197, 455812961, 454665124, 453426957, 452166080, 450950712, 449918002, 449032098, 448054433, 446890324, 445626020, 444330573, 443063915, 441841066, 440578789, 439214259, 437789142, 436316192, 434657454, 432769269, 430809975, 428905964, 427094728, 425357014, 423594624, 421792775, 420077980, 418514282, 417152673, 416054994, 415076375, 414038599, 413000435, 412069291, 411203891, 410254389, 409215838, 408268273, 407338858, 406184196, 404852420, 403612554, 402615398, 401818961, 401108831, 400372475, 399620622, 398933560, 398341775, 397832751, 397222906, 396290332, 395213962, 394390613, 393790245, 392999768, 391964078, 391104490, 390584379, 390207231, 389852494, 389463097, 389051497, 388778389, 388651341, 388490111, 388328522, 388354003, 388500780]
3428.5C88500780M6939J1682J28150M6730k12312k06768L2007K18481L29823K83271
3448.9C89178783J85668K41429L58015M63635N45323N18799N08219P09742Q89957O91205
3469.3C94290775L60072L64750N76228P51645Q36432P63893O98417Q16137Q87096Q01086
3489.7D01146531Q11875R41545J021445R50455R07004J082361J081675Q12441Q54165
3508D09609497J134932J233071J138061R98676R93311J149625J353711J340270J186609
3526.4D20137763J216441J244754J217753J383275J500457J307815J224786J466841
3542.7D30699885J741379J658798J300722J311123J541347J492887J432777J560151
3559D42739069J520217J250416J655757K672047K403498J430332J405120J763523J873821
$$ y = [388500780, 388547719, 388559401, 388687551, 388734281, 388521969, 388315201, 388347208, 388565689, 388895512, 389178783, 389364451, 389605880, 389963895, 390427530, 390972853, 391491652, 391999871, 392709613, 393599570, 394290775, 394650847, 395015597, 395591825, 396343470, 397179902, 397943795, 398642212, 399458349, 400345445, 401146531, 401958406, 402899951, 403921396, 404871851, 405778855, 406861216, 407942891, 408755332, 409609497, 410744429, 411977500, 413115561, 414114237, 415107548, 416257173, 417610884, 418951154, 420137763, 421354204, 422598958, 423816711, 425199986, 426700443, 428008258, 429233044, 430699885, 432441264, 434100062, 435400784, 436711907, 438253254, 439746141, 441178918, 442739069, 444259286, 445509702, 447165459, 449837506, 452241004, 453671336, 455076456, 456839979, 458713800]
3577.4D58713800J909285J783461J549601J989603K811283K293229J421154J792878
3593.7D74264294K300531K223640K227456K120196J651019J713187K438128K582639
3610D91521090K273709K017438J791895K621054L222108J892388N97179J216054L820837
3628.4E10973752M112660J837135J457214J785338J815319J799345J301706P95305
3644.7E25877774J849234M286468L770351Q13306Q58545K381444J904607J066029Q73864
3663E43681622M21881O00517K065122J855731Q15869K570211K468884L15011m5538
3681.4E54749310k65658k58624J441240K896309J426637j03235j83225L4034O04391
3699.8E60341179J352132N78403p14421m22180J263738K240360N08487j003563p67828
$$ y = [458713800, 460623085, 462406546, 463956147, 465945750, 468757033, 471050262, 472471416, 474264294, 476564825, 478788465, 481015921, 483136117, 484787136, 486500323, 488938451, 491521090, 493794799, 495812237, 497604132, 500225186, 503447294, 505339682, 505936861, 507152915, 510973752, 515086412, 516923547, 518380761, 520166099, 521981418, 523780763, 525082469, 525877774, 527727008, 532013476, 535783827, 536597133, 537455678, 539837122, 541741729, 542807758, 543681622, 544103503, 544704020, 546769142, 548624873, 549440742, 552010953, 554479837, 554794848, 554749310, 554483652, 554225028, 555666268, 558562577, 559989214, 559885979, 559702754, 559736788, 560341179, 561693311, 562271714, 561557293, 561135113, 562398851, 564639211, 565147698, 564144135, 563376307]
3718.1E63376307j40190J26064K24292P4327q49306j150549R7454J719594J824200
3736.5E65302193m73857k320766m74394K460719N67853m09782K205670J655400r63152
3754.8E67549884r12368M70102K82407n74768k44141K28346O87897O15418m75824r26614
3775.2E66700339j25885P96080L01897l10122j9610l9459k89559n28812n86033k21014
3795.6E65677822m17412J37866J322508r954j80424Q53062o41167j872301p34449P15256
3816E64850807N4658N39660J317322n04374j045704o26683m66526k71618l62098L48031
3836.4E63833475J170218L79205k31385m11451j420498k432704j421094K839863L828526
3854.8E66134155q90434k394259j271009M7147J46746o02841K69532R62138M1187o58691
$$ y = [563376307, 563236117, 563362181, 563586473, 563660800, 562811494, 561660945, 561758399, 563477993, 565302193, 564828336, 562507570, 562033176, 564493895, 565061748, 564651966, 566857636, 568513036, 567549884, 566637516, 567107618, 567390025, 566815257, 566571116, 566799462, 567487359, 568102777, 567626953, 566700339, 566574454, 567370534, 567672431, 567362309, 567342699, 567303240, 567013681, 566484869, 565898836, 565677822, 565260410, 565398276, 566720784, 566710830, 566530406, 567383468, 566742301, 564870000, 564135551, 564850807, 564905465, 565445125, 566762447, 566258073, 565212369, 564585686, 564119160, 563847542, 563485444, 563833475, 565003693, 565382898, 565151513, 564740062, 563319564, 560886860, 559465766, 562305629, 566134155, 565243721, 562849462, 561578453, 561625600, 561772346, 561169505, 561439037, 562401175, 562442362, 561783671]
3875.2E61783671j085937k79843K79545j18851M82559j65463q05795L69907m1902j438141
3895.5E58979750j057208J18673Q00431J049816L27766p67648q79347o81937o43253
3913.9E57247043r0182M37319L0041m12047j34409j28984n32389j92582L67760q34
3934.3E56590736n91695o64831l27169O7055j35899l42369k6643p689k89321l45767
3954.7E53926408k64823k34842j57297j11461k47836l17812k10702j04130j06513j41561
3975.1E52029431j59323j87576j62959j09494j71781k71201k35378j80424j73986j14858
3995.5E50262451j14798
3997.5E50147653
$$ y = [561783671, 560697734, 560417891, 560697436, 560578585, 561061144, 560895681, 560089886, 560459793, 560417891, 558979750, 557922542, 558041215, 558841646, 559891462, 560219228, 559451580, 558572233, 557890296, 557247043, 557156861, 557594180, 557624221, 557212174, 557077765, 556948781, 556416392, 556223810, 556591570, 556590736, 555999041, 555334210, 555007041, 555074096, 554938197, 554595828, 554569185, 554561496, 554272175, 553926408, 553661585, 553426743, 553269446, 553157985, 552910149, 552592337, 552381635, 552277505, 552170992, 552029431, 551870108, 551682532, 551519573, 551410079, 551238298, 550967097, 550731719, 550551295, 550377309, 550262451, 550147653]
##END=$$ End of the data block
