##TITLE=T2PR $$ Begin of the data block
##JCAMP-DX=5.00 $$ ACD/SpecManager v 10.08
##SPECTROMETER/DATA SYSTEM=Alpha
##DATE=11 Mar 2014 10:52:32
##DATA TYPE=INFRARED SPECTRUM
##DATA CLASS=XYDATA
##ORIGIN=
##OWNER=
##NPOINTS=1765
##FIRSTX=399.75695801
##LASTX=3997.56933594
##MAXX=3997.56933594
##MINX=399.75695801
##MAXY=0.79290050
##MINY=0.44695440
##XFACTOR=1.0000000000
##YFACTOR=1.000000000000000e-9
##FIRSTY=0.67403519
##DELTAX=2.03957629
##XUNITS=1/CM
##YUNITS=ARBITRARY UNITS
##XYDATA=(X++(Y..Y))
399.8F74035192L778457M395902M59254N98192L880740J655459r65476J978278L080189
$$ 674035192 677813649 682209551 682668805 683266997 687147737 688803196 687837720 689815998 692896187
418.1F92896187p90655L99828L786623J131654j772761J010894J984775j410067q00013
$$ 692896187 692105532 692505360 696291983 697423637 695650876 696661770 698646545 697236478 696436465
436.5F96436465K501070P82430j448631J288653K173602j187742r94145J988589O84202
$$ 696436465 698937535 699719965 698271334 699559987 701733589 700545847 699551702 701540291 702224493
454.8G02224493j552463N81265J448333j459062j371860J653194P79927j614571L43800
$$ 702224493 700672030 701253295 702701628 701242566 699870706 701523900 702303827 700689256 701033056
473.2G01033056J839876q68619j449584J349151Q92996j738131k61485J746297l36469
$$ 701033056 702872932 702004313 700554729 701903880 702796876 701058745 700797260 702543557 702207088
491.5G02207088j349151J129270J208544j144171k74241J699328k16662j775563M66704
$$ 702207088 700857937 701987207 703195751 702051580 701777339 703476667 703260005 701484442 701951146
509.9G01951146J014650j529694j312852J038492J50383j268387P44045J905441k50518
$$ 701951146 702965796 701436102 700123250 701161742 701312125 700043738 700787783 702693224 702442706
528.3G02442706m49717J792073J273393p62403M21048J924038J2517j094878Q42810
$$ 702442706 701992989 703785062 705058455 704296052 704717100 706641138 706653655 705558777 706401587
546.6G06401587R02950j344919q86083Q48890m65334j664877L11971J166105p16149
$$ 706401587 707304537 705959618 705073535 705922425 705457091 703792214 704104185 705270290 704554141
565G04554141q44360R05991J79887j496256k59340R56297o84738j190722R22024J069487
$$ 704554141 703709781 704615772 704795659 703299403 703040063 703996360 703311622 702120900 703042924 704112411
585.4G04112411o70970R0241J584113J55330j124561L18468P86483r80556j021981
$$ 704112411 703441441 703531682 705115795 705271125 704146564 704465032 705251515 704270959 703248978
603.7G03248978M43995l39687j600504j62721J069904k33293m67896J539587J697004
$$ 703248978 703692973 703353286 701752782 701590061 702659965 702426672 701958776 703498363 705195367
622.1G05195367J77086P62999K029538Q81851m0531J479566J980304J90437M530J486182
$$ 705195367 705372453 706135452 708164990 709046841 709006310 710485876 712466180 712656617 712661147 714147329
642.5G14147329P76291q30650J49846J308620p6592o83785J021982J263141j98900
$$ 714147329 714923620 714092970 714242816 715551436 715474844 714791059 715813041 717076182 716877282
660.8G16877282K31921J032651m82857o28829K201497K178669K57015J0848J498342
$$ 716877282 717109203 718141854 717658997 717030168 719231665 721410334 721667349 721678197 723176539
679.2G23176539J074076m27544L30984J349390j00732j194120k26080p83503l210783
$$ 723176539 724250615 723823071 724154055 725503445 725402713 724208593 723982513 723199010 719988227
697.5G19988227k433419P30812J34170k874315l614544l970206m695893j635372L229141
$$ 719988227 717554808 718285620 718419790 715545475 711930931 707960725 703264832 701629460 704858601
715.9G04858601M011273K671719L964663O191074N809844M570007N006969M646182
$$ 704858601 708869874 711541593 715506256 721697330 727507174 732077181 737084150 741730332
732.2G41730332K150000J063048K017260J469672j63019L32117J387239J78635q63135
$$ 741730332 743880332 744943380 746960640 748430312 748267293 748599410 749986649 750165284 749302149
750.6G49302149L92437Q06570p49588p27058Q07405L44098r58503n5909J029670k6881
$$ 749302149 749694586 750501156 749751568 749024510 749831915 750176013 749217510 749161601 750191271 750164390
771G50164390n84364Q47816J140833k17378J30415J561105Q74579l00229P31051J552940
$$ 750164390 749580026 750427842 751568675 751351297 751481712 753042817 753917396 753617167 754348218 755901158
791.4G55901158L27945O5624J557112J488686O9916M70579J539290N59687n45680M13894
$$ 755901158 756229103 756294727 757851839 759340525 759410441 759881020 761420310 761979997 761434317 761848211
811.7G61848211R76980l14057n83470P54774O22511o35624j36256Q00490k29239j185477
$$ 761848211 762825191 762511134 761927664 762682438 763304949 762669325 762533069 763333559 763104320 761918843
832.1G61918843k90513j56164j849831k567112j736999k004265l687561m089713m405200
$$ 761918843 761628330 761472166 759622335 757055223 755318224 753313959 749626398 745536685 741131485
850.5G41131485p226408p911503l199458J249373J567959K00987k303302q754075j8154502
$$ 741131485 733905077 725993574 722794116 724043489 725611448 725812435 723509133 714755058 696600556
868.9F96600556k4196505k2291720j3077736K121151J9650936K9403209K6794076J9883931
$$ 696600556 672404051 650112331 637034595 639155746 658806682 688209891 715003967 734887898
885.2G34887898J4751613R626687M824638L035903K852082J976788J920402L388405
$$ 734887898 749639511 759266198 764090836 767126739 769978821 771955609 773876011 777264416
901.5G77264416L597975K071261J637996K121746J038253m54962j91390P8141j127958
$$ 777264416 780862391 782933652 784571648 786693394 787731647 787276685 787085295 787163436 786035478
919.8G86035478j613736o40750n95152j537323j214445l12150q96930j719415j074434
$$ 786035478 784421742 783780992 783185840 781648517 780434072 780121922 779224992 777505577 776431143
938.2G76431143p01368j802444k290845j645982k058387l351808l448367l092944l987491
$$ 776431143 775729775 773927331 771636486 769990504 767932117 764580309 761131942 758038998 754051507
956.6G54051507m795850m204511l906846m694880m724919l797949l774285m410386
$$ 754051507 749255657 745051146 741144300 736449420 731724501 727926552 724152267 719741881
972.9G19741881m029751l375947l896177m376888l615380k998769l234804k848625
$$ 719741881 715712130 712336183 708440006 704063118 700447738 697448969 694214165 691365540
989.2F91365540j762688j578152j989842j575947j078605j671493k305687k166033
$$ 691365540 689602852 688024700 686034858 684458911 683380306 681708813 679403126 677237093
1005.5F77237093k435624l468156l873765l545523l766477m251659l866315l282845
$$ 677237093 674801469 671333313 667459548 663914025 660147548 655895889 652029574 648746729
1021.8F48746729l476441l559232k902388k610445k879620k438426j464188j197517
$$ 648746729 645270288 641711056 638808668 636198223 633318603 630880177 629415989 628218472
1038.1F28218472j290381p89344l23594n99503o92487j20461J39356o8009K24650R04321
$$ 628218472 626928091 626138747 625815153 625215650 624523163 624402702 624542058 624474049 624698699 625603020
1058.5F25603020J088798J127839J640618J787663R85503K56121J46985j31130o65128
$$ 625603020 626691818 627819657 629460275 631247938 632233441 632489562 632636547 632505417 631840289
1076.9F31840289p80821l71456P45117K162636K754330K458692J902163J711368J889468
$$ 631840289 631059468 630688012 631433129 633595765 636350095 638808787 640710950 642422318 644311786
1095.2F44311786J591265Q68022O11425N90741J01626k83539O8724M46260M15564P84576
$$ 644311786 645903051 646771073 647382498 647973239 648074865 647791326 647860050 648306310 648721874 649506450
1115.6F49506450J587510J755953J455545J742005K273202K271176K371013K929926
$$ 649506450 651093960 652849913 654305458 656047463 658320665 660591841 662962854 665892780
1132F65892780K939343K182424J669169J478731P77424j19567l33786l23415q17120
$$ 665892780 668832123 671014547 672683716 674162447 674939871 674820304 674486518 674163103 673345983
1150.3F73345983j277447j224041j289069j610220j295864k98322M86970J141787K273500
$$ 673345983 672068536 670844495 669555426 667945206 666649342 666351020 666837990 667979777 670253277
1168.7F70253277L333270L695488L986359M611969M792392M263163L879428L676116
$$ 670253277 673586547 677282035 681268394 685880363 690672755 694935918 698815346 702491462
1185G02491462K861083J804054J299381Q09431k28822j009286j081109j246929j646698
$$ 702491462 705352545 707156599 708455980 709265411 709036589 708027303 706946194 705699265 704052567
1203.3G04052567j461923q84592q09193r41753o23882m05729p39813q20696m38213
$$ 704052567 702590644 701706052 700896859 699955106 699331224 698925495 698185682 697364986 696926773
1221.7F96926773n24462j059293j117647r20475j261055j631618j353204j126945j478076
$$ 696926773 696402311 695343018 694225371 693304896 692043841 690412223 689059019 687932074 686453998
1240.1F86453998j574218j105666q99732r96531o38723j22964k02477l83497l1828
$$ 686453998 684879780 683774114 682874382 681877851 681239128 681116164 680913687 680530190 680498362
1258.4F80498362K27689l8683k325M67420M46141L9458J55091M67599J53899k32041
$$ 680498362 680726051 680687368 680685043 681152463 681598604 681638062 681793153 682260752 682414651 682182610
1278.8F82182610J3649K60830o9081l05713k34246o02424j266837j385391j376569
$$ 682182610 682196259 682457089 682388008 682082295 681848049 681245625 679978788 678593397 677216828
1297.2F77216828k016425k641499k676368k812207l425121l691018l500283l738224
$$ 677216828 675200403 672558904 669882536 667070329 663645208 659954190 656453907 652715683
1313.5F52715683m201770l856242k872645k048791j133442J01984Q19742N98848L59059
$$ 652715683 648513913 644657671 641785026 639736235 638602793 638704777 639524519 640123367 640482426
1331.8F40482426M41134J55151m22240m86135l68834q15451j255810j212001j311779
$$ 640482426 640923560 641078711 640656471 640170336 639801502 638986051 637730241 636518240 635206461
1350.2F35206461j928031k204896j978456k113104k604366k705812k662063l103435
$$ 635206461 633278430 631073534 629095078 626981974 624377608 621671796 619009733 615906298
1366.5F15906298l448784l165245k938986l359795l573954l467083l876388m367947
$$ 615906298 612457514 609292269 606353283 602993488 599419534 595952451 592076063 587708116
1382.8E87708116l812910l008484l499926m449546n142093o076633p175386q104504
$$ 587708116 583895206 580886722 577386796 572937250 567795157 561718524 554543138 546438634
1399.1E46438634q474648q929252j0040581j0231436r830773r898215r667903q707494
$$ 546438634 537963986 529034734 518994153 508762717 498931944 489033729 479365826 470658332
1415.5D70658332p889271p217168n044431k586126r66937O9261J091063J836896J850217
$$ 470658332 462769061 455551893 450507462 447921336 446954399 447023660 448114723 449951619 451801836
1433.8D51801836K056540K307772J564622Q97229O63221O91205P04557L25739K9683
$$ 451801836 453858376 456166148 457730770 458627999 459291220 459982425 460686982 461012721 461042404
1452.2D61042404R7007O54399J169652P50422M69506N43028M22895K95222O54817J489430
$$ 461042404 461139411 461793810 462963462 463713884 464183390 464726418 465149313 465444535 466099352 467588782
1472.6D67588782K001703J982749J844138J743495J929760K103835K268106K774864
$$ 467588782 469590485 471573234 473417372 475160867 477090627 479194462 481462568 484237432
1488.9D84237432L252060K890557K919435M103840M817605M293024L511250M476071
$$ 484237432 487489492 490380049 493299484 497403324 502220929 506513953 510025203 514501274
1505.2E14501274P291615O104707M105747M232884M887163N304754N316854O191670
$$ 514501274 521792889 527897596 532003343 536236227 541123390 546428144 551744998 557936668
1521.5E57936668N962849M650295M553675M222692L993153M328251L530741K924084
$$ 557936668 563899517 568549812 573103487 577326179 581319332 585647583 589178324 592102408
1537.8E92102408M586399N305111M167319L631651L183723L289759L423214L109514
$$ 592102408 596688807 601993918 606161237 609792888 612976611 616266370 619689584 622799098
1554.1F22799098K546371L776490M949331K180756J105845J495301J662314J448691
$$ 622799098 625345469 629121959 634071290 636252046 637357891 638853192 640515506 641964197
1570.5F41964197O18458M76181J181782P64668K18749K77936k9504n92649p87616j027703
$$ 641964197 642582655 643058836 644240618 645005286 645224035 645501971 645472467 644879818 644092202 643064499
1590.9F43064499j556993j875460j895070k108216k501905k573669k533615k795338
$$ 643064499 641507506 639632046 637736976 635628760 633126855 630553186 628019571 625224233
1607.2F25224233l156126l207803l218829l433526l498196l111959k979815l095865
$$ 625224233 622068107 618860304 615641475 612207949 608709753 605597794 602617979 599522114
1623.5E99522114k924204k629757k494752k450705k041697j169801q48532j012325
$$ 599522114 596597910 593968153 591473401 589022696 586980999 585811198 584962666 583950341
1639.8E83950341p00772j99616O84142J373887P75218J728177M242718K932311J827836
$$ 583950341 583249569 583049953 583734095 585107982 585883200 587611377 591854095 594786406 596614242
1658.2E96614242K439499L478646L885388L206909L525615M493534L931046L905654
$$ 596614242 599053741 602532387 606417775 609624684 613150299 617643833 621574879 625480533
1674.5F25480533M351496L638685L140390L870249N690634M909754L488362L544211
$$ 625480533 629832029 633470714 636611104 640481353 646171987 651081741 654570103 658114314
1690.8F58114314L269434M080236N037487M827797N605400M412412L360868L687143
$$ 658114314 661383748 665463984 670501471 675329268 680934668 685347080 688707948 692395091
1707.1F92395091L293812K862037K609789K628028L318787K923429J601934J426459
$$ 692395091 695688903 698550940 701160729 703788757 707107544 710030973 711632907 713059366
1723.4G13059366J821518J801610J621604J529157K322733K378822J185476J379669
$$ 713059366 714880884 716682494 718304098 719833255 722155988 724534810 725720286 727099955
1739.7G27099955J920045J693248J563490J820922K255737K178193J563131J553476
$$ 727099955 729020000 730713248 732276738 734097660 736353397 738531590 740094721 741648197
1756.1G41648197J691282J433730J515567J334250R45390R04798R96411J306355R93431
$$ 741648197 743339479 744773209 746288776 747623026 748568416 749473214 750469625 751775980 752769411
1774.4G52769411J50442q0765J0193p2599j24037j42157k27690J2517M94838L32296
$$ 752769411 752919853 752839088 752849281 752776682 752652645 752510488 752282798 752295315 752790153 753122449
1794.8G53122449m7565J68264P55489R81987Q16524Q32021J129746J371026J275540
$$ 753122449 753074884 753243148 753998637 754980624 755797148 756629169 757758915 759129941 760405481
1813.2G60405481J203537J343667J273394R53019Q97169J042723Q48830P96855R24408
$$ 760405481 761609018 762952685 764226079 765179098 766076267 767118990 767967820 768764675 769689083
1831.5G69689083P00593M98474N02348M84228M34339O57201Q25464N67139L48210K92838
$$ 769689083 770389676 770888150 771390498 771874726 772309065 772966266 773791730 774358869 774707079 774999917
1851.9G74999917L82661M54486L68416L63886M65155L89695K37644M38392O37293L52502
$$ 774999917 775382578 775837064 776205480 776569366 777034521 777424216 777661860 778100252 778737545 779090047
1872.3G79090047J48773K85864M21107L23593K07961K60770K64705K53319L46303L68655
$$ 779090047 779238820 779524684 779945791 780269384 780477345 780738115 781002820 781256139 781602442 781971097
1892.7G81971097L01599J78814J56463K71439K37465J47045K44021L31104K04742O8426
$$ 781971097 782272696 782451510 782607973 782879412 783116877 783263922 783507943 783839047 784043789 784112215
1913.1G84112215J11461K63512K65837J82271K74360J99258R000P9811J81258J15514
$$ 784112215 784223676 784487188 784753025 784935296 785209656 785408914 785417914 785497725 785678983 785794497
1933.5G85794497R5725K11119K00928J11877J44244J90437J16288J8001J01030K21371
$$ 785794497 785890222 786101341 786302269 786414146 786558390 786748827 786865115 786883116 786984146 787205517
1953.9G87205517J30415J6511P8380R6381J0192R3222K67922J69337m4942m887J58131
$$ 787205517 787335932 787352443 787430823 787527204 787537396 787630618 787898540 788067877 788022935 788018048 788176179
1976.3G88176179J42991L8922P8619J06752q226n8949P7308J37448k3365k6524J34051
$$ 788176179 788319170 788358092 788436711 788543463 788535237 788476288 788553596 788691044 788667679 788641155 788775206
1998.8G88775206O4313j24216q3089M9651Q285m9710L8623Q0526k4736r9063n6505
$$ 788775206 788839519 788715303 788632214 788681865 788690150 788640440 788679063 788759589 788734853 788635790 788579285
2021.2G88579285m2081q6784q702P6413l3736j33217m2200K8253m0472k9564Q1063
$$ 788579285 788537204 788450420 788441718 788518131 788484395 788351178 788308978 788337231 788296759 788267195 788348258
2043.6G88348258M4822j02162o9320P9095M7207n5015L4571J21116j2159p2956O7591
$$ 788348258 788393080 788290918 788221598 788300693 788347900 788292885 788327456 788448572 788436413 788363457 788431048
2066.1G88431048Q7202l8445L874J35362M9174r1433J0192J24157J7523l4988R8467
$$ 788431048 788518250 788479805 788483679 788619041 788668215 788576782 788586974 788711131 788728654 788693666 788792133
2088.5G88792133J06514r5546j29939M9055O1989o9201k4021P9632k6703j28150j2398
$$ 788792133 788898647 788803101 788673162 788722217 788784206 788715005 788690984 788770616 788743913 788615763 788603365
2110.9G88603365N2512o8366o5625P4446L0458j21355q4758M6909M411o8248L9161
$$ 788603365 788655877 788587511 788521886 788596332 788626790 788505435 788420677 788467586 788471997 788403749 788442910
2133.4G88442910R4354m5896q4579N2989Q0764J848O9141J71304M9591o4552O7115
$$ 788442910 788537264 788491368 788406789 788459778 788540542 788542390 788611531 788782835 788832426 788767874 788834989
2155.8G88834989J63972P4685Q4996K15590J64628K0504R9838K44677J60337N8114
$$ 788834989 788998961 789073646 789158642 789374232 789538860 789559364 789659202 789903879 790064216 790122330
2176.2G90122330J41919J72794L6776L0935K01523J86741K7359Q3446K19584J02162
$$ 790122330 790264249 790437043 790473819 790504754 790706277 790893018 790920377 791003823 791223407 791325569
2196.6G91325569l9756P5400J66714M2796m172J29580J25945l8922j4842J34290Q7142
$$ 791325569 791285813 791361213 791527927 791570723 791566551 791696131 791822076 791783154 791768312 791902602 791989744
2219G91989744p987Q4877J41978k98m6611Q4818P8797m1008K8729J65999N1677j04784
$$ 791989744 791981757 792066634 792208612 792208314 792161703 792246521 792325318 792284310 792313039 792479038 792530715 792425931
2243.5G92425931Q404J32262J6988m6194Q2016O3002j09553p7128O4730J8418l8624
$$ 792425931 792434335 792566597 792583585 792537391 792619407 792682409 792572856 792495728 792560458 792578876 792540252
2265.9G92540252Q8990J28090n2392r2566R4116J41501J0908j1623N3227m3094k12372
$$ 792540252 792629242 792757332 792704940 792612374 792706490 792847991 792858899 792847276 792900503 792857409 792645037
2288.4G92645037j78218o4790j38164k16484j03890j03057l30269m24326l61800m60327
$$ 792645037 792466819 792402029 792263865 792047381 791943491 791840434 791510165 791085839 790724039 790263712
2308.8G90263712n56051l74496l08335o46055q89659o61492l58999m06206n59568m55201
$$ 790263712 789707661 789333165 789024830 788378775 787489116 786827624 786468625 786062419 785502851 785047650
2329.2G85047650k68697k91586l40164k47180j69397Q285O93143J442551P05064j011253
$$ 785047650 784778953 784487367 784147203 783900023 783730626 783738911 784432054 785874605 786579669 785568416
2349.6G85568416j913726j686812j184225o47723l3439K93613N65111J061857J389265
$$ 785568416 783654690 781967878 780783653 780135930 780102491 780396104 780961215 782023072 783412337
2367.9G83412337J347363J311601J379787J234055R37819Q30114P40707M00663N6386
$$ 783412337 784759700 786071301 787451088 788685143 789622962 790453076 791193783 791594446 791650832
2386.3G91650832r179M351j07110j58369n6923k9623j27077j16945k9325j12057k40564
$$ 791650832 791641653 791646004 791538894 791380525 791323602 791293979 791166902 791049957 791020632 790908575 790668011
2408.7G90668011j45376l8266j41323k07603j17838j21355k43604k18511o6757o3241
$$ 790668011 790522635 790484369 790343046 790135443 790017605 789896250 789652646 789434135 789367378 789304137
2429.1G89304137j86383j90080j49071k39849k90632j91033j40429k18570k45273j94788
$$ 789304137 789117754 788927674 788778603 788538754 788248122 788057089 787916660 787698090 787452817 787258029
2449.5G87258029k50161l59952l28958k63989l39568m24146l87311l93332n16474n75781
$$ 787258029 787007868 786647916 786318958 786054969 785715401 785291255 784903944 784510612 783994138 783418357
2469.9G83418357n30541n57720o90699p59125p73787q73745r55879r07481q66711r01759
$$ 783418357 782887816 782330096 781639397 780880272 780106485 779232740 778276861 777369380 776502669 775600910
2490.3G75600910q96096q28803p78675p42435o31988n01454m88758n33223n39542n87344
$$ 775600910 774704814 773876011 773097336 772354901 771722913 771221459 770732701 770199478 769659936 769072592
2510.7G69072592p23958p88629o95705n80549m86970l14475j15692l7611R835J84178
$$ 769072592 768348634 767560005 766864300 766283751 765796781 765482306 765366614 765329003 765338838 765523016
2531.1G65523016L73364M13775L89636L70741K79903J97649K39671L24726L67999L96669
$$ 765523016 765896380 766310155 766699791 767070532 767350435 767548084 767787755 768112481 768480480 768877149
2551.5G68877149L99589L01480J52469R6560J33752J37926Q1837M3511K6643j9490
$$ 768877149 769276738 769578218 769730687 769827247 769960999 770098925 770180762 770224273 770250916 770231426
2571.9G70231426o5327p5638o7234p1049j00136j22785j41025j64807j58310j26540
$$ 770231426 770166099 770090461 770023227 769952178 769852042 769729257 769588232 769423425 769265115 769138575
2592.3G69138575j13428j36435j80364k14398k07066j66476j37746j37508j15812q2374
$$ 769138575 769025147 768888712 768708348 768493950 768286884 768120408 767982662 767845154 767729342 767646968
2612.7G67646968j29819j78337j07169l2067l4273n2690p5102j08898j43707j23202
$$ 767646968 767517149 767338812 767231643 767199576 767165303 767112613 767037511 766928613 766784906 766661704
2633.1G66661704n0784l8206p4446o9678p1943j45376k20179j98603j51873j83522
$$ 766661704 766610920 766572714 766498268 766428590 766356647 766211271 765991092 765792489 765640616 765457094
2653.5G65457094k15054k02894k32101l02195k75433j94311k48313l40343l13341l02852
$$ 765457094 765242040 765039146 764807045 764504850 764229417 764035106 763786793 763446450 763133109 762830257
2673.9G62830257l86536l94225l18885l04699l28302l18348l04223l37719l64960l38733
$$ 762830257 762443721 762049496 761730611 761425912 761097610 760779262 760475039 760137320 759772360 759433627
2694.3G59433627l42309l83497l55005l03566l58522m36724l98635l39508l79444m05073
$$ 759433627 759091318 758707821 758352816 758049250 757690728 757254004 756855369 756515861 756136417 755731344
2714.6G55731344l21269k90513l91841m17650l16739l04341l76999l59357l07858l32296
$$ 755731344 755410075 755119562 754727721 754310071 753993332 753688991 753311992 752952635 752644777 752312481
2735G52312481l60608l15129k72572l22402l37660k65479l11792m57645m42326l09110
$$ 752312481 751951873 751636744 751364172 751041770 750704110 750438631 750126839 749669194 749226868 748917758
2755.4G48917758l13758m00782l79562l55900m51028m82261l75092l66092m88341n12063
$$ 748917758 748604000 748203218 747823656 747467756 747016728 746534467 746159375 745793283 745304942 744792879
2775.8G44792879m45247m84884n72979n40912m84527n23150n28812m72009n19157o40809
$$ 744792879 744347632 743862748 743289769 742748857 742264330 741741180 741212368 740740359 740221202 739580393
2796.2G39580393o34194n38528n81324p12573p07507o47426p37071q43585p97212p80344
$$ 739580393 738946199 738407671 737826347 737113774 736406267 735758841 735021770 734178185 733380973 732600629
2816.6G32600629q84175r26316r10043r98796j136541j161516j155793j279831j468480
$$ 732600629 731716454 730790138 729880095 728881299 727744758 726583242 725427449 724147618 722679138
2835G22679138j621246j839519k232194k687573l079772l276169k896250j873612r07838
$$ 722679138 721057892 719218373 716986179 714298606 711218834 707942665 705046415 703172803 702264965
2853.3G02264965n63324n98848o10351o65546r07898j116156j137793j145900j158774
$$ 702264965 701701641 701102793 700492442 699826896 698918998 697802842 696665049 695519149 694360375
2871.7F94360375j006603p93516p11561o86943o18279o19412p60913q54432q15213
$$ 694360375 693353772 692560256 691848695 691161752 690543473 689924061 689163148 688308716 687493503
2890.1F87493503q15391r07302q97646p88153p94231q75295q97288r99033j318932
$$ 687493503 686678112 685770810 684873164 684085011 683290780 682415485 681518197 680519164 679200232
2908.4F79200232j684666j938700k055228j862049j261890n71370j16766J92166M74155
$$ 679200232 677515566 675576866 673521638 671659589 670397699 669826329 669709563 669901729 670375884
2926.8F70375884O50882P04527P89583R92119J094759J051187J086355J163959J110733
$$ 670375884 671026766 671731293 672520876 673512995 674607754 675658941 676745296 677909255 679019988
2945.1F79019988R37938P50363N90325M40180L53873L87907M54425M80831N39541O50525
$$ 679019988 679957926 680708289 681298614 681738794 682092667 682480574 682934999 683415830 683955371 684605896
2965.5F84605896O97554O78181P42555Q42810P87198O47605N97179N59091M56393M22001
$$ 684605896 685303450 685981631 686724186 687566996 688354194 689001799 689598978 690158069 690614462 691036463
2985.9F91036463M43995L59237K48015K50816K22624O8724l9697l6955m7147j53840
$$ 691036463 691480458 691839695 692087710 692338526 692561150 692629874 692590177 692553222 692506075 692352235
3006.3F92352235k55704k48074k77519l94166m51803m86553n85854o74724p00593p55907
$$ 692352235 692096531 691848457 691570938 691176772 690724969 690238416 689652562 688977838 688277245 687521338
3026.7F87521338q29637p77185p02559q23856r98318r64463q67665r30369j028060
$$ 687521338 686691701 685914516 685211957 684388101 683389783 682425320 681557655 680627286 679599226
3045.1F79599226j018763r90450j052797j110494j062394j031339j073777j058460
$$ 679599226 678580463 677590013 676537216 675426722 674364328 673332989 672259212 671200752
3061.4F71200752r82821r76562j039207j064956j054585j047671r69708q61347r06348
$$ 671200752 670217931 669241369 668202162 667137206 666082621 665034950 664065242 663203895 662297547
3079.7F62297547j037240j040936r90569j027882j059533j030504j024187j043916
$$ 662297547 661260307 660219371 659228802 658200920 657141387 656110883 655086696 654042780
3096F54042780j007497r43661r88960j084685j052916j005233j102507j146137j011014
$$ 654042780 653035283 652091622 651102662 650017977 648965061 647959828 646857321 645711184 644700170
3114.4F44700170r75967j153886j303792j326800j337707j316070j212478j171887
$$ 644700170 643724203 642570317 641266525 639939725 638602018 637285948 636073470 634901583
3130.7F34901583j249015j305401j243055j236558j419843j512408j400411j336455
$$ 634901583 633652568 632347167 631104112 629867554 628447711 626935303 625534892 624198437
3147F24198437j341045j291752j334369j518607j609981j521528j428127j462281j509249
$$ 624198437 622857392 621565640 620231271 618712664 617102683 615581155 614153028 612690747 611181498
3165.4F11181498j465083j471281j582205j591027j485705j466572j527727j523852
$$ 611181498 609716415 608245134 606662929 605071902 603586197 602119625 600591898 599068046
3181.7E99068046j468301j503587j553774j500010j488865j567542j558841j472175
$$ 599068046 597599745 596096158 594542384 593042374 591553509 589985967 588427126 586954951
3198E86954951j487612j560867j524806j442194j468540j509666j452386j425445j497508
$$ 586954951 585467339 583906472 582381666 580939472 579470932 577961266 576508880 575083435 573585927
3216.4E73585927j514673j431525j419603j487792j455009j336336j275778j278162
$$ 573585927 572071254 570639729 569220126 567732334 566277325 564940989 563665211 562387049
3232.7E62387049j326263j384616j405954j388133j289725j208305j278222j360357
$$ 562387049 561060786 559676170 558270216 556882083 555592358 554384053 553105831 551745474
3249E51745474j311838j230896j219749j257479j273871j274168j266361j188099j072526
$$ 551745474 550433636 549202740 547982991 546725512 545451641 544177473 542911112 541723013 540650487
3267.4E40650487j026928j091719j152158j148462j139939j101494j040697j031101
$$ 540650487 539623559 538531840 537379682 536231220 535091281 533989787 532949090 531917989
3283.7E31917989j032829r82940r44674r45926r52959r98735j105845j156271j021981
$$ 531917989 530885160 529902220 528957546 528011620 527058661 526059926 524954081 523797810 522775829
3302E22775829q81136r88662j199067j284062j302600j327753j300216j232505j253903
$$ 522775829 521894693 520906031 519706964 518422902 517120302 515792549 514492333 513259828 512005925
3320.4E12005925j317382j316130j364410j490950j547516j482367j373112j315415
$$ 512005925 510688543 509372413 508008003 506517053 504969537 503487170 502114058 500798643
3336.7E00798643j356990j404583j431167j514226j475901j293868j321882j528739
$$ 500798643 499441653 498037070 496605903 495091677 493615776 492321908 491000026 489471287
3353D89471287j528621j370192j341104j391202j337648j195967j152665j298964j493722
$$ 489471287 487942666 486572474 485231370 483840168 482502520 481306553 480153888 478854924 477361202
3371.4D77361202j510739j377106j268267j226515j256615j224250j064419r09269
$$ 477361202 475850463 474473357 473205090 471978575 470721960 469497710 468433291 467524022
3387.7D67524022q10146q68798j101553j145065q44806o26147q34853j156449j100630
$$ 467524022 466713876 465845078 464743525 463598460 462753654 462127507 461292654 460136205 459035575
3406.1D59035575q25256p00146p13944p56353p59006o57856n37783m86195m22210k97665
$$ 459035575 458210319 457510173 456796229 456039876 455280870 454623014 454085231 453599036 453176826 452879161
3426.5D52879161j93119j95057j68442q9676j93655m03702l75629j60187M6283K50757
$$ 452879161 452686042 452490985 452322543 452232867 452039212 451635510 451259881 451099694 451145977 451396734
3446.8D51396734K17914N1350J39325L17216M15683M87447M81903M97193O78926Q09640
$$ 451396734 451614648 451665998 451805323 452122539 452538222 453025669 453507572 454004765 454683691 455493331
3467.2D55493331N72413K37823L32534O68168Q37773Q34525P75516P61479Q41916R25898
$$ 455493331 456065744 456303567 456636101 457304269 458142042 458976567 459752083 460513562 461355478 462281376
3487.6D62281376R28044R12101R89407J126855J105130J026482J179724J246512R95934
$$ 462281376 463209420 464121521 465110928 466237783 467342913 468369395 469549119 470795631 471791565
3506D71791565J008839J325756J417965J259595J104712J110375J294136J593560J600892
$$ 471791565 472800404 474126160 475544125 476803720 477908432 479018807 480312943 481906503 483507395
3524.4D83507395J330644J380205J541823J487851J564413J699955J553297J440108
$$ 483507395 484838039 486218244 487760067 489247918 490812331 492512286 494065583 495505691
3540.7D95505691J648068J995385K006054J544356J460493J853585J838863J652896
$$ 495505691 497153759 499149144 501155198 502699554 504160047 506013632 507852495 509505391
3557E09505391J814723J853407J496553J832783L168762L033817J598418J363992J985073
$$ 509505391 511320114 513173521 514670074 516502857 519671619 522705436 524303854 525667846 527652919
3575.3E27652919K278507K316237K205073J838267K091646L297687L133476J767277
$$ 527652919 529931426 532247663 534452736 536291003 538382649 541680336 544813812 546581089
3591.7E46581089J891554K714395K698601K602040K615035K064049J892090K889156
$$ 546581089 548472643 551187038 553885639 556487679 559102714 561166763 563058853 565948009
3608E65948009L356159K874196K513826K039790K817988M018903K614200P13766R67443
$$ 565948009 569304168 572178364 574692190 576731980 579549968 583568871 586183071 586896837 587864280
3626.3E87864280M262924N612135K558410J635075K232670K295912K316057J868904
$$ 587864280 592127204 597739339 600297749 601932824 604165494 606461406 608777463 610646367
3642.6F10646367J029968J742184M857123N354286J600742O26028K651989K510428
$$ 610646367 611676335 613418519 618275642 623629928 625230670 625856698 628508687 631019115
3659F31019115J232505J080334O98627M97758K238929K815902Q64506K409101L476202
$$ 631019115 632251620 633331954 634030581 634528339 636767268 639583170 640447676 642856777 646332979
3677.3F46332979Q09014o4194j21534l68476J128793L257036K155125J15454k54452
$$ 646332979 647141993 647077799 646956265 646587789 647716582 650973618 653128743 653244197 652989745
3695.7F52989745p6949M01020J421809J086294m88877o52850J034737K738357J380801
$$ 652989745 652912796 653313816 654735625 655821919 655333042 654680192 655714929 658453286 659834087
3714F59834087p78854q84533r0718L65376M78447M63009m11034j091063L9160J954556
$$ 659834087 659055233 658170700 658079982 658445358 658923805 659386814 658975780 657884717 657923877 659878433
3734.4F59878433K394557J99198k436935j538158K373755J410782r34541J570940K191007
$$ 659878433 662272990 662472188 660035253 658497095 660870850 662281632 661347091 662918031 665109038
3752.8F65109038o76632j320362K05517O16372m73201m77791J10805P32362R98437
$$ 665109038 664432406 663112044 663317561 663933933 663460732 662982941 663093746 663826108 664824545
3771.1F64824545j63316r43363l04818P43687M78625l00288J252J50501j43528m28080
$$ 664824545 664661229 663717866 663413048 664156735 664635360 664335072 664336324 664486825 664343297 663915217
3791.5F63915217o69301k12907k09213j18494J571059O66261m79281Q33035j60694
$$ 663915217 663245916 663033009 662823796 662705302 664276361 664942622 664463341 665296376 665135682
3809.9F65135682j989127j291453Q53538N34892K72930J707077M8816j223385p21753
$$ 665135682 663146555 661855102 662708640 663243532 663516462 665223539 665272355 664048970 663327217
3828.2F63327217n12838k33829l00587K31565J468062Q17895k10881k85030j089632
$$ 663327217 662814379 662580550 662279963 662511528 663979590 664797485 664586604 664301574 663211942
3846.6F63211942k391041k176880K096533M962266J48475k629995j735330k8491N96523
$$ 663211942 660820901 658644021 660740554 665702820 665851295 663221300 661485970 661457479 662054002
3865F62054002n02526j22071J171291L77476m84228j150787o07907N29289m5121L62337
$$ 662054002 661551476 661429405 662600696 662978172 662493944 661343157 660735250 661264539 661219418 661581755
3885.4F61581755J85370j006544J10329M38690j197577j251220J37031R79304J203835
$$ 661581755 661767125 660760581 660870910 661309600 660112023 658860803 658997834 659977138 661180973
3903.7F61180973N59449p62939j066029p04885o24895j31607N38886K00688m43995
$$ 661180973 661740422 660977483 659911454 659206569 658581674 658450067 658988953 659189641 658745646
3922.1F58745646k13742P391m56452k88844M31359K04443m90784o38724l61263J24454
$$ 658745646 658531904 658539295 658082843 657793999 658225358 658429801 657939017 657300293 656939030 657063484
3942.5F57063484Q2255l01481p5161Q1241j78158k72096k06768j74701j01030k9981
$$ 657063484 657145739 656844258 656769097 656850338 656672180 656400084 656193316 656018615 655917585 655887604
3962.9F55887604j41442k51353j77502o0857o3896j43826k02179j82867r0480o9558
$$ 655887604 655746162 655494809 655317307 655256450 655192554 655048728 654846549 654663682 654573202 654503644
3983.2F54503644j66655k08676j34110j32919k03669j62899j21534
$$ 654503644 654336989 654128313 653994203 653861284 653657615 653494716 653373182
3997.5F53373182
$$ 653373182
##END=$$ End of the data block
