##TITLE=T2PP $$ Begin of the data block
##JCAMP-DX=5.00 $$ ACD/SpecManager v 10.08
##SPECTROMETER/DATA SYSTEM=Alpha
##DATE=02 Mar 2014 10:12:22
##DATA TYPE=INFRARED SPECTRUM
##DATA CLASS=XYDATA
##ORIGIN=
##OWNER=
##NPOINTS=1765
##FIRSTX=399.75695801
##LASTX=3997.56933594
##MAXX=3997.56933594
##MINX=399.75695801
##MAXY=0.79626995
##MINY=0.01556474
##XFACTOR=1.0000000000
##YFACTOR=1.000000000000000e-9
##FIRSTY=0.26493549
##DELTAX=2.03957629
##XUNITS=1/CM
##YUNITS=ARBITRARY UNITS
##XYDATA=(X++(Y..Y))
399.8B64935493J3590456J3195753J3532936J3399124J2939751J3023228J2913406
$$ 264935493 278525949 291721702 305254638 318653762 331593513 344616741 357530147
414C57530147J1277705J1375547J3272226J1868119J0267019J0089010R929031R482891
$$ 357530147 368807852 380183399 393455625 405323744 415590763 425679773 435608804 445091695
430.4D45091695Q518487Q061915Q315385P676869O665409O875396P075608O322622
$$ 445091695 453610182 461672097 469987482 477664351 484329760 491205156 498280764 504603386
446.7E04603386N917191O056965N688906M592835M461229N373419N023479M162073
$$ 504603386 510520577 516577542 522266448 526859283 531320512 536693931 541717410 545879483
463E45879483M311919M448832L450930K786278L875077M249036K978325K759517L725528
$$ 545879483 550191402 554640234 558091164 560877442 564752519 569001555 571979880 574739397 578464925
481.3E78464925L616751K441525K352953L134429K852321J950085K256990K954960
$$ 578464925 582081676 584523201 586876154 590010583 592862904 594812989 597069979 600024939
497.7F00024939K155184J311422K050578K445937J562953J302242K077460J923561
$$ 600024939 602180123 603491545 605542123 607988060 609551013 610853255 612930715 614854276
514F14854276P06911P23243K014458J966596O53624O91772J886427J683474P32720
$$ 614854276 615561187 616284430 618298888 620265484 620919108 621610880 623497307 625180781 625913501
532.3F25913501J083433J774967J098335K18034O43491J056135K90036j73390N72443
$$ 625913501 626996934 628771901 629870236 630088270 630731761 631787896 632077932 631904542 632476985
550.7F32476985Q27373k30372o29783K85983N55575j34409o8783P71463P25328j69813
$$ 632476985 633304358 633073986 632444203 632730186 633285761 633151352 633082569 633854032 634579360 634409547
571.1F34409547j78695N77629M78148k18510N6445Q46565N16474j28269K87533P54535
$$ 634409547 634230852 634808481 635286629 635068119 635124564 635971129 636487603 636359334 636646867 637401402
591.5F37401402J47343l58165J98543K89679q93474j702964j281857r16958j153529
$$ 637401402 637548745 637190580 637389123 637678802 636785328 635082364 633800507 632883549 631730020
609.8F31730020q51333j17183j80304K36511J892388K561569J695455N68628L90529
$$ 631730020 630878687 630761504 630581200 630817711 632710099 635271668 636967123 637535751 637926280
628.2F37926280Q90017Q93056O93977J209021J718819J048207L3915k68638n74469
$$ 637926280 638816297 639709353 640403330 641612351 643331170 644379377 644413292 644144654 643570185
646.5F43570185j153589q80301j60813j371k70068r3759Q89957J142264l419042j3092518
$$ 643570185 642416596 641536295 641375482 641374111 641104043 641010284 641900241 643042505 639623463 626530945
666.9F26530945p740974R090662O589234K92718q89361n95093q34107p38740l29971
$$ 626530945 618789971 627880633 634469867 634762585 633873224 633278131 632444024 631705284 631375313
685.3F31375313o69778j695573k617001l851116o493867r644031r576202p202863r049773
$$ 631375313 630705535 629009962 626392961 622541845 616047978 606403947 596827745 589624882 580575109
703.7E80575109j4767528j8851757j9805789j6165078q008957k146899j310587J756131
$$ 580575109 565807581 546955824 527150035 510984957 502976000 500829101 499518514 501274645
720E01274645J0153294J9023180K5155842K7881682K7095914K3931027J9502758J4516533
$$ 501274645 511427939 530451119 555606961 583488643 610584557 634515584 654018342 668534875
736.3F68534875J0049522O975889M959583L205538J931787J408636R73523L32236j9431
$$ 668534875 678584397 685560286 690519869 693725407 695657194 697065830 698039353 698371589 698352158
754.6F98352158M6432k1279m55618p23838n12660l12150n00500o71088m59373l46184
$$ 698352158 698398590 698377311 697921693 697197855 696685195 696373045 695872545 695201457 694742084 694395900
775F94395900o13451o88017m40478m65035q38757j017153q45969q38458j218975j409352
$$ 694395900 693782449 693094432 692653954 692188919 691350162 690333009 689487040 688648582 687429607 686020255
795.4F86020255j174450j148164j525939j700937j609028j755297k103805k177001
$$ 686020255 684845805 683697641 682171702 680470765 678861737 677106440 675002635 672825634
811.7F72825634k112746k490043l069580l176332l089308l542960m235923m544497
$$ 672825634 670712888 668222845 665153265 661976933 658887625 655344665 651108742 646564245
828.1F46564245m847228n755961o871045p641554q725404j1033416j3774097j6982556
$$ 646564245 641717017 635961056 629090011 621448457 612723053 601689637 587915540 570932984
844.4E70932984k0727098j9237041j2920857j2668192j8633842k2015661k2405237
$$ 570932984 550205886 530968845 518047988 505379796 486745954 464730293 442325056
858.7D42325056k4979383l2644034m5912265o2768281p2616860o1172843l3219010
$$ 442325056 417345673 384701639 338789374 276021093 203404233 142231390 109012380
872.9A09012380q032895R860023K8449648M9216047O7157119P9587132Q4399819P6964528
$$ 109012380 100979485 110839508 139289156 188505203 255662322 335249454 419649273 496613801
889.3D96613801N9064269M0567338K7615249J9344032J4063001J0888636Q491814O175876
$$ 496613801 555678070 596245408 623860657 643204689 657267690 668156326 676648140 682824016
905.6F82824016M724025M275084L427029J965582J156390R90808L99232m21882n95272
$$ 682824016 687548041 691823125 695250154 697215736 698372126 699362934 699762166 699340284 698745012
923.9F98745012m02033o61373j058579q71598n63860q29459j166105j001358r21786
$$ 698745012 698342979 697681606 696623027 695751429 695187569 694358110 693192005 692190647 691268861
942.3F91268861j349747j668870j551450j638829k175272k478540k340376k432347
$$ 691268861 689919114 688250244 686698794 685059965 682884693 680406153 678065777 675633430
958.6F75633430k918422l146827l047287l246785l768623m022598m113018m640758
$$ 675633430 672715008 669568181 666520894 663274109 659505486 655482888 651369870 646729112
974.9F46729112n430103n861997o066025o485343o835699o653249o217778n983173
$$ 646729112 641299009 635437012 629370987 622885644 616049945 609396696 603178918 597195745
991.2E97195745n703331n167543m767299m782558m927992n023539n385399o058336
$$ 597195745 591492414 586324871 581557572 576775014 571847022 566823483 561438084 555379748
1007.5E55379748o551683o579280o398499o105184n464256m527390l686070l064037
$$ 555379748 548828065 542248785 535850286 529745102 524280846 519753456 516067386 513003349
1023.9E13003349k488196j924932j518726j314580j189351j260281j681209k305567
$$ 513003349 510515153 508590221 507071495 505756915 504567564 503307283 501626074 499320507
1040.2D99320507k830267l108054l171027k920628k206415j186162j77085O78778J221120
$$ 499320507 496490240 493382186 490211159 487290531 485084116 483897954 483720869 484399647 485620767
1058.5D85620767J261711P82579K772r38386k071947l312796m407615n181580n798936
$$ 485620767 486882478 487665057 487667829 486729443 484657496 481344700 476937085 471755505 465956569
1076.9D65956569o709993o911546l873676Q23676L285021M239321N360633N800217
$$ 465956569 459246576 452335030 448461354 449285030 452570051 456809372 462170005 467970222
1093.2D67970222M912913L162712J344591J07795l33368k40505N156K38210M01020
$$ 467970222 472883135 476045847 477390438 477498233 477164865 476924360 476929516 477167726 477568746
1111.6D77568746L40521m9233o35326j142174j475990j721531j919330k070307k193511
$$ 477568746 477909267 477860034 477224708 476082534 474606544 472885013 470965683 468895376 466701865
1129.9D66701865k339184k506912k667248k845883k950281k739013k232939j735955
$$ 466701865 464362681 461855769 459188521 456342638 453392357 450653344 448420405 446684450
1146.2D46684450j367539j069725r17792r79990j079559r28402m79758L2932M79549
$$ 446684450 445316911 444247186 443329394 442349404 441269845 440341443 439861685 439894617 440374166
1164.6D40374166Q05020Q29846N86658M44890O04271Q31873Q55595O69688K92599l58671
$$ 440374166 441179186 442009032 442595690 443040580 443644851 444476724 445332319 446002007 446294606 445935935
1185D45935935j132637j718194k100020k469689k805799k917290k851307k830267k879113
$$ 445935935 444803298 443085104 440985084 438515395 435709596 432792306 429940999 427110732 424231619
1203.3D24231619k848089k809823k973705l278077l537536l757596l990054m135936
$$ 424231619 421383530 418573707 415600002 412321925 408784389 405026793 401036739 396900803
1219.7C96900803m181862m242271m343569m376889m311174m247755m252404m274040
$$ 396900803 392718941 388476670 384133101 379756212 375445038 371197283 366944879 362670839
1236C62670839m250795m272401m354298m345894m237324m226923m327119m390448m395336
$$ 362670839 358420044 354147643 349793345 345447451 341210127 336983204 332656085 328265637 323870301
1254.3C23870301m418611m475504m473776m430056m455089m517645m508197m518092
$$ 323870301 319451690 314976186 310502410 306072354 301617265 297099620 292591423 288073331
1270.6B88073331m562884m577846m590153m617900m675537m741282m799127m864574
$$ 288073331 283510447 278932601 274342448 269724548 265049011 260307729 255508602 250644028
1287B50644028m971400n024776n024775n057276n114585n133957n120128n124882n111918
$$ 250644028 245672628 240647852 235623077 230565801 225451216 220317259 215197131 210072249 204960331
1305.3B04960331n076810m997597m945993m920900m846424m814058m823655m755154
$$ 204960331 199883521 194885924 189939931 185019031 180172607 175358549 170534894 165779740
1321.6A65779740m723430m804447m855231m809975m650653m453838m448145m761994
$$ 165779740 161056310 156251863 151396632 146586657 141936004 137482166 133034021 128272027
1338A28272027m902825m557781m295252m329972m371725m318901m222750m149273m066773
$$ 128272027 123369202 118811421 114516169 110186197 105814472 101495571 97272821 93123548 89056775
1356.3H9056775l912203l907397m023277l805659l454835l397062l341027l303561
$$ 89056775 85144572 81237175 77213898 73408239 69953404 66556342 63215315 59911754
1372.6E9911754l312603l056954k854847k814993k699304k586037k613884k486817
$$ 59911754 56599151 53542197 50687350 47872357 45173053 42587016 39973132 37486315
1388.9C7486315k211236k242535k359137k170401k003766j836187j618083j513792
$$ 37486315 35275079 33032544 30673407 28503006 26499240 24663053 23044970 21531178
1405.3B1531178j312003j099981r44747p88467o59695n94167m32219j35158K9126J11996
$$ 21531178 20219175 19119194 18174447 17385980 16726285 16132118 15699899 15564741 15593867 15705863
1425.7A5705863J62756K18190K76102K69093K68750L86240L60675K31856J53370R6105
$$ 15705863 15868619 16086809 16362911 16632004 16900754 17286994 17647669 17879525 18032895 18129000
1446A8129000Q7969J17425J04184l200o4532J29219L33867K79367K43406L10235K94328
$$ 18129000 18216969 18334394 18438578 18435378 18370846 18500065 18833932 19113299 19356705 19666940 19961268
1468.5A9961268K22232L51781O75755Q02794Q51680R32723J044338J071780J097822
$$ 19961268 20183500 20535281 21211036 22013830 22865510 23798233 24842571 25914351 27012173
1486.8B7012173J292480J595939J636360J633078J983262K259977K226379J928322
$$ 27012173 28304653 29900592 31536952 33170030 35153292 37413269 39639648 41567970
1503.2D1567970J938388K943605L394872L046974K898943K924737L089275L185034
$$ 41567970 43506358 46449963 49844835 52891809 55790752 58715489 61804764 64989798
1519.5F4989798L641717L970981L795586L977873L837116L689728M177146L969356
$$ 64989798 68631515 72602496 76398082 80375955 84213071 87902799 92079945 96049301
1535.8I6049301L283054M103370N404830N339205N168461M919774N029843N180642
$$ 96049301 99332355 103435725 108840555 114179760 119348221 124267995 129297838 134478480
1552.1A34478480N145087M806057O098822Q970722P469729O139621N999655N995735
$$ 134478480 139623567 144429624 150528446 159499168 166968897 173108518 179108173 185103908
1568.4A85103908O503403N825565M913941N640015N841851N027562M628018M433587
$$ 185103908 191607311 197432876 202346817 207986832 213828683 218856245 223484263 227917850
1584.7B27917850M217058L962636L712878L470793L304676L159493K971306K800852
$$ 227917850 232134908 236097544 239810422 243281215 246585891 249745384 252716690 255517542
1601.1B55517542K713055K501279K238601K195627K160668J673043J135766J692266
$$ 255517542 258230597 260731876 262970477 265166104 267326772 268999815 270135581 271827847
1617.4B71827847K304047J834244J652777K030074K145380K218694J945138J265794
$$ 271827847 274131894 275966138 277618915 279648989 281794369 284013063 285958201 287223995
1633.7B87223995J698106L289432L630846L175199K511859K425075L646821L502756
$$ 287223995 288922101 292211533 295842379 299017578 301529437 303954512 307601333 311104089
1650C11104089K731890M850775O022781M806190L911525L941447M597425M149944L468186
$$ 311104089 313835979 318686754 324709535 329515725 333427250 337368697 341966122 346116066 349584252
1668.4C49584252M168301M592509M493922M915922M614443L561169K914786M512489
$$ 349584252 353752553 358345062 362838984 367754906 372369349 375930518 378845304 383357793
1684.7C83357793O013543N302608M835963L952801L212243L537715L979325N375564
$$ 383357793 389371336 394673944 399509907 403462708 406674951 410212666 414191991 419567555
1701D19567555N680293M821509M936785M751682L940046L017574K329469L162652M988939
$$ 419567555 425247848 430069357 435006142 439757824 443697870 446715444 449044913 452207565 457196504
1719.3D57196504M893601L905773L437966L030777K541393J910240K208113L963709
$$ 457196504 462090105 465995878 469433844 472464621 475006014 476916254 479124367 483088076
1735.7D83088076L875762L056258L153354L196836K769440K300441K654732L806889
$$ 483088076 486963838 490020096 493173450 496370286 499139726 501440167 504094899 507901788
1752E07901788L752768K878845K637803K547264K725125K996504K366721J580775J096368
$$ 507901788 511654556 514533401 517171204 519718468 522443593 525440097 527806818 529387593 530483961
1770.3E30483961J316011K040863J353145l16382j423239j790703k318263k837956
$$ 530483961 531799972 533840835 535193980 534877598 533454359 531663656 529345393 526507437
1786.7E26507437l210246l821671l370762j801253j281380j215160j56224J433134
$$ 526507437 523297191 519475520 516104758 514303505 513022125 511806965 511650741 513083875
1803E13083875K398372K907336L578603M661977N641639N929769N909740N840481N382478
$$ 513083875 515482247 518389583 521968186 526630163 532271802 538201571 544111311 549951792 555334270
1821.3E55334270M732847M560828M248560M002809M517138M319370L450930L094673
$$ 555334270 560067117 564627945 568876505 572879314 577396452 581715822 585166752 588261425
1837.6E88261425K814770J946748J669287K812684L355861K898037K501547K276957
$$ 588261425 591076195 593022943 594692230 597504914 600860775 603758812 606260359 608537316
1854F08537316K121806K022326K048016K036631J698792J066029J111388K285719K791107
$$ 608537316 610659122 612681448 614729464 616766095 618464887 619530916 620642304 622928023 625719130
1872.3F25719130K270162J850784J749277J704156J668275J646042J428544J215995
$$ 625719130 627989292 629840076 631589353 633293509 634961784 636607826 638036370 639252365
1888.6F39252365J564920J838386J618743J612305J700461J591206J430034J324475
$$ 639252365 640817285 642655671 644274414 645886719 647587180 649178386 650608420 651932895
1904.9F51932895J258135J286089J465738J469255J111448Q90195J228034J414717
$$ 651932895 653191030 654477119 655942857 657412112 658523560 659413755 660641789 662056506
1921.3F62056506J461506J670360J504600J228750J223683J258612J179278J086354
$$ 662056506 663518012 665188372 666692972 667921722 669145405 670404017 671583295 672669649
1937.6F72669649Q91626P42197J064181J444698J423776J221120J006067R24110R88365
$$ 672669649 673561275 674303472 675367653 676812351 678236127 679457247 680463314 681387424 682375789
1955.9F82375789R44793Q24869Q42452Q62598P95066R76146J275599J296580J126408
$$ 682375789 683320582 684145451 684987903 685850501 686645567 687621713 688897312 690193892 691320300
1974.3F91320300R71317R75132J042843R88186Q48531Q10743P92324O69420P92325
$$ 691320300 692291617 693266749 694309592 695297778 696146309 696957052 697749376 698418796 699211121
1992.6F99211121J144170J152575Q81613P67767Q53896Q95620P71403P29382Q53240
$$ 699211121 700355291 701507866 702389479 703157246 704011142 704906762 705678165 706407547 707260787
2011G07260787Q48592O27100O00398Q68261R50634P91729P26998Q27789Q35180P03931
$$ 707260787 708109379 708736479 709336877 710205138 711155772 711947501 712674499 713502288 714337468 715041399
2031.4G15041399O74546P66754P43627O13451O57261Q21173Q08716O85930P26640Q13902
$$ 715041399 715715945 716482699 717226326 717839777 718497038 719318211 720126927 720812857 721539497 722353399
2051.8G22353399P17282N84781O69778Q10802O98328N38647O75678Q56459P48098O08683
$$ 722353399 723070681 723655462 724325240 725136042 725834370 726373017 727048695 727905154 728653252 729261935
2072.2G29261935O66916P43270O81222O39617P33078P35878N67794N11229O73652P33554
$$ 729261935 729928851 730672121 731353343 731992960 732726038 733461916 734029710 734540939 735214591 735948145
2092.6G35948145N80490N01156O00815O29663M99666M59313N41330N15282L88443L89457
$$ 735948145 736528635 737029791 737630606 738260269 738759935 739219248 739760578 740275860 740664303 741053760
2113G41053760M93765M82798L77178L92854M88877M38929L29614L79025M76301M04835
$$ 741053760 741547525 742030323 742407501 742800355 743289232 743728161 744057775 744436800 744913101 745317936
2133.4G45317936L10123M02748N12362M18007L16680M12464M89712M04358L69966N12540
$$ 745317936 745628059 746030807 746543169 746961176 747277856 747690320 748180032 748584390 748954356 749466896
2153.8G49466896O16372N66721N57661O75201P09415N93900N66662O74247O72281N47290
$$ 749466896 750083268 750649989 751207650 751882851 752592266 753186166 753752828 754427075 755099356 755646646
2174.2G55646646N71728P02679O75440N54323N93185P09176O62327N62191N86808O28054
$$ 755646646 756218374 756921053 757596493 758150816 758744001 759453177 760115504 760677695 761264503 761892557
2194.6G61892557N40972M70936N44965N98848M88162M00186M99845N59151M48584L92676
$$ 761892557 762433529 762904465 763449430 764048278 764536440 764936626 765436471 765995622 766444206 766836882
2215G66836882M91619N19097M01616L61681M68373M91917L90232L78370M47869M19975
$$ 766836882 767328501 767847598 768249214 768610895 769079268 769571185 769961417 770339787 770787656 771207631
2235.4G71207631L24368L50952M25935L56257K17080K13444K76566K08378Q6605R2209
$$ 771207631 771531999 771882951 772308886 772665143 772882223 773095667 773372233 773580611 773667216 773759425
2255.8G73759425J58429J02103L9517J07885J95742K28464K75731M06564N43653O07729
$$ 773759425 773917854 774019957 774059474 774167359 774363101 774591565 774867296 775273860 775817513 776425242
2276.1G76425242P13170Q87513P12574p4983r45449j329779j469732j691997j843214
$$ 776425242 777138412 778025925 778738499 778663516 777718067 776388288 774918556 773226559 771383345
2294.5G71383345j890480k087415k429247k829313l610492m654467n213499m878580
$$ 771383345 769492865 767405450 764976203 762146890 758536398 753881931 748668432 743789852
2310.8G43789852l940463l717065n413592p719457q107782o265580m536689m623055
$$ 743789852 739849389 736132324 730718732 722999275 714891493 708625913 704089224 699466169
2327.1F99466169n008936l574550j559198j495540k364218k416373j119196L377855
$$ 699466169 694457233 690882683 689323485 687827945 685463727 683047354 681928158 685306013
2343.5F85306013J1310696J2382746J576722j1702657j8244147j6294778j0807812
$$ 685306013 696616709 708999455 710576177 698873520 680629373 664334595 653526783
2357.7F53526783m414320J343608N968571R907662J2998641J4846087J5464603J5141786
$$ 653526783 649112463 650456071 656424642 666332304 679330945 694177032 709641635 724783421
2374G24783421J4498055J3881564J2994885J1187732Q361519N229711K716542J217305
$$ 724783421 739281476 753163040 766157925 777345657 785707176 790936887 793653429 794870734
2390.4G94870734N07117K05636J18434J46985J45614Q8155L9041M5598N3167K6107
$$ 794870734 795377851 795583487 795701921 795848906 795994520 796082675 796121716 796167314 796220481 796246588
2410.8G96246588R716J3649j311m3333o0677n4181o6936j25825j83404k17378k44021
$$ 796246588 796256304 796269953 796268642 796225309 796164632 796110451 796043515 795917690 795734286 795516908 795272887
2433.2G95272887k66135k99633l33428l72052m40419n37336o29782p10488p79330q82209
$$ 795272887 795006752 794707119 794373691 794001639 793561220 793023884 792394102 791683614 790904284 790022075
2453.6G90022075j037001j167238j288295j463294j664996j864135k084673k340674
$$ 790022075 788985074 787817836 786529541 785066247 783401251 781537116 779452443 777111769
2469.9G77111769k609194k864778l151476l467143l729820l929913m106223m252017
$$ 777111769 774502575 771637797 768486321 765019178 761289358 757359445 753253222 749001205
2486.2G49001205m306734m240811m086613l866792l543794l161550k843320k602696
$$ 749001205 744694471 740453660 736367047 732500255 728956461 725794911 722951591 720348895
2502.5G20348895k401889k308845k373874k523423k668321k682805k486765k103746
$$ 720348895 717947006 715638161 713264287 710740864 708072543 705389738 702902973 700799227
2518.9G00799227j564443r39310l44992K23518Q37385J448036J948952K305866K568900
$$ 700799227 699234784 698295474 697950482 698174000 699011385 700459421 702408373 704714239 707283139
2537.2G07283139K740324K809286K863288L001511L184497L284037L233910L043354
$$ 707283139 710023463 712832749 715696037 718697548 721882045 725166082 728399992 731443346
2553.5G31443346K767562K460063K166688J912356J691401J501739J353860J224100
$$ 731443346 734210908 736670971 738837659 740750015 742441416 743943155 745297015 746521115
2569.8G46521115J056373Q67606P36713O71983N95212M97103M39703M38273M13954
$$ 746521115 747577488 748445094 749181807 749853790 750449002 750946105 751385808 751824081 752238035
2588.2G52238035L25978K75493L04818L31223L30031L46064L87609M46797N09739N81920
$$ 752238035 752564013 752839506 753144324 753475547 753805578 754151642 754539251 754986048 755495787 756077707
2608.6G56077707O90520Q01861Q72612R60231J097321J178324J201749J254082J299501
$$ 756077707 756768227 757570088 758442700 759402931 760500252 761678576 762880325 764134407 765433908
2626.9G65433908J304745J315534J340449J356602J345694J302600J284063J259327
$$ 765433908 766738653 768054187 769394636 770751238 772096932 773399532 774683595 775942922
2643.3G75942922J161754J055956R49919Q08298O86229O11007N28991L96133K50339
$$ 775942922 777104676 778160632 779110551 779918849 780605078 781216085 781745076 782141209 782391548
2661.6G82391548J56522J06335N5551j1861n6327p1704j22011j80781j78694j29044
$$ 782391548 782548070 782654405 782709956 782698095 782641768 782570064 782448053 782267272 782088578 781959534
2682G81959534j08660j63137k28405k23339k04146k41160k87414k79546k48670k67685
$$ 781959534 781850874 781687737 781459332 781235993 781031847 780790687 780503273 780223727 779975057 779707372
2702.4G79707372k95579l08812l45409l47197l07917l03269l34144l84092m22060m18246
$$ 779707372 779411793 779102981 778757572 778410375 778102458 777799189 777465045 777080953 776658893 776240647
2722.8G76240647m13060l73781l03984l12447l77059m16220m14609l77775l67283m15743
$$ 776240647 775827587 775453806 775149822 774837375 774460316 774044096 773629487 773251712 772884429 772468686
2743.2G72468686m66406m80294m45605m00364l99888m49359m91202m97639n06819n22315
$$ 772468686 772002280 771521986 771076381 770676017 770276129 769826770 769335568 768837929 768331110 767808795
2763.6G67808795n44488n78404o10709o44565o81579o63280o26505o69062p33495p64668
$$ 767808795 767264307 766685903 766075194 765430629 764749050 764085770 763459265 762790203 762056708 761292040
2784G61292040q08775q89540r18686q76486q81672r52781j005411j011371j042426
$$ 761292040 760483265 759593725 758675039 757798553 756916881 755964100 754958689 753947318 752904892
2802.3G52904892j126409j209318j261115j279593j296878j354932j434267j490891
$$ 752904892 751778483 750569165 749308050 748028457 746731579 745376647 743942380 742451489
2818.7G42451489j532733j588524j632213j690448j832783k010465k141595k248764
$$ 742451489 740918756 739330232 737698019 736007571 734174788 732164323 730022728 727773964
2835G27773964k427756k616585k788365l158569l697097l971338l612102k812147k066612
$$ 727773964 725346208 722729623 719941258 716782689 713085592 709114254 705502152 702690005 700623393
2853.3G00623393j591563j409233j445770j565218j755118j988829k152323k242804
$$ 700623393 699031830 697622597 696176827 694611609 692856491 690867662 688715339 686472535
2869.7F86472535k254486k033353j673639j465261j390040j340866j319289j265764
$$ 686472535 684218049 682184696 680511057 679045796 677655756 676314890 674995601 673729837
2886F73729837j166821j068115r93848r36985q17060o56009o00099o16968o27101p28368
$$ 673729837 672563016 671494901 670501053 669564068 668747008 668090999 667490900 666873932 666246831 665518463
2906.4F65518463j013220j453995j874209k019703j804590j335025p93040l57211n5909
$$ 665518463 664505243 663051248 661177039 659157336 657352746 656017721 655224681 654867470 654811561
2924.7F54811561J50025L50356O35386Q60393R18328R46403R80914R07480P60794O86109
$$ 654811561 654961586 655311942 655947328 656807721 657726049 658672452 659653366 660560846 661321640 662007749
2945.1F62007749O62863N02706K02417M471p8202j72913k36928k27690j85549j57237
$$ 662007749 662670612 663173318 663375735 663380206 663302004 663129091 662892163 662664473 662478924 662321687
2965.5F62321687j35660r5666k8133J50978M81844P92861J025796J249433J320481
$$ 662321687 662186027 662090361 662062228 662213206 662695050 663487911 664513707 665763140 667083621
2983.9F67083621J154840R18627P11024N97179O36637O68764O52432O85275O95467
$$ 667083621 668238461 669157088 669868112 670465291 671101928 671770692 672423124 673108399 673803866
3002.2F73803866P13468P76052P07567N11348M40776N61595O63340N72622L62396J49608
$$ 673803866 674517334 675293386 676000953 676512301 676953077 677514672 678178012 678750634 679113030 679262638
3022.6F79262638j1742j09017k38240l97026m63903m14372l96132n50687p22468p44462
$$ 679262638 679250896 679141879 678903639 678506613 678042710 677628338 677232206 676681519 675959051 675214589
3043F75214589p07686p10786p52330p78138q21531r06944q94249q33690q95381r99331
$$ 675214589 674506903 673796117 673043787 672265649 671444118 670537174 669642925 668809235 667913854 666914523
3063.4F66914523j025379r36508p91431p62403r00328j089752j164913j052201r18924
$$ 666914523 665889144 664952636 664161205 663398802 662498474 661408722 660243809 659191608 658272684
3081.8F58272684q97587r17136r59814r99629r83119r73106j011670j096904j141846
$$ 658272684 657375097 656457961 655498147 654498518 653515399 652542293 651530623 650433719 649291873
3100.1F49291873j071095j035691j138866j208544j143336j174569j353323j399994
$$ 649291873 648220778 647185087 646046221 644837677 643694341 642519772 641166449 639766455
3116.4F39766455j279593j165271j136839j184583j271546j368701j419306j398027
$$ 639766455 638486862 637321591 636184752 635000169 633728623 632359922 630940616 629542589
3132.8F29542589j375854j453101j529396j474559j439393j515806j601100j669228
$$ 629542589 628166735 626713634 625184238 623709679 622270286 620754480 619153380 617484152
3149.1F17484152j704871j649976j588524j625001j689792j728654j774013j815676
$$ 617484152 615779281 614129305 612540781 610915780 609225988 607497334 605723321 603907645
3165.4F03907645j824200j825750j861155j900375j911700j912594j907825j922846
$$ 603907645 602083445 600257695 598396540 596496165 594584465 592671871 590764046 588841200
3181.7E88841200j948416j960278j983523j994968j984834k014339k081931k085090
$$ 588841200 586892784 584932506 582948983 580954015 578969181 576954842 574872911 572787821
3198E72787821k020478j999736k041697k060712k023458k001822k016544k008498k000809
$$ 572787821 570767343 568767607 566725910 564665198 562641740 560639918 558623374 556614876 554614067
3216.4E54614067k028525k020597j965583j966714k025068k051354k062857k064586
$$ 554614067 552585542 550564945 548599362 546632648 544607580 542556226 540493369 538428783
3232.7E38428783j996278j933515j962901j990437j978040j967013j903653j842141
$$ 538428783 536432505 534498990 532536089 530545652 528567612 526600599 524696946 522854805
3249E22854805j865447j919031j923144j875281j865804j888573j869917j815975j780987
$$ 522854805 520989358 519070327 517147183 515271902 513406098 511517525 509647608 507831633 506050646
3267.4E06050646j782655j800836j810193j758664j681447j666934j692295j710832
$$ 506050646 504267991 502467155 500656962 498898298 497216851 495549917 493857622 492146790
3283.7D92146790j719713j735687j757771j733601j699269j727641j754522j765251
$$ 492146790 490427077 488691390 486933619 485200018 483500749 481773108 480018586 478253335
3300D78253335j804829j832098j867383j922548j931369j947254k022684k093375k133310
$$ 478253335 476448506 474616408 472749025 470826477 468895108 466947854 464925170 462831795 460698485
3318.4D60698485k175450k257347k341092k358526k379954k478748k575874k581239
$$ 460698485 458523035 456265688 453924596 451566070 449186116 446707368 444131494 441550255
3334.7D41550255k547592k543181k554089k546072k517522k501189k489746k494603
$$ 441550255 439002663 436459482 433905393 431359321 428841799 426340610 423850864 421356261
3351D21356261k536148k553642k483666k407253k446204k524406k486437k361208k274454
$$ 421356261 418820113 416266471 413782805 411375552 408929348 406404942 403918505 401557297 399282843
3369.3C99282843k249688k190262k056092j944810j881153j826733j750112j638472
$$ 399282843 397033155 394842893 392786801 390841991 388960838 387134105 385383993 383745521
3385.7C83745521j498878j350045j279861j299619j284004j127094r38803r39101j035451
$$ 383745521 382246643 380896598 379616737 378317118 377033114 375906020 374967217 374028116 372992665
3404C72992665r58264p78765o94424o52790n43445m50522m49657m17203k51085l6031
$$ 372992665 372034401 371255636 370561212 369908422 369364977 368914455 368464798 368047595 367796510 367760479
3424.4C67760479Q9139J56075K42740M13239N82814O06746N95599O72311P62671Q49098
$$ 367760479 367849618 368005693 368248433 368661672 369244486 369851232 370446831 371119142 371881813 372730911
3444.8C72730911J061886J289934J363397J386076J478553J585901J624524J614303
$$ 372730911 373792797 375082731 376446128 377832204 379310757 380896658 382521182 384135485
3461.1C84135485J705199J881480J970321J970083J918644J912951K007037K144844
$$ 384135485 385840684 387722164 389692485 391662568 393581212 395494163 397501200 399646044
3477.4C99646044K169937K134770K204001K287090K361804K446234K466261K425999
$$ 399646044 401815981 403950751 406154752 408441842 410803646 413249880 415716141 418142140
3493.8D18142140K437234K477527K488374K523691K661824K748936K705396K769529
$$ 418142140 420579374 423056901 425545275 428068966 430730790 433479726 436185122 438954651
3510.1D38954651K949924K977013K868712K858699K846151K820522K911001L071904
$$ 438954651 441904575 444881588 447750300 450608999 453455150 456275672 459186673 462258577
3526.4D62258577L267408L443032L436685L347456L413350L547162L552466L369928
$$ 462258577 465525985 468969017 472405702 475753158 479166508 482713670 486266136 489636064
3542.7D89636064L291606L584385L897071L884197L929555M095733M065871L990770
$$ 489636064 492927670 496512055 500409126 504293323 508222878 512318611 516384482 520375252
3559E20375252L897786L512680L191293M098415N500555N533874M908741M667103M665613
$$ 520375252 524273038 527785718 530977011 535075426 540575981 546109855 551018596 555685699 560351312
3577.4E60351312M698992M697263M255235L717780M377544N588413N321145M661262
$$ 560351312 565050304 569747567 574002802 577720582 582098126 587686539 593007684 597668946
3593.7E97668946M890799N290926N407691N595326N394399M751563M918874N583405
$$ 597668946 602559745 607850671 613258362 618853688 624248087 628999650 633918524 639501929
3610F39501929N436182M897237M195511L843606M718006N195021M159451K662897L011227
$$ 639501929 644938111 649835348 654030859 657874465 662592471 667787492 671946943 674609840 677621067
3628.4F77621067N698382O288767N402208M956424M510641L999770L342986K101540
$$ 677621067 683319449 689608216 695010424 699966848 704477489 708477259 711820245 713921785
3644.7G13921785P64966J455427M413545N103588L522098L005624L351569K924561
$$ 713921785 714686751 716142178 720555723 725659311 729181409 732187033 735538602 738463163
3661G38463163K200067J366318J24812l38733P78257O78778L49879K363801L228367
$$ 738463163 740663230 742029548 742154360 741815627 742593884 743272662 743622541 745986342 749214709
3679.4G49214709K361357J310229L7194j057804o04689J362264K183259J454234M50968
$$ 749214709 751576066 752886295 752923489 751865685 751260996 752623260 754806519 756260753 756711721
3697.7G56711721j94668K5212R20117Q37922j70707l38555J439631K807141J480400
$$ 756711721 756517053 756542265 757462382 758300304 758129597 757791042 759230673 762037814 763518214
3716.1G63518214o75678j837134j731217j012266j03474N75900J36078r59218p15434
$$ 763518214 762842536 761005402 759274185 758261919 758158445 758734345 758870423 757911205 757195771
3734.4G57195771J632631L077983J722217m79221o11961Q46147L28184Q0585J801848
$$ 757195771 758828402 761906385 763628602 763149381 762537420 763383567 763711751 763792336 765594184
3752.8G65594184K072990P77722K22444P77006O81639r7990m11212j37568P29501J115621
$$ 765594184 767667174 768444896 768667340 769444346 770125985 770027995 769616783 769479215 770208716 771324337
3773.2G71324337L21745n45084m52101K28464K78592J49906L95537M21583k742p89463
$$ 771324337 771646082 771100998 770648897 770877361 771155953 771305859 771701396 772122979 772120237 771330774
3793.6G71330774j274109j070440j125932n96046P00295O23941P07090J223922L20256
$$ 771330774 770056665 768986225 767860293 767264247 767964542 768588483 769295573 770519495 770839751
3811.9G70839751j255751j619458r49860q10504M12941J597405R53257K30074l45290
$$ 770839751 769584000 767964542 767014682 766204178 766617119 768214524 769167781 769397855 769052565
3830.3G69052565q24392r85920j205504o81102O35326J300930J356602P88629o69121
$$ 769052565 768228173 767242253 766036749 765355647 765990973 767291903 768648505 769437134 768768013
3848.6G68768013k570570l000319M41909K678454J446485k35676j002729m36783j29521
$$ 768768013 766197443 763197124 763639033 766317487 767763972 767528296 766525567 766088784 765959263
3867G65959263o03855q6486P71105R40740L82185p26402p15017j73211n8353L93808
$$ 765959263 765355408 765268922 766040027 766980767 767362952 766636550 765921533 765748322 765689969 766083777
3887.4G66083777R3818k67864M50254L19481r86815j706004j120329K37227J555085
$$ 766083777 766177595 765909731 766359985 766679466 765692651 763986647 762866318 763103545 764658630
3905.7G64658630J722217Q65042l3737o97255r97543n41687J36435J41084q3387N2035
$$ 764658630 766380847 767245889 767212152 766514897 765517354 764975667 765112102 765253186 765169799 765221834
3926.1G65221834j6630l76641j81616L82305L97920n5969n00857n15223j27614m8935
$$ 765221834 765205204 764828563 764646947 765029252 765427172 765371203 764870346 764355123 764227509 764178574
3946.5G64178574j32739J04248K70069J47581r179j01090j48058r1374R54p689n7340
$$ 764178574 764045835 764150083 764420152 764567733 764558554 764457464 764309406 764218032 764218986 764211297 764153957
3969G64153957j17719j84536j22845L4213N4300k0623P689L4272p6294j56581j09851
$$ 764153957 764036238 763851702 763728857 763763070 763817370 763796747 763804436 763838708 763762414 763605833 763495982
3991.4G63495982n5671k4855l517
$$ 763495982 763440311 763415456 763411939
3997.5G63411939
$$ 763411939
##END=$$ End of the data block
