##TITLE=T2PF $$ Begin of the data block
##JCAMP-DX=5.00 $$ ACD/SpecManager v 10.08
##SPECTROMETER/DATA SYSTEM=Alpha
##DATE=02 Mar 2014 10:12:22
##DATA TYPE=INFRARED SPECTRUM
##DATA CLASS=XYDATA
##ORIGIN=
##OWNER=
##NPOINTS=1765
##FIRSTX=399.75695801
##LASTX=3997.56933594
##MAXX=3997.56933594
##MINX=399.75695801
##MAXY=0.80334485
##MINY=0.09979610
##XFACTOR=1.0000000000
##YFACTOR=1.000000000000000e-9
##FIRSTY=0.45727801
##DELTAX=2.03957629
##XUNITS=1/CM
##YUNITS=ARBITRARY UNITS
##XYDATA=(X++(Y..Y))
399.8D57278013R599418R649992R931653R397269Q222580P321596P154584O861031
416.1E25416136O897330P015288N768835N476714O175518N665958M250526L292382
432.4E69958687L617465M590392M540623L324389K469123K701640L510236L940106
448.7E98652661L151655J781941J295089K290070L530205K966940J286983O80328J836419
467.1F17472291L031313K681256J200974J80661R46939K589226K844870J308441m9233
485.4F32206738L93033J908660K685010J693190J15752q3983J173854K426028J946509
503.8F44464791m2677r66191L32892J843571J519740k73585j490176n62549J340151
522.1F46165967J920998O27577q61048m85063J379550K512872J583218l77953j093089
$$ plain form
399.8 457278013 466877431 476527423 486459076 495856345 504078925 511400521 518555105 525416136
416.1 525416136 532313466 539328754 545097589 550574303 556749821 562415779 566666305 569958687
432.4 569958687 573576152 578166544 582707167 586031556 588500679 591202319 594712555 598652661
448.7 598652661 601804316 603586257 604881346 607171416 610701621 613668561 614955544 615635872 617472291
467.1 617472291 620503604 623184860 624385834 624566495 625513434 628102660 630947530 632255971 632206738
485.4 632206738 632599771 634508431 637193441 638886631 639002383 638918400 640092254 642518282 644464791
503.8 644464791 644422114 643455923 643788815 645632386 647152126 646878541 645388365 644825816 646165967
522.1 646165967 648086965 648714542 647853494 647368431 648747981 651260853 652844071 652466118 651373029
540.5F51373029J67548J546741J125514o43968j639962p40290Q29637J010358m55081
558.8F52573526j620650r41694P84516J435936K97904j184523j404822j58251J177132
577.2F50959074R99272l94761j059056O1036J632690J677215J49191j119852p24555
595.6F52180254O42777J127005J967j453043j567482k86639R56356R33528j56581p82907
616F51595235M16875K362251K663910J254023r180K61486J666963K579153J968383
634.3F64759099O74487L72052J417219K349735J746535L8266r57787j77264J140416
652.7F71362758J252114k4497j160860p32422N76973O6280l202378k897740K132237
671F67372465K841711K217829J545787N8830q94487k36750R90034J042306m24921k176166
$$ plain form
540.5 651373029 651540577 653087318 654212832 653568864 651928902 651188612 652018249 653028607 652573526
558.8 652573526 650952876 650011182 650795698 652231634 652529538 651345015 649940193 649781942 650959074
577.2 650959074 651958346 651563585 650504529 650565565 652198255 653875470 654024661 652904809 652180254
595.6 652180254 652823031 653950036 653952003 652498960 650931478 650644839 651601195 652534723 652378142 651595235
616 651595235 652012110 654374361 657038271 658292294 658283114 658544600 660211563 662790716 664759099
634.3 664759099 665433586 665805638 667222857 669572592 671319127 671357393 670399606 670222342 671362758
652.7 671362758 672614872 672590375 671429515 670697093 671274066 671340346 668137968 665240228 667372465
671 667372465 670214176 672432005 673977792 674036622 673142135 672905385 673895419 674937725 674512804 672336638
691.4F72336638k886772k766371l236055m561365o062210p586360q690655r129345
707.7F27417505r375751r069503p327199m387736p92086L903270Q972406J2759745
724F22100651J5186489J6516864J6107083J3462841R402096N923450M404605M291713
740.4G07395792L827691K184689N06878K10345J108944J787365J219332j24931p98583
758.7G17317522r7216J028538J102805L6001q76486n39124P37488J494408R00924k27391
779.1G20877469n23687L54886J334012J113832j49787j069009o79970M97043R89914
797.5G22744703J07110j173258j325607k44737O01530O9559j286447j991988j266300
815.8G16234565k3902P1705j163900k328515k230287j233399q67069k043843l799557
$$ plain form
691.4 672336638 669449866 666683495 663447440 658886075 652823865 645237505 636546850 627417505
707.7 627417505 618041754 608972251 601645052 597257316 596465230 600368500 609340906 622100651
724 622100651 637287140 653804004 669911087 683373928 692776024 698699474 703104079 707395792
740.4 707395792 711223483 713408172 713915050 714125395 715234339 717021704 718241036 718116105 717317522
758.7 717317522 717220306 718248844 719351649 719387650 718511164 717972040 718709528 720203936 721104860 720877469
779.1 720877469 720353782 720708668 722042680 723156512 723006725 721937716 721257746 721754789 722744703
797.5 722744703 722851813 721678555 720352948 720108211 720709741 720779300 719492853 717500865 716234565
815.8 716234565 716210663 716282368 715118468 712789953 710559666 709326267 708459198 706415355 702615798
834.2G02615798m525543m051089l893793n605995r403348j2425006r493112l215909
850.5F50002003k963007q646309j2998104j4652074j6964256k2880078l4793854n3934901
866.8D82169420p1790874o9166512m3378025j4100492J0325193L5526663N8147282
881.1C87732655O9981009P0775628O3038468M8060775L1402767J9805669J3879896
895.4G04676867J0057032O352841L502727K631247L205597L428936K298594N88954
911.7G36742795j37091M95374J125038L42667j416326k421021j767576m44651j36375
930G32382834j094580j958012j519561j91748N15759k03133j506209j958907j287222
948.4G23179221n99623j030862k469778l585756l428876k628863k499223l477335m662633
$$ plain form
834.2 702615798 698090255 694039166 690145373 684539378 675136030 662711024 653217912 650002003
850.5 650002003 647038996 638392687 625394583 610742509 593778253 570898175 536104321 482169420
866.8 482169420 410378546 341212034 297834009 283733517 294058710 329585373 387732655
881.1 387732655 457713664 528489292 591527760 639588535 670991302 690796971 704676867
895.4 704676867 714733899 721086740 724589467 727220714 730426311 733855247 736153841 736742795
911.7 736742795 736605704 737101078 738226116 738568783 737152457 734731436 732963860 732519209 732382834
930 732382834 731288254 729330242 727810681 727618933 728134692 727931559 726425350 724466443 723179221
948.4 723179221 722579598 721548736 719078958 715493202 712064326 709435463 706936240 703458905 698796272
966.8F98796272m922509m232645l710091m264832n567252o461501o274104n579591
983.1F57783747n393267n923808o386339n958140m760802l809750l803849m379630
999.4F17368162m702390m444062m137397m511774n535006o318033o130874n116940
1015.7E76471686m095018l714561l725052l296852k152205r58383m39286n93245p55906
1034.1E56741178m18901J30415J30891p46548j941442k466977k000213j215398p99954
1052.4E47413051p28309m29928N00083J681566K180636J586079M36485m67300q92759
1070.8E51279604j269400j968145k707362k859831k027154j78278J685203K537250
1087.1E44491887L035903L963232M739761M450024K992808J239837L41296O23345J313508
$$ plain form
966.8 698796272 693873763 689641118 685931027 681666195 676098943 669637442 663363338 657783747
983.1 657783747 652390480 646466672 640080333 634122193 629361391 625551641 621747792 617368162
999.4 617368162 612665772 608221710 604084313 599572539 594037533 587719500 581588626 576471686
1015.7 576471686 572376668 568662107 564937055 561640203 559487998 558529615 558090329 557497084 556741178
1034.1 556741178 556322277 556452692 556583583 555837035 553895593 551428616 549428403 548213005 547413051
1052.4 547413051 546684742 546254814 546754897 548436463 550617099 552203178 552639663 552172363 551279604
1070.8 551279604 550010204 548042059 545334697 542474866 540447712 540269434 541954637 544491887
1087.1 544491887 547527790 551491022 556230783 560680807 563673615 564913452 565254748 565878093 567191601
1105.4E67191601J481890J057745P15911R93132J593352J645148Q43823j37449m44412
1123.8E74940741R716M82201K41995o27160j358211j434326j169205j212537j722396
1142.2E68150818k152383j866698r96113l37064m32968r88603j166761m98951O08504
1160.5E60319781J401306J645445J752317K174318K832353L216446L037274K579450
1176.8E78958690K347469K436698K346933J535237J51753j040935j519919j558244
1193.1E83657682j830757k573073l278911l280043k638162k051353k016962k407431
1209.5E63580990k700508k572119k273083k334416k843201l328621l320337k915084
1225.8E41293621k640545k837956l245592l301442k888143k448440k434969k770781
$$ plain form
1105.4 567191601 568673491 569731236 570447147 571440279 573033631 574678779 575522602 575385153 574940741
1123.8 574940741 574950457 575432658 575674653 575047493 573689282 572254956 571085751 569873214 568150818
1142.2 568150818 565998435 564131737 563135624 562798560 562365592 561376989 560210228 559711277 560319781
1160.5 560319781 561721087 563366532 565118849 567293167 570125520 573341966 576379240 578958690
1176.8 578958690 581306159 583742857 586089790 587625027 587776780 586735845 585215926 583657682
1193.1 583657682 581826925 579253852 575974941 572694898 570056736 568005383 565988421 563580990
1209.5 563580990 560880482 558308363 556035280 553700864 550857663 547529042 544208705 541293621
1225.8 541293621 538653076 535815120 532569528 529268086 526379943 523931503 521496534 518725753
1242.1E18725753l005088k787470k352059k213955k516747k931714l015011k727360
1258.4D97176349k407133k397508k661824k874792k766370k499849k464145k788753
1274.7D76315975l171831l236801l003984k815724l005743l433913l714263l638447
1291D50295269l500461l665835m093468m463583m538477m434079m421353m686832n005420
1309.4D11485761n136251n016387m814595m837274n092472n235255n166471n123466
1325.7C71063590n220652n504548n739123n742997n695820n941838o227642o140828
1342C24850142o057352o164253o238967o292581o479889o721110o784618o601840o657421
1360.4B66852111p070423p029295o644696o656318o614194o661072o999314o783336
$$ plain form
1242.1 518725753 515720665 512933195 510581136 508367181 505850434 502918720 499903709 497176349
1258.4 497176349 494769216 492371708 489709884 486835092 484068722 481568873 479104728 476315975
1274.7 476315975 473144144 469907343 466903359 464087635 461081892 457647979 453933716 450295269
1291 450295269 446794808 443128973 439035505 434571922 430033445 425599366 421178013 416491181 411485761
1309.4 411485761 406349510 401333123 396518528 391681254 386588782 381353527 376187056 371063590
1325.7 371063590 365842938 360338390 354599267 348856270 343160450 337218612 330990970 324850142
1342 324850142 318792790 312628537 306389570 300096989 293617100 286895990 280111372 273509532 266852111
1360.4 266852111 259781688 252752393 246107697 239451379 232837185 226176113 219176799 212393463
1376.7B12393463o462545o455391o347671o222904o492898o529450o001130o187171
1393A61694303o879553o846577o687939o367922n848050n675644n093872m358448l865868
1411.4A10070430l314235k687268k210550j585319m76957M14163R73344J333133J640923
1429.7A04157664J839451J793430J813911J985736J751989J400426J167141J027480
1446A16937228R76502R26689Q57934P32131P42078J131900J431018J344420J303107
1464.4A26383007J376673J354873J315251J570583J958236K060592K079830K139940
1480.7A40238985K295778K372905K515421K950385L519609L600374L706083M466265
1497A65665805N011157M915967M467636M774899O505728O592959N742281N594507N697772
$$ plain form
1376.7 212393463 205930918 199475527 193127856 186904952 180412054 173882604 167881474 161694303
1393 161694303 154814750 147968173 141280234 134912312 129064262 123388618 118294746 113936298 110070430
1411.4 110070430 106756195 104068927 101858377 100273058 99796101 100210264 101183608 102516741 104157664
1429.7 104157664 105997115 107790545 109604456 111590192 113342181 114742607 115909748 116937228
1446 116937228 117913730 118840419 119698353 120430484 121172562 122304462 123735480 125079900 126383007
1464.4 126383007 127759680 129114553 130429804 132000387 133958623 136019215 138099045 140238985
1480.7 140238985 142534763 144907668 147423089 150373474 153893083 157493457 161199540 165665805
1497 165665805 170676962 175592929 180060565 184835464 191341192 197934151 203676432 209270939 214968711
1515.4B14968711N957812N991549O476610O592378O059006O163776N880773N670369
1531.7B63760984O135732N689323M969507O110817P227391O762863O522596O307631
1548C13486844O511629O717801O733567O377667P461458R489179P587910O419003O301194
1566.4C77086252O011635O004840N290628M590034M867613M592151L893286L588557
1582.7D15924996L434122L188133K817780K389043K062470J963764J899452J686245
1599D35366005J307934J013100Q84295Q06868N90056K77221p0542m96566m43339K08705
1619.4D39443737J22607m26769l48151k1636K48134L93867R6888o3479Q93265J699119
1639.8D42037582J838416J705706J682520K320141K556413K537251L585458L926217
$$ plain form
1515.4 214968711 220926523 226918072 233394682 239987060 246046066 252209842 258090615 263760984
1531.7 263760984 269896716 275586039 280555546 286666363 293893754 300656617 307179213 313486844
1548 313486844 319998473 326716274 333449841 339827508 347288966 356778145 364366055 370785058 377086252
1566.4 377086252 383097887 389102727 394393355 398983389 403851002 408443153 412336439 415924996
1582.7 415924996 419359118 422547251 425365031 427754074 429816544 431780308 433679760 435366005
1599 435366005 436673939 437687039 438571334 439378202 439968258 440245479 440174937 439678371 439235032 439443737
1619.4 439443737 439566344 439139575 438791424 438769788 439017922 439411789 439508677 439445198 440338463 442037582
1639.8 442037582 443875998 445581704 447264224 449584365 452140778 454678029 458263487 462189704
1656.1D62189704L459841L391296L774464M169613L836870L592283M086166M293174
1672.4D92793411M424155M718035M384458L846586L840029N090475N563975M865527
1688.8E29526651M696727M430413M602671N120515N196393N877972N576551M981875
1705.1E70009768N119145M766345M099011L455341L059805L445387M008531L619671
1721.4F01583004L007531K748728K629816K556563K290308K180815K598524K627015
1737.7F22222304K582312K752423K680123K408743K232373K478838L013730K903819
1754F43274665K359867K026558J927555K141535K292514J877963J312077J021743J210630
1772.4F59445107J572788J200855K82883m47571p23183r80199j327276j719713k411902
$$ plain form
1656.1 462189704 465649545 469040841 472815305 476984918 480821788 484414071 488500237 492793411
1672.4 492793411 497217566 501935601 506320059 510166645 514006674 519097149 524661124 529526651
1688.8 529526651 534223378 538653791 543256462 548376977 553573370 559451342 565027893 570009768
1705.1 570009768 575128913 579895258 583994269 587449610 590509415 593954802 597963333 601583004
1721.4 601583004 604590535 607339263 609969079 612525642 614815950 616996765 619595289 622222304
1737.7 622222304 624804616 627557039 630237162 632645905 634878278 637357116 640370846 643274665
1754 643274665 645634532 647661090 649588645 651730180 654022694 655900657 657212734 658234477 659445107
1772.4 659445107 661017895 662218750 662501633 662054062 661330879 660350680 659023404 657303691 654891789
1790.7F54891789k582312j610636q77262p07745l02613O10769J630545K458512L029585
1809.1F56540632L411770L654301L822744M006148L994941L490627K797842K530694
1825.4F84249699K520442K529383K548396K181948J685083J629948J768112J510382
1841.7G00623393J123846J224160J488983J589895J574754J332045J026630R26078
1858G10909784J118839J336455J216292P43032M85301R57131J470566J421452J034498
1876.4G20693350P18951P10666R30131J093089R42111O04034N76138Q65877J059174
1894.7G28193521J054645Q10385N75065O26684Q64386R34839P15733N07593N25356
1913.1G34808207O45458P25150P76291O32644N06818O95586Q63970P73906N45621L90709
$$ plain form
1790.7 654891789 652309477 650698841 649821579 649113834 648811221 649421990 651052535 653511047 656540632
1809.1 656540632 659952402 663606703 667429447 671435595 675430536 678921163 681719005 684249699
1825.4 684249699 686770141 689299524 691847920 694029868 695714951 697344899 699113011 700623393
1841.7 700623393 701747239 702971399 704460382 706050277 707625031 708957076 709983706 710909784
1858 710909784 712028623 713365078 714581370 715324402 715809703 716766834 718237400 719658852 720693350
1876.4 720693350 721412301 722122967 723053098 724146187 725088298 725692332 726268470 727134347 728193521
1894.7 728193521 729248166 730058551 730633616 731260300 732124686 733059525 733775258 734282851 734808207
1913.1 734808207 735453665 736178815 736955106 737587750 738094568 738790154 739654124 740428030 740973651 741364360
1933.5G41364360M43637O35922O81937N06580M13120M94778N94854O78718O10769L73423
1953.9G46798098K33173L10839M94957N71131M43995L01421M06861O20425O56009N38468
1974.3G51375377M10736L71039M23491M97818M96924M12523L05295K77222L97920N15163
1994.7G55483508M68075L52443K84075K96116L89636M38273L67999K63095K26557K74658
2015.1G58844435L84391M39345L29793J99556K11835L22461L88563L52561K52724K08318
2035.5G61933982K82824L75569L70920K63154J75119K26200L87013M71532L68953K07245
2055.9G65062511K04921L62932M62234L73245K01761J53482K84136M44352M19498K37405
2076.3G68206477J37568K48074M55857N16533L57807J52707J30594L00527M36484L56555
$$ plain form
1933.5 741364360 741807997 742443919 743125856 743632436 744045556 744540334 745135188 745813906 746424675 746798098
1953.9 746798098 747031271 747342110 747837067 748408198 748852193 749153614 749560475 750180900 750836909 751375377
1974.3 751375377 751786113 752157152 752580643 753078461 753575385 753987908 754293203 754570425 754968345 755483508
1994.7 755483508 755951583 756304026 756588101 756884217 757273853 757712126 758080125 758343220 758569777 758844435
2015.1 758844435 759228826 759668171 759997964 760197520 760409355 760731816 761120379 761472940 761725664 761933982
2035.5 761933982 762216806 762592375 762963295 763226449 763401568 763627768 764014781 764486313 764855266 765062511
2055.9 765062511 765267432 765630364 766092598 766465843 766667604 766821086 767105222 767549574 767969072 768206477
2076.3 768206477 768344045 768592119 769047976 769564509 769922316 770075023 770205617 770506144 770942628 771299183
2096.7G71299183J62125R4235K31683M14074L92735J58131k7120N5015L06725M29750
2117.1G73516536K71678K7001K563K10940L73543K91884Q7976J4782J56939L31760
2137.5G75285602L23057J50740M4405J63913L69728M13477K67387J28567J69039L68654
2157.9G77684569N00262M14789K37465K09749L59833M80950M62830L33726K30610K86162
2178.2G81200945M34041M90368L83079K23458K22981M00245M85837L79265K36332J91093
2198.6G84647644K49564L29972L33547K55227J98245K15233K86281L19242K53558J57297
2219G87245810J38164K17795L07202K96653K08914J63019K05338K77340K93314K22803
2239.4G89576352J38282J42515J96934K20060K00033J62900J29998J30057J86086K14338
$$ plain form
2096.7 771299183 771461308 771555543 771787226 772201300 772594035 772752166 772725046 772780061 773086786 773516536
2117.1 773516536 773788214 773815215 773817778 774028718 774402261 774694145 774782121 774796903 774953842 775285602
2137.5 775285602 775608659 775759399 775803804 775967717 776337445 776750922 777018309 777146876 777315915 777684569
2157.9 777684569 778184831 778599620 778837085 779046834 779406667 779887617 780350447 780684173 780914783 781200945
2178.2 781200945 781634986 782125354 782508433 782731891 782954872 783355117 783840954 784220219 784456551 784647644
2198.6 784647644 784897208 785227180 785560727 785815954 786014199 786229432 786515713 786834955 787088513 787245810
2219 787245810 787383974 787601769 787908971 788205624 788414538 788577557 788782895 789060235 789353549 789576352
2239.4 789576352 789714634 789857149 790054083 790274143 790474176 790637076 790767074 790897131 791083217 791297555
2259.8G91297555J55866Q0049R3162J98841K92898K83002K26021K29776K91407L56376
2280.2G93504953K93851N7698j76549k64824k43604k22564k61664l52919m49062n18560
2300.6G91366756o12736q48770j153886j304448j209855r64940q98301j317680j908481
2319G81147659j995623j462460r93311j146674j375974r16421k89142l38137o20783
2337.3G72009134n91516j95205J032352L189921L522814N45382l164470m963636m418373
2355.7G66966403k948642j214981M40955J834214K911508L604173L991723M134775
2372G79720128M043698L885329L756165L531635L022850K234876J374006O98805L13520
2390.4H02581012J57416J24276J09553N6446M768K7657P9870R4414O2167M77k9206
$$ plain form
2259.8 791297555 791453421 791533470 791626632 791825473 792118371 792401373 792627394 792857170 793148577 793504953
2280.2 793504953 793798804 793856502 793679953 793415129 793171525 792948961 792687297 792334378 791885316 791366756
2300.6 791366756 790754020 789905250 788751364 787446916 786237061 785272121 784373820 783056140 781147659
2319 781147659 779152036 777689576 776696265 775549591 774173617 773257196 772968054 772629917 772009134
2337.3 772009134 771417618 771222413 772254765 775444686 778967500 779512882 776348412 771384776 766966403
2355.7 766966403 764017761 762802780 763243735 765077949 767989457 771593630 775585353 779720128
2372 779720128 783763826 787649155 791405320 794936955 797959805 800194681 801568687 802267492 802581012
2390.4 802581012 802738428 802862704 802972257 803028703 803033471 803061128 803140998 803235412 803297579 803298056 803268850
2412.8H03268850J3053N5313P630p1526r3758p4685m4822j4186n1916j43885j63198
2435.2H02686870j18375j21712j82689k45332k89202k94685k83957l13342l98576m90188
2455.6G99948812n42760n86689o63936p67887q65638r34482j006066j147926j313448
2474G92119980j459718j617551j771033j909673k019346k098023k175034k190232k083599
2492.3G74795771j945377j837373j744329j675487j588523j455546j394510j458764
2508.7G61695862j524806j517594j415253j236856j059890q66591n85914k34604J21951
2527G53376305M28736O63340Q80957J150072J434683J630128J686215J658321J636266
2545.4G64545023J642466J642048J546026J318633J082063R59635R34303Q77320P38085
$$ plain form
2412.8 803268850 803281903 803337216 803344846 803273320 803179562 803104877 803060055 803045869 802993953 802850068 802686870
2435.2 802686870 802568495 802446783 802264094 802018762 801729560 801434875 801150918 800837576 800439000 799948812
2455.6 799948812 799406052 798819363 798155427 797387540 796521902 795587420 794581354 793433428 792119980
2474 792119980 790660262 789042711 787271678 785362005 783342659 781244636 779069602 776879370 774795771
2492.3 774795771 772850394 771013021 769268692 767593205 766004682 764549136 763154626 761695862
2508.7 761695862 760171056 758653462 757238209 756001353 754941463 754074872 753488958 753254354 753376305
2527 753376305 753805041 754468381 755349338 756499410 757934093 759564221 761250436 762908757 764545023
2545.4 764545023 766187489 767829537 769375563 770694196 771776259 772735894 773670197 774547517 775285602
2563.7G75285602N72860M44770M13954M32730L72827K21312J10566J17600J67013J74820
2584.1G78314054J29402M7266N245N2214J16646J24693P0334L7312R9719J98960K41757
2606.6G79437602K44498K57492K77340L37184M38571N05507N10573M90666M87446N19514
2626.9G83506393N69702N79118N09978M32610M44532N14805N28336M16934K92599K93911
2647.3G88088918L35037K72096J16527j5736m5121p093K981m8459j36256k09928k08020
2669.8G88144946j27792o2347j32382k90513l36349k20060j03176j21593k59102l60488
2690.2G86131144l14713j86324j24574k00987l06427l25680k43664j60634k20299l66867
2710.6G83680975m09126l06725j98961k18451l72708n22851m79579k43485r1553k05517
$$ plain form
2563.7 775285602 775858462 776303232 776717186 777149916 777522743 777744055 777854621 777972221 778139234 778314054
2584.1 778314054 778443456 778490722 778495967 778548181 778664827 778789520 778859854 778897166 778996885 779195845 779437602
2606.6 779437602 779682100 779939592 780216932 780554116 780992687 781498194 782008767 782499433 782986879 783506393
2626.9 783506393 784076095 784655213 785165191 785597801 786042333 786557138 787085474 787502408 787795007 788088918
2647.3 788088918 788423955 788696051 788812578 788796842 788751721 788744628 788747609 788699150 788562894 788352966 788144946
2669.8 788144946 788017154 787954807 787822425 787531912 787195563 786975503 786872327 786750734 786491632 786131144
2690.2 786131144 785816431 785630107 785505533 785304546 784998119 784672439 784428775 784268141 784047842 783680975
2710.6 783680975 783271849 782965124 782766163 782547712 782175004 781652153 781172574 780929089 780837536 780632019
2731G80632019l91424m05371k68161j54257j92940l43561m38333l81470k23994j44720
2751.4G77687788k50638m25875m61459l24309k27511l06606m79698n60105m62830l40581
2771.8G73848176l75211n21124o01887n43654m34757m19259n61893p48753p53939o02544
2792.2G68285155n44786o63996q02040q01325p35819p06136p51913r06944j041413
2810.5G61330783j017213r33587r36747j048088j212835j318216j292289j249909j348138
2828.9G50973761j572490j797020j947284k073407k229750k504647l014743l598035
2845.2G32236385l841340l424406k538085j709819j200199r73642r03368r54568j207591
2863.5G15483367j533091j660287j632988j590550j403630j102507r40562q87334q16107
$$ plain form
2731 780632019 780240595 779835224 779567063 779412806 779219866 778876305 778437972 778056502 777832508 777687788
2751.4 777687788 777437150 777011275 776549816 776225507 775997996 775691390 775211692 774651587 774188757 773848176
2771.8 773848176 773472965 772951841 772349954 771806300 771371543 770952284 770390391 769641638 768887699 768285155
2792.2 768285155 767740369 767076373 766274333 765473008 764737189 764031053 763279140 762372196 761330783
2810.5 761330783 760313570 759379983 758443236 757395148 756182313 754864097 753571808 752321899 750973761
2828.9 750973761 749401271 747604251 745656967 743583560 741353810 738849163 735834420 732236385
2845.2 732236385 728395045 724970639 722432554 720722735 719522536 718548894 717645526 716690958 715483367
2863.5 715483367 713950276 712289989 710657001 709066451 707662821 706560314 705619752 704732418 703916311
2881.9G03916311q03470q91865j021623j083493j014352r33469r12547r06169r21428
2900.2F95427895r26674q97407r75609j310647j831114k264917k345204k048970j576662
2918.6F81250691j101732o66976k20358K11239N47468Q18313J033008J194536J357854
2937F84424043J474380J400650J165330R68218Q88348P71224M87983K11120R3639J11639
2957.4F91996574K61009M77851O19947O69539P52569R24587J071393J112521J093269
2975.7F98979259J019358R96828J138926J236021J082719Q07881O19829O30498P51018
2994.1G07262337P05958N47766M83156M88758N28395N00023K72036N364k265J76072
3014.5G10967600K61248J71244l7432k68519l87788l71575m16041n83767o71447n97834
$$ plain form
2881.9 703916311 703112841 702220976 701199353 700115860 699101508 698168039 697255492 696349323 695427895
2900.2 695427895 694501221 693603814 692628205 691317558 689486444 687221527 684876323 682827353 681250691
2918.6 681250691 680148959 679481983 679261625 679472864 680020332 680838645 681871653 683066189 684424043
2937 684424043 685898423 687299073 688464403 689432621 690320969 691092193 691580176 691791296 691884935 691996574
2957.4 691996574 692257583 692735434 693355381 694024920 694777489 695702076 696773469 697885990 698979259
2975.7 698979259 699998617 700995445 702134371 703370392 704453111 705260992 705880821 706511319 707262337
2994.1 707262337 707968295 708516061 708999217 709487975 710016370 710516393 710788429 710793793 710791528 710967600
3014.5 710967600 711228848 711400092 711362660 711094141 710706353 710334778 709918737 709334970 708663523 708065689
3034.9G08065689n56171o88672q42333q43764p83622p84516p97570q02934q61943r12607
3055.3G00191557q72492q13604q36730r39846j008093r21786p57158o98209p96914
3073.6F92546725r56952j010895r08136p97213p75456q10862q61883q68559q14736
3092F84742033p79390q11398r05752r75251r25362q83162r60470j010716r70661r91106
3112.4F75528765j061917j083672j098096j097560j086652j132727j180589j187861
3128.7F66599691j214504j279474j322806j306712j286805j307010j376391j450121
3145F56055868j438678j400888j438319j513899j551270j550198j535237j514017j552582
3163.4F42560780j639605j646876j591980j608372j676083j719176j756788j746893
$$ plain form
3034.9 708065689 707509518 706820846 705978513 705134749 704351127 703566611 702769041 701966107 701104164 700191557
3055.3 700191557 699319065 698505461 697668731 696728885 695720792 694799006 694041848 693343639 692546725
3073.6 692546725 691589773 690578878 689670742 688873529 688098073 687287211 686425328 685556769 684742033
3092 684742033 683962643 683151245 682245493 681270242 680344880 679461718 678501248 677490532 676519871 675528765
3112.4 675528765 674466848 673383176 672285080 671187520 670100868 668968141 667787552 666599691
3128.7 666599691 665385187 664105713 662782907 661476195 660189390 658882380 657505989 656055868
3145 656055868 654617190 653216302 651777983 650264084 648712814 647162616 645627379 644113362 642560780
3163.4 642560780 640921175 639274299 637682319 636073947 634397864 632678688 630921900 629175007
3179.7F29175007j683652j683593j750707j790584j775384j728594j711070j741231
3196F15310192j768827j796961j791597j732468j707316j728594j734614j733780j725733
3214.3E99590302j681984j686037j759350j769066j717210j710951j718819j702905
3230.7E85843980j678228j654148j667619j687884j685560j682580j657307j613497
3247E72517157j614571j647234j648724j632392j633764j637757j608431j572490j585304
3265.3E57936490j615644j566768j505851j521588j503825j442015j414001j404047
3281.6E45962751j408458j399517j364529j360476j381874j377583j369178j394153
3298E34906983j405179j395643j387238j378239j404225j459003j521647j582205j638532
$$ plain form
3179.7 629175007 627491355 625807762 624057055 622266471 620491087 618762493 617051423 615310192
3196 615310192 613541365 611744404 609952807 608220339 606513023 604784429 603049815 601316035 599590302
3214.3 599590302 597908318 596222281 594462931 592693865 590976655 589265704 587546885 585843980
3230.7 585843980 584165752 582511604 580843985 579156101 577470541 575787961 574130654 572517157
3247 572517157 570902586 569255352 567606628 565974236 564340472 562702715 561094284 559521794 557936490
3265.3 557936490 556320846 554754078 553248227 551726639 550222814 548780799 547366798 545962751
3281.6 545962751 544554293 543154776 541790247 540429771 539047897 537670314 536301136 534906983
3298 534906983 533501804 532106161 530718923 529340684 527936459 526477456 524955809 523373604 521735072
3316.3E21735072j700461j726746j720012j738011j810074j916945j965583j982450
3332.6E07174790k026737k009928j977146k023756k051175k015918j963765j890242
3348.9D91216123j869470j941770j981288j921326j859427j888632j934469j884341
3365.3D75935400j808912j804888j826883j782119j648635j535177j506477j506687
3381.6D62515622j427382j271874j121342r63449r23872j050532j064539q83639p45296
3399.9D53063697q43674r88007q57741o32315n63443n42760m91411m60445l89547k80022
3420.3D47014332k15709j09375P1704K08587K23666K97875M56094M44323L61443M34607
3440.7D49187547N75721O80030P82191Q73149R90063J120120J180738J215518J276970
$$ plain form
3316.3 521735072 520034611 518307865 516587853 514849842 513039768 511122823 509157240 507174790
3332.6 507174790 505148053 503138125 501160979 499137223 497086048 495070130 493106365 491216123
3348.9 491216123 489346653 487404883 485423595 483502269 481642842 479754210 477819741 475935400
3365.3 475935400 474126488 472321600 470494717 468712598 467063963 465528786 464022309 462515622
3381.6 462515622 461088240 459816366 458695024 457731575 456807703 455757171 454692632 453808993 453063697
3399.9 453063697 452220023 451232016 450374275 449741960 449178517 448635757 448144346 447683901 447294354 447014332
3420.3 447014332 446798623 446689248 446760952 446969539 447193205 447491080 447947174 448391497 448752940 449187547
3440.7 449187547 449763268 450443298 451225489 452098638 453088701 454208821 455389559 456605077 457882047
3459.1D57882047J316964J403809J551807J585841J461983J313328J340002J512409
3475.4D69368190J683384J717627J638800J669615J790226J812219J763732J783549
3491.7D83227342J867563J959503J962721J933396J949847J977920K021194K046912
3508D98946398K070517K181947K271414K203166K158642K239704K344489K350450K325833
3526.4E19092560K412557K548337K611041K630115K639115K620578K687573K773166
3542.7E40015042K751469K717436K796709K882719K938927K980947K980888L045499
3559E63109636L099084K965629K841056L211379L745913L746927L524721L486216L568589
3577.4E93299150L649116L678739L578365L467083L653288L994345L937662L798247
$$ plain form
3459.1 457882047 459199011 460602820 462154627 463740468 465202451 466515779 467855781 469368190
3475.4 469368190 471051574 472769201 474408001 476077616 477867842 479680061 481443793 483227342
3491.7 483227342 485094905 487054408 489017129 490950525 492900372 494878292 496899486 498946398
3508 498946398 501016915 503198862 505470276 507673442 509832084 512071788 514416277 516766727 519092560
3526.4 519092560 521505117 524053454 526664495 529294610 531933725 534554303 537241876 540015042
3542.7 540015042 542766511 545483947 548280656 551163375 554102302 557083249 560064137 563109636
3559 563109636 566208720 569174349 572015405 575226784 578972697 582719624 586244345 589730561 593299150
3577.4 593299150 596948266 600627005 604205370 607672453 611325741 615320086 619257748 623055995
3593.7F23055995L894686L998280M029333M062891L974498L788113L877640M087687
3610F54769123M043638L899753L710926L681958L949701L853202L340662K942026L307938
3628.4F87498927M190922M115045L713012L466487L255844L203869L081500K658129
3644.7G15183735K239704K538919L330648L275991K760947K681136K748370K523422
3661G37282872K178192J837552J466095J298130J562178J564980J482069J849175J892030
3679.4G52413273J645505J448095J213551J023471R43184J028240J207828J205385
3695.7G62128532R89616P44819O61493P74026P71284N74946M98355Q18312J106679
3714G69068062P79331K44200o1810j11580R54K50697N24402M40061L9935K8491P22349
$$ plain form
3593.7 623055995 626950681 630948961 634978294 639041185 643015683 646803796 650681436 654769123
3610 654769123 658812761 662712514 666423440 670105398 674055099 677908301 681248963 684190989 687498927
3628.4 687498927 691689849 695804894 699517906 702984393 706240237 709444106 712525606 715183735
3644.7 715183735 717423439 719962358 723293006 726568997 729329944 732011080 734759450 737282872
3661 737282872 739461064 741298616 742764711 744062841 745625019 747189999 748672068 750521243 752413273
3679.4 752413273 754058778 755506873 756720424 757743895 758687079 759715319 760923147 762128532
3695.7 762128532 763118148 763862967 764524460 765298486 766069770 766644716 767143071 767961383 769068062
3714 769068062 769847393 770091593 770029783 769918203 769919157 770169854 770694256 771134317 771174252 771202743 771925092
3736.5G71925092J056194N47171j17958r0539N11944M26888K87235P12931P88510M31180
3756.9G76478648K50638L81112L40581J23620R0062K00689L97444M62830K36750K0742
3777.3G78983116J1385J25289J47163J21713J99735K66075J43290j62542l49641k36332
3797.7G79249251j62959n0724K32399J69694K11418M35948K11537k19464k85208p0095
3818G79721797j61469K4378M30167L07023O0558q3387j32143r5546j73390j32620K41220
3840.5G80006588M37140L37958J40608j90080o67929q67009j908P13527M74811M9174
3860.9G80432880k15352j23739m2796k19882m4703K98083L37302J43469k25306k16841
3881.3G80123115N9843P0870R0301k0624j70528M5955J11103k44558n18382l77655
$$ plain form
3736.5 771925092 772981286 773528457 773410499 773319960 773831904 774258792 774546027 775258958 776047468 776478648
3756.9 776478648 776729286 777110398 777450979 777574599 777664661 777865350 778262794 778725624 778962374 778983116
3777.3 778983116 778994501 779119790 779266953 779388666 779588401 779854476 779997766 779835224 779485583 779249251
3797.7 779249251 779086292 779035568 779267967 779437661 779649079 780085027 780296564 780077100 779791892 779721797
3818 779721797 779560328 779584706 780014873 780321896 780382454 780299067 780166924 780071378 779897988 779765368 780006588
3840.5 780006588 780443728 780781686 780922294 780732214 780064285 779197276 779195368 779908895 780383706 780432880
3860.9 780432880 780217528 780093789 780050993 779831111 779786408 780084491 780421793 780565262 780339956 780123115
3881.3 780123115 780182958 780253828 780344129 780323505 780152977 780198932 780310035 780065477 779547095 779169440
3901.7G79169440Q4877N54860N64873K09868o8664k24650k84374j25587K7418l0577
3922.1G79877484n0962M8816L7074p5579n9664O8724P8500o3002j99616j47403K0504
3944.5G79534876K1339l2425N0723R4772j550r1791p4863k3902M411K7835J5080j3888
3969G79510617J2994L4332l1054o4790J5736O4194K1994k3127l0756n483L6716O6817
3993.4G79608190M5061J4067
3997.5G79667318
$$ plain form
3901.7 779169440 779254317 779809177 780374050 780583918 780515254 780290604 780006230 779880643 779908061 779877484
3922.1 779877484 779826522 779875338 779912412 779836833 779777169 779845893 779924393 779861391 779661775 779514372 779534876
3944.5 779534876 779556215 779523790 779574513 779669285 779667735 779575944 779501081 779477179 779481590 779509425 779524505 779510617
3969 779510617 779523611 779557943 779526889 779462099 779477835 779542029 779564023 779540896 779510140 779504657 779541373 779608190
3993.4 779608190 779653251 779667318
3997.5 779667318
##END=$$ End of the data block
