##TITLE=T1PT $$ Begin of the data block
##JCAMP-DX=5.00 $$ ACD/SpecManager v 10.08
##SPECTROMETER/DATA SYSTEM=Alpha
##DATE=02 Mar 2014 10:12:22
##DATA TYPE=INFRARED SPECTRUM
##DATA CLASS=XYDATA
##ORIGIN=
##OWNER=
##NPOINTS=1765
##FIRSTX=399.75695801
##LASTX=3997.56933594
##MAXX=3997.56933594
##MINX=399.75695801
##MAXY=0.73471922
##MINY=0.33893541
##XFACTOR=1.0000000000
##YFACTOR=1.000000000000000e-9
##FIRSTY=0.61127400
##DELTAX=2.03957629
##XUNITS=1/CM
##YUNITS=ARBITRARY UNITS
##XYDATA=(X++(Y..Y))
399.8F11274004L396630M659951M639149K629339J438678K893686M451036L031850
$$ 611274004 614670634 619330585 623969734 626599073 628037751 630931437 635382473 638414323
416.1F38414323M51446J047969L428280K759755J82867k21312J827538K369940K50042
$$ 638414323 638865769 639913738 643342018 646101773 646284640 646063328 647890866 650260806 650510848
434.4F50510848p11799J368225K778232J103222r05693J24038K398789J925170n50687
$$ 650510848 649799049 651167274 653945506 655048728 654143035 654267073 656665862 658591032 658040345
452.8F58040345q08001J478136K112567p1823j071513N59032K000987Q33750j053214
$$ 658040345 657232344 658710480 660823047 660751224 659679711 660238743 662239730 663073480 662020266
471.1F62020266k63929K031564J715005n54204p74443J373291K170145K74003j036823
$$ 662020266 661756337 663787901 665502906 664948702 664174259 665547550 667717695 667991698 666954875
489.5F66954875M81665K222121J157880q36253m23193J568198J575589m33683j110256
$$ 666954875 667436540 669658661 670816541 669980288 669557095 671125293 672700882 672267199 671156943
507.9F71156943M08768J361788L1292j362145m82618J120805P73788o88195o52552
$$ 671156943 671565711 672927499 672958791 671596646 671114028 672234833 673008621 672320426 671667874
526.2F71667874P86662J049578k55167q14975L72649J268386M06266p05064l82721
$$ 671667874 672454536 673504114 673248947 672433972 672806621 674075007 674481273 673776209 673393488
544.6F73393488N38647L12388p21276q44836m4346J34111n74351p38263J65880P93099
$$ 673393488 673932135 674244523 673523247 672678411 672634065 672768176 672193825 671455562 671621442 672414541
565F72414541K09451o16491m44353K07842P6711n01931l38971M17411O52075J34051
$$ 672414541 672623992 672007501 671563148 671770990 671847701 671345770 671006799 671424210 672076285 672210336
585.4F72210336k5094N48721P83801K32994j39773K57373M60327l08871j033426p74562
$$ 672210336 672185242 672733963 673517764 673750758 673610985 673868358 674328685 674019814 672986388 672211826
605.8F72211826k62141l63648p40052m89711L81052Q21054M43637K93375J026392J568734
$$ 672211826 671949685 671586037 670845985 670356274 670737326 671558380 672002017 672295392 673321784 674890518
626.1F74890518R27270J36613O92070J833081J650036M64677K13862J158118J496673
$$ 674890518 675817788 675954401 676646471 678479552 680129588 680594265 680808127 681966245 683462918
644.5F83462918L25203n88537K20359J186430N02646r62436j045227K75791P28905
$$ 683462918 683788121 683199584 683419943 684606373 685109019 684146583 683101356 683377147 684106052
662.9F84106052l02732j380265l41713J486063P65800m86374J3590J517356J454830
$$ 684106052 683803320 682423055 682081342 683567405 684333205 683846831 683860421 685377777 686832607
681.2F86832607k34604r36270K96772J015603m80652k326965k412736j700461j607657
$$ 686832607 686598003 685661733 685958505 686974108 686493456 684166491 681753755 680053294 678445637
699.6F78445637k060294k628863k863705l734112o087839o580770k332807K488613
$$ 678445637 676385343 673756480 670892775 667158663 661070824 654490054 652157247 654645860
715.9F54645860L348351K679050M290402P508397Q985400P357120N052031M537582
$$ 654645860 657994211 660673261 664963663 672472060 681457460 688814580 693866611 698404193
732.2F98404193M523098K666653J53303q0169J637936K173245N00798o68466N82397
$$ 698404193 702927291 705593944 705747247 705667078 707305014 709478259 709979057 709310591 709892988
750.6G09892988J971781Q78513j166403j036406P43032Q94666j000583j793683n8591
$$ 709892988 711864769 712743282 711576879 710540473 711283505 712178171 711177588 709383905 709325314
768.9G09325314J629650R25720n48542l397J815557J855672p7188r14097N64217J758218
$$ 709325314 710954964 711880684 711332142 711328745 713144302 714999974 714922786 714008689 714572906 716331124
789.3G16331124O47724q59737j94073J571953J519680k98917r88543L69549J234829
$$ 716331124 716978848 716119111 715925038 717496991 719016671 718717754 717729211 718098760 719333589
807.7G19333589j15275j624286r50814O53506N04314j116573j464248Q523P25091o95407
$$ 719333589 719218314 717594028 716643214 717296720 717801034 716684461 715220213 715228736 715953827 715258420
828.1G15258420k139867j582980m50909j142979l078401l818750k920807k889216m992067
$$ 715258420 713118553 711535573 711084664 709941685 706863284 703044534 700123727 697234511 692242444
846.4F92242444n962193m620493m596651o077647n912661l853560k345979l846824
$$ 692242444 686280251 681659758 677063107 670985460 665072799 661219239 658873260 655026436
862.7F55026436r137809j7593742k7217924l2290101k7457178j4207065L844917K2978901
$$ 655026436 645888627 628294885 601076961 568786860 541329682 527122617 530967534 553946435
879.1E53946435L4795166L4199655K7314841K1491826J6905665J1703193O979108M870594
$$ 553946435 588741601 622941256 650256097 671747923 688653588 700356781 707335889 712206483
895.4G12206483N005717M880011L424287K195060K410949K812147J784563o8128q91805
$$ 712206483 717212200 722092211 725516498 727711558 730122507 732934654 734719217 734651089 733759284
913.7G33759284n53966r12964k551734l632903k950430j818061j785040k126217j265049
$$ 733759284 733205318 732292354 729740620 726107717 723157287 721339226 719554186 717427969 716162920
932.1G16162920M41432J195312N77271Q8572N84483R35435j490j419007j825750j420856
$$ 716162920 716604352 717799664 718376935 718465507 719049990 719985425 719983935 718564928 716739178 715318322
952.5G15318322j708984k947271l680050l180385k592206k952755l489732l050268
$$ 715318322 713609338 710662067 706982017 703801632 701209426 698256671 694766939 691716671
968.8F91716671k119422k040386k922237l602445l486335l343940l820837m234671
$$ 691716671 689597249 687556863 684634626 681032181 677545846 674201906 670381069 666146398
985.1F66146398l756345k888798k696634l116965l186464k544344j953244k113760
$$ 666146398 662390053 659501255 656804621 653687656 650501192 647956848 646003604 643889844
1001.4F43889844k564370k570451k399802k741217l402233l522993k901494k362728
$$ 643889844 641325474 638755023 636355221 633614004 630211771 626688778 623787284 621424556
1017.7F21424556k438426k619446k345979j884997j854777k213895k229393j508653
$$ 621424556 618986130 616366684 614020705 612135708 610280931 608067036 605837643 604328990
1034.1F04328990n60045m4346r894j28031l38912p78258j304805j574815j498520j377702
$$ 604328990 603768945 603724599 603714705 603586674 603247762 602469504 601164699 599589884 598091364 596713662
1054.5E96713662j359165j072466k12669P43150J045943O25491L1411m01914p67648
$$ 596713662 595354497 594282031 594069362 594812512 595858455 596483946 596515357 596113443 595345795
1072.8E95345795j076877j151204j056850p38680M36425J917839K509832K633155K772689
$$ 595345795 594268918 593117714 592060864 591322184 591758609 593676448 596186280 598819435 601592124
1091.2F01592124K549111K018094J585186J259804Q44478M09723J57475N3704m0293
$$ 601592124 604141235 606159329 607744515 609004319 609848797 610258520 610415995 610469699 610429406
1109.5F10429406q464L74317R56595J265526J121760Q00967O58095P82072R71198J041413
$$ 610429406 610420942 610795259 611751854 613017380 614139140 614940107 615598202 616380274 617351472 618392885
1129.9F18392885R97841R07123P05600K48134l58462p87735r78649j113236j218676
$$ 618392885 619390726 620297849 621003449 621251583 620893121 620105386 619126737 618013501 616794825
1148.3F16794825j197040j052440r03785q51750p71821m02629L28719J250863K071321
$$ 616794825 615597785 614545345 613641560 612789810 612017989 611615360 611944079 613194942 615266263
1166.6F15266263K593339K816200K788365K580643K367735K226412J958132J462996
$$ 615266263 617859602 620675802 623464167 626044810 628412545 630638957 632597089 634060085
1182.9F34060085Q99255M29034Q4520k27571n32090p37608q28505r19163j082241j227916
$$ 634060085 634959340 635388374 635472894 635245323 634713233 633975625 633147120 632227957 631145716 629917800
1203.3F29917800j206815j033068q96692r44376j070499j132369j214385j337350j390695
$$ 629917800 628710985 627677917 626781225 625836849 624766350 623633981 622419596 621082246 619691551
1221.7F19691551j332045j262843j255990j264989j243710j151205j018881r31979
$$ 619691551 618359506 617096663 615840673 614575684 613331974 612180769 611161888 610229909
1238F10229909r26613r31919r13501q82685q15511o68347n25772n07117n29408n00023
$$ 610229909 609303296 608371377 607457876 606575191 605759680 605091333 604565561 604058444 603529036 603029013
1258.4F03029013m18783l59177l54290l46244k68518k15233k79844l71039m14967m56870
$$ 603029013 602610230 602251053 601896763 601550519 601282001 601066768 600786924 600415885 600000918 599544048
1278.8E99544048n02884m25994k50817j52469k92778n82993p95245q28266q77023j156628
$$ 599544048 599041164 598615170 598364353 598211884 597919106 597336113 596540868 595712602 594835579 593678951
1299.2E93678951j454591j531125j506149j635671j863837k048373k064348j933813
$$ 593678951 592224360 590693235 589187086 587551415 585687578 583639205 581574857 579641044
1315.5E79641044j823902j731098j565158j452863j627624k008200k366662k512574
$$ 579641044 577817142 576086044 574520886 573068023 571440399 569432199 567065537 564552963
1331.8E64552963k539158k597332k686143k533972k107621j972317k296269k693355
$$ 564552963 562013805 559416473 556730330 554196358 552088737 550116420 547820151 545126796
1348.1E45126796k869964l043890l349900l576756l497004l440321l733992l972590
$$ 545126796 542256832 539212942 535863042 532286286 528789282 525348961 521614969 517642379
1364.5E17642379l982842m055262m056990m161119m465163m312784m147529m503161
$$ 517642379 513659537 509604275 505547285 501386166 496921003 492608219 488460690 483957529
1380.8D83957529m894465m843086m797846n044788n304784o207675p436692p912457
$$ 483957529 479063064 474219978 469422132 464377344 459072560 452864885 445428193 437515736
1397.1D37515736q424640q832455q956671r521752r415686q975089q878529q410185
$$ 437515736 429091096 420258641 411301970 401780218 392364532 383389443 374510914 366100729
1413.4C66100729p488490o929308o333709m091143j861841m60833N59539J270771J782059
$$ 366100729 358612239 351682931 345349222 341258079 339396238 338935405 339494944 340765715 342547774
1431.8C42547774K051205K204537K164662J692891J342476J158982R56267P61479O90759
$$ 342547774 344598979 346803516 348968178 350661069 352003545 353162527 354118794 354880273 355571032
1450.1C55571032P49439P55369Q15183J113177J362204J340121J214206J011551R26733
$$ 355571032 356320471 357075840 357891023 359004200 360366404 361706525 362920731 363932282 364859015
1468.5C64859015J093685J499445J796096J825482J898706K024799K144337K101332
$$ 364859015 365952700 367452145 369248241 371073723 372972429 374997228 377141565 379242897
1484.8C79242897K133578K514571K951413K854675K874226L571838M150301M102677
$$ 379242897 381376475 383891046 386842459 389697134 392571360 396143198 400293499 404396176
1501.1D04396176L737480M203856N929112N810440M924357M887789N263508N837917
$$ 404396176 408133656 412337512 418266624 424077064 429001421 433889210 439152718 444990635
1517.4D44990635O012261O402045O167323N508601N495131M936397M531265M807591
$$ 444990635 451002896 457404941 463572264 469080865 474575996 479512393 484043658 488851249
1533.7D88851249M353196L780514M567146M972517M485846M355192M083634L974378
$$ 488851249 493204445 496984959 501552105 506524622 511010468 515365660 519449294 523423672
1550.1E23423672L971874M018128L820539M404425N116761L698468L053010K907693
$$ 523423672 527395546 531413674 535234213 539638638 544755399 548453867 551506877 554414570
1566.4E54414570K584517K479017K116561J783967J753807J467466J297236J221716
$$ 554414570 556999087 559478104 561594665 563378632 565132439 566599905 567897141 569118857
1582.7E69118857Q79586M19021J87039Q9646j20998m73380p20322p23362p90417j077533
$$ 569118857 569998443 570417464 570604503 570694149 570573151 570099771 569379449 568656087 567865670 566788137
1603.1E66788137j407325j549542j658321j859605k078474k348899k510310k089738
$$ 566788137 565380812 563831270 562172949 560313344 558234870 555885971 553375661 551285923
1619.4E51285923j988471k349973k184093j784563j591146j409352j251995j037538
$$ 551285923 549297452 546947479 544763386 542978823 541387677 539978325 538726330 537688792
1635.7E37688792m94302j40786N484K74062P69019J129151R32693J212060K191961
$$ 537688792 537194490 537053704 537059188 537333250 538102269 539231420 540164113 541376173 543568134
1654.1E43568134K037466J662910J820564K343536K700507K421498K490819K980053
$$ 543568134 545605600 547268510 549089074 551432610 554133117 556554615 559045434 562025487
1670.4E62025487K922297L021300L192663K838790K652467L124356M149020L751158
$$ 562025487 564947784 567969084 571161747 574000537 576653004 579777360 583926380 587677538
1686.7E87677538L143192L401339L284335L533721L922403M201829N109072M228890
$$ 587677538 590820730 594222069 597506404 601040125 604962528 609164357 614273429 618502319
1703F18502319L437936L689289L432453K951086K452433K259492K818227K872825K017319
$$ 618502319 621940255 625629544 629061997 632013083 634465516 636725008 639543235 642416060 644433379
1721.4F44433379J586139J584947J619936J540482J313567J687824J904726J430095
$$ 644433379 646019518 647604465 649224401 650764883 652078450 653766274 655671000 657101095
1737.7F57101095J514792J617730J502216J596808J748502J963020J978516J640082
$$ 657101095 658615887 660233617 661735833 663332641 665081143 667044163 669022679 670662761
1754F70662761J625001J594424J293660J396477J387656J116514Q88049P59244J093746
$$ 670662761 672287762 673882186 675175846 676572323 677959979 679076493 679964542 680723786 681817532
1772.4F81817532J079082L69370j12534j84237j27852k42889o13749q77440n76377
$$ 681817532 682896614 683265984 683153450 682969213 682841361 682598472 681984723 681107283 680530906
1790.7F80530906j550j01387m61221k29836M39763Q17836P56085Q02636J207471J663684
$$ 680530906 680529356 680427969 679966748 679736912 680176675 680994511 681750596 682553232 683760703 685424387
1811.1F85424387J674116J441896J412571J465380J298725J053274R34958Q77440J078427
$$ 685424387 687098503 688540399 689952970 691418350 692717075 693770349 694705307 695582747 696661174
1829.5F96661174J093805O60002N15819O61015N41986L00049N55456Q47757O27100
$$ 696661174 697754979 698414981 698930800 699591815 700133801 700433850 700989306 701837063 702464163
1847.8G02464163M39346L55005L49164M58599M95135L79205K41160J98007K75076N06520
$$ 702464163 702903509 703258514 703607678 704066277 704561412 704940617 705181777 705379784 705654860 706161380
1868.2G06161380N58615L49760L25322L66211K61545J80423K53141L32594K46644K08437
$$ 706161380 706719995 707069755 707395077 707761288 708022833 708203256 708456397 708788991 709035635 709244072
1888.6G09244072K76924K64644K70367K21670J08242J69456K69234K03490R4593J32620
$$ 709244072 709520996 709785640 710056007 710277677 710385919 710555375 710824609 711028099 711122692 711255312
1909G11255312K34842J42694m2558O2227K63334K18689J73211J04249M5240J29759
$$ 711255312 711490154 711632848 711590290 711652517 711915851 712134540 712307751 712412000 712457240 712586999
1929.4G12586999J54674N7280O080M6849N1677P7844J11759Q5294R7036O5744m1366
$$ 712586999 712741673 712798953 712805033 712851882 712903559 712981403 713093162 713178456 713275492 713341236 713299870
1951.9G13299870m7981N4955R7871K9445o1929m0293Q8155J25885P75l5048R2149J27971
$$ 713299870 713251889 713306844 713404715 713434160 713372231 713331938 713420093 713545978 713546753 713511705 713603854 713731825
1976.3G13731825J3054o2883Q762P5817j7107j57535q3804J15991P5817j16170j64687
$$ 713731825 713744879 713681996 713690758 713766575 713749468 713591933 713508129 713624120 713699937 713583767 713419080
1998.8G13419080m4883M7088n6505k15828j74761j0133N960j36196j97113j16050p1526
$$ 713419080 713374197 713421285 713364780 713148952 712974191 712964058 712970018 712833822 712636709 712520659 712449133
2021.2G12449133j40369k24471j71542l1709k1399j65581k31862j21177l8147j07288
$$ 712449133 712308764 712084293 711912751 711881042 711859643 711694062 711462200 711341023 711302876 711195588
2041.6G11195588j95145j32382J0609J2934j32083j75953m6552L2664o8724j85490
$$ 711195588 711000443 710868061 710878670 710891604 710759521 710583568 710537016 710569680 710500956 710315466
2062G10315466r9838O6102L7789j31309j66655k4616O6399k7656j48118r5904L3558
$$ 710315466 710215628 710281730 710319519 710188210 710021555 709996939 710063338 710035682 709887564 709791660 709825218
2084.4G09825218J7047j20640j61112l6954N3227n3108j77026j04785L6836K98j81556
$$ 709825218 709842265 709721625 709560513 709523559 709576786 709523678 709346652 709241867 709278703 709279001 709097445
2106.9G09097445k24948o9559K0802r4234k02775j21654K39m0233j76788j83999l8743
$$ 709097445 708872497 708802938 708823740 708729506 708526731 708405077 708405316 708365083 708188295 708004296 707965553
2129.3G07965553L1948q7381j80721p9214N6266L5167r6083j25646J0431Q2075m1604
$$ 707965553 707997501 707910120 707729399 707650185 707706451 707741618 707645535 707519889 707530320 707612395 707570791
2151.7G07570791j38163k5452J45317J09791n4717m2617J27554J72198L6478l2366
$$ 707570791 707432628 707407176 707552493 707662284 707607567 707564950 707692504 707864702 707901180 707868814
2172.1G07868814P4924J74224J00434l5286j1146J33395J67131M0353m9889K5093J29223
$$ 707868814 707943738 708117962 708218396 708183110 708171964 708305359 708472490 708512843 708462954 708488047 708617270
2194.6G08617270O8903p8440o3240Q8572R6381n6863j21713r417R2983O616j34229
$$ 708617270 708686173 708607733 708544493 708633065 708729446 708672583 708550870 708541453 708634436 708641052 708506823
2217G08506823j04964M0293N4359j02580j72674l5405Q7976K1994j09553j11759O974
$$ 708506823 708401859 708442152 708496511 708393931 708221257 708185852 708273828 708295822 708186269 708074510 708081484
2239.4G08081484K8372r8765j38283k861Q6009l2246j79171j14203O7413Q5592p7307
$$ 708081484 708109856 708011091 707872808 707869947 707955956 707923710 707744539 707630336 707697749 707783341 707706034
2261.9G07706034j49667j0908J14501L2067j15335j02878L8684P4446q3029j94609
$$ 707706034 707556367 707545459 707659960 707692027 707576692 707473814 707512498 707586944 707503915 707309306
2282.3G07309306j04130M590m8399j85072k05398r3401o4730j90795k83062k22862
$$ 707309306 707205176 707209766 707161367 706976295 706770897 706677496 706612766 706421971 706138909 705916047
2302.7G05916047j41263k35081m11152l72828j71184j94430m56036n30779k86281p9811
$$ 705916047 705774784 705539703 705128551 704755723 704584539 704390109 703934073 703403294 703117013 703037202
2323.1G03037202k17914m25697k70187K3067l7671k79307k71201l6180K41935O51360
$$ 703037202 702819288 702393591 702123404 702146471 702108800 701829493 701558292 701522112 701764047 702415407
2343.5G02415407P48694l71456j531780j474083p14123k06709P8440K49982L02374
$$ 702415407 703164101 702792645 701260865 699786782 699072659 698865950 698944390 699194372 699496746
2361.8F99496746M09186N60224O35624N74768M31776L48985L33726K32637J0669j63734
$$ 699496746 699905932 700466156 701101780 701676548 702108324 702457309 702791035 703023672 703034341 702870607
2382.2G02870607j65879j08719j35184k32338k61009j80304j22488j65999k31981k14338
$$ 702870607 702704728 702596009 702460825 702228487 701967478 701787174 701664686 701498687 701266706 701052368
2402.6G01052368j48833j48654k20478k53617k12074j92404k49207l02851k68578k00987
$$ 701052368 700903535 700754881 700534403 700280786 700068712 699876308 699627101 699324250 699055672 698854685
2423F98854685k16305l02554l35574k76088k20895k67029l55721l60369k99394l04878
$$ 698854685 698638380 698335826 698000252 697724164 697503269 697236240 696880519 696520150 696220756 695915878
2443.4F95915878l71516l85046l45051l27230l69370m20928m15623m10497m92573n94497
$$ 695915878 695544362 695159316 694814265 694487035 694117665 693696737 693281114 692870617 692378044 691783547
2463.8F91783547o19590n97715o21557p22409q22007q61228q93116r93550j087069
$$ 691783547 691163957 690566242 689944685 689222276 688400269 687539041 686645925 685652375 684565306
2482.1F84565306j078487j057088j104057j167536j148939j047373r60231r18507q85606
$$ 684565306 683486819 682429731 681325674 680158138 679009199 677961826 677001595 676083088 675197482
2500.5F75197482q40306p90239p62760p81119q34525q74936q82864q71003p86066n91755
$$ 675197482 674357176 673566937 672804177 672023058 671188533 670313597 669430733 668559730 667773664 667181909
2520.9F67181909l80039k53499j76370l7312J61171L03208L40820L42846L62217L65853
$$ 667181909 666801870 666548371 666372001 666334689 666495860 666799068 667139888 667482734 667844951 668210804
2541.3F68210804L16978K72155L24964M22120M18961L08633K07603J86444J78396Q5175
$$ 668210804 668527782 668799937 669124901 669547021 669965982 670274615 670482218 670668662 670847058 670932233
2561.7F70932233l7253n2809J1921K801r0361j49965j47760j45733j72258k04265k07185
$$ 670932233 670894980 670842171 670854092 670856893 670766532 670616567 670468807 670323074 670150816 669946551 669739366
2584.1F69739366j92643k21789k98678l29256k51353j85967k45511l19124k90334k22683
$$ 669739366 669546723 669324934 669026256 668697000 668445647 668259680 668014169 667695045 667404711 667182028
2604.5F67182028k24530k82765k82883j87755j08421j26839j86741j83880j25051j05619
$$ 667182028 666957498 666674733 666391850 666204095 666095674 665968835 665782094 665598214 665473163 665367544
2624.9F65367544j54794j92284j39475p4565j16945k00152j92762j25527j21951j92761
$$ 665367544 665212750 665020466 664880991 664806426 664689481 664489329 664296567 664171040 664049089 663856328
2645.3F63856328k59102k68876k45333k74360l51549l63409l01302k87055l65437m05848
$$ 663856328 663597226 663328350 663083017 662808657 662457108 662093699 661792397 661505342 661139905 660734057
2665.7F60734057l61263l34740l47078l87847m10497l79622l78252m28438m43101l83913
$$ 660734057 660372794 660038054 659690976 659303129 658892632 658513010 658134758 657706320 657263219 656879306
2686.1F56879306l53992m12882m66525m50492m01139l67284l93510m55201m43756l92795
$$ 656879306 656525314 656112432 655645907 655195415 654794276 654426992 654033482 653578281 653134525 652741730
2706.5F52741730m28796n09262n05924m35114m04715m36008m47750m07935l85940m07755
$$ 652741730 652312934 651803672 651297748 650862634 650457919 650021911 649574161 649166226 648780286 648372531
2726.9F48372531m28021m20451m04477l91305l94761l79622l16799l20852l79026l87370
$$ 648372531 647944510 647524059 647119582 646728277 646333516 645953894 645637095 645316243 644937217 644549847
2747.3F44549847l73781l76284l86954l98814m31717m44948m07040m03405m47392m59731
$$ 644549847 644176066 643799782 643412828 643014014 642582297 642137349 641730309 641326904 640879512 640419781
2767.7F40419781m45127m62413m85599m68075m66586m97341n02944m94182n18322n73456
$$ 640419781 639974654 639512241 639026642 638558567 638091981 637594640 637091696 636597514 636079192 635505736
2788.1F35505736o13690o05881n83052o11723o62386o79374o84679p10964p68602q10563
$$ 635505736 634892046 634286165 633703113 633091390 632429004 631749630 631064951 630353987 629585385 628774822
2808.5F28774822p90358p63595q09312r09388r67085r53496r44137r96471j083970
$$ 628774822 627984464 627220869 626411557 625502169 624535084 623581588 622637451 621640980 620557010
2826.8F20557010j145482j185715j265407j389563j531780j707196j946687k277434
$$ 620557010 619411528 618225813 616960406 615570843 614039063 612331867 610385180 608107746
2843.1F08107746k648056k792478k439975j719356j035034o07491m30644m27424n31197
$$ 608107746 605459690 602667212 600227237 598507881 597472847 596865356 596434712 596007288 595476091
2861.5E95476091p25687r30309j040995j065612j059711r83119q27432p45594p69138
$$ 595476091 594750404 593820095 592779100 591713488 590653777 589670658 588843226 588097632 587328494
2879.9E87328494q05140q54492r06229r31263r64046r75370r02176p89285p14481o71625
$$ 587328494 586523354 585668862 584762633 583831370 582867324 581891954 580989778 580200493 579486012 578814387
2900.2E78814387o08623n80311o93082r55999j275540j539826j657665j540541j196504
$$ 578814387 578205764 577625453 576932371 575976372 574700832 573161006 571503341 569962800 568766296
2918.6E68766296p62761l69131o6519J23441K38776L71337N19514N93722O05583O28412
$$ 568766296 568003535 567634404 567567885 567691326 567930102 568301439 568820953 569414675 570020258 570648670
2939E70648670O10590N28157M51088L82542K72632J22845l695r3043j12832J192J68741
$$ 570648670 571259260 571787417 572238505 572621047 572893679 573016524 573012829 572919786 572806954 572808146 572976887
2961.4E72976887K76447L63171M76360N79417O64711P28428P50721P40289P09236O68824
$$ 572976887 573253334 573616505 574092865 574672282 575336993 576065421 576816142 577556431 578265667 578934491
2981.8E78934491O44028O35445N83649M63485L57688L13938K69472K05398J40190O5088
$$ 578934491 579578519 580213964 580797613 581261098 581618786 581932724 582202196 582407594 582547784 582612872
3002.2E82612872M947m6312j19746j77503k08557k29418k48313l35633m65811n30958
$$ 582612872 582617819 582571507 582451761 582274258 582065701 581836283 581587970 581252337 580786526 580255568
3022.6E80255568n43416n96165o77943o73652o30915o57976p46846q24928p95544p37130
$$ 580255568 579712152 579115987 578438044 577764392 577133477 576475501 575728655 574903727 574108183 573371053
3043E73371053p78377q50499q76427q81195q85963q64148q63135r00269q94427q56042
$$ 573371053 572592676 571742177 570865750 569984555 569098592 568234444 567371309 566471040 565576613 564720571
3063.4E64720571q25584q05259p91251p92325q31365q39889p59066p04109p67172q40366
$$ 564720571 563894987 563089728 562298477 561506152 560674787 559834898 559075832 558371723 557604551 556764185
3083.8E56764185q44478q17359p99775q17716q49247q49545q08954p78914q39889r30488
$$ 556764185 555919707 555102348 554302573 553484857 552635610 551786065 550977111 550198197 549358308 548427820
3104.2E48427820r00805q27253q63969r35853q93056q10563q75116j022220j093447
$$ 548427820 547527015 546699762 545835793 544899940 544006884 543196321 542321205 541298985 540205538
3122.6E40205538j083970j042306j039922j075805j046598r80556r82940j060247j151204
$$ 540205538 539121568 538079262 537039340 535963535 534916937 533936381 532953441 531893194 530741990
3140.9E30741990j185835j164913j140058j109481j076341j121640j234114j271963
$$ 530741990 529556155 528391242 527251184 526141703 525065362 523943722 522709608 521437645
3157.2E21437645j237333j223802j225651j242697j288354j304269j265228j250148
$$ 521437645 520200312 518976510 517750859 516508162 515219808 513915539 512650311 511400163
3173.5E11400163j275539j259625j236916j268863j276672j270771j306594j288533
$$ 511400163 510124624 508864999 507628083 506359220 505082548 503811777 502505183 501216650
3189.9E01216650j240343j274675j316279j308978j297265j264602j278818j338154
$$ 501216650 499976307 498701632 497385353 496076375 494779110 493514508 492235690 490897536
3206.2D90897536j286983j217425j243442j274348j272976j236290j231640j307249
$$ 490897536 489610553 488393128 487149686 485875338 484602362 483366072 482134432 480827183
3222.5D80827183j317174j216113j151294j148194j147956j179516j187384j126856
$$ 480827183 479510009 478293896 477142602 475994408 474846452 473666936 472479552 471352696
3238.8D71352696j096278j058817r66996r87232j141458j192838j066089r65148j029045
$$ 471352696 470256418 469197601 468230605 467243373 466101915 464909077 463842988 462877840 461848795
3257.2D61848795j129031j145720j088500r90898r20087q96156r19342r37760r32693
$$ 461848795 460719764 459574044 458485544 457494646 456574559 455678403 454759061 453821301 452888608
3275.5D52888608r85622j014412r38237q49515q48502q96096q55207p90954q53628
$$ 452888608 451902986 450888574 449950337 449100822 448252320 447356224 446501017 445710063 444856435
3293.9D44856435r71466j020044r80318q74907p92950q51750r88991j087844j140356
$$ 444856435 443884969 442864925 441884607 441009700 440216750 439365000 438376009 437288165 436147809
3312.2D36147809j121163j080215j093358j114398j118213j149744j254976j359582
$$ 436147809 435026646 433946431 432853073 431738675 430620462 429470718 428215742 426856160
3328.6D26856160j380086j362741j321375j230031j230091j354605j377195j295239
$$ 426856160 425476074 424113333 422791958 421561927 420331836 418977231 417600036 416304797
3344.9D16304797j197338j054555j029969j179963j229286j127571j069576j103252
$$ 416304797 415107459 414052904 413022935 411842972 410613686 409486115 408416539 407313287
3361.2D07313287j122832j023650r21995j017213j249164j289457j072526r27597r61364
$$ 407313287 406190455 405166805 404244810 403227597 401978433 400688976 399616450 398688853 397727489
3379.5C97727489j001685r28283q13007p59751o97911o95646q86678r84848p66277
$$ 397727489 396725804 395797521 394984514 394224763 393526852 392831206 391944528 390959680 390193403
3397.9C90193403n51611o74814q98600q38637o59019n77480n58197o18726o64503n18709
$$ 390193403 389641792 388966978 388068378 387229741 386570722 385993242 385435045 384816319 384151816 383633107
3418.3C83633107l22849l21149l71159k58147j22011j20252j08511m3779j22160l14802
$$ 383633107 383310258 382989109 382617950 382359803 382237792 382117540 382009029 381965250 381843090 381528288
3438.7C81528288l13252j42783J8477K06620J99318M5717Q9049K16782L14713L99231
$$ 381528288 381215036 381072253 381090730 381297350 381496668 381542385 381631434 381848216 382162929 382562160
3459.1C82562160L59864L19361N10186O93143M94450J92344K56896N00739N95867O17922
$$ 382562160 382922024 383241385 383751571 384444714 384939164 385131508 385388404 385889143 386485010 387102932
3479.5C87102932O30796N82516O01262P03364P16329O65843P14779Q35777P64638O67304
$$ 387102932 387733728 388316244 388917506 389620870 390337199 391003042 391717821 392553598 393318236 393985540
3499.9C93985540R37849J037270O57558O42479J000315J121282R89914P95335P34865
$$ 393985540 394923389 395960659 396618217 397260696 398261011 399382293 400372207 401167542 401902407
3518.2D01902407Q76904J156688J239478J090110J105040J112878J018137J164585
$$ 401902407 402779311 403935999 405175477 406265587 407370627 408483505 409501642 410666227
3534.5D10666227J328826J129180R43423J152158J592576J642615J133769J103849
$$ 410666227 411995053 413124233 414067656 415219814 416812390 418455005 419588774 420692623
3550.9D20692623J499265J347035J124412J284003J201690Q23646J479894L016681
$$ 420692623 422191888 423538923 424663335 425947338 427149028 427972674 429452568 432469249
3567.2D32469249K621114J067400R15617J479119J717597J724809J447589J045793
$$ 432469249 435090363 436157763 437073380 438552499 440270096 441994905 443442494 444488287
3583.5D44488287J774281L292084K548903R15885J381815K238989K064555K045453
$$ 444488287 446262568 449554652 452103555 453019440 454401255 456640244 458704799 460750252
3599.8D60750252K003402J253366J276731K533526K822607K193541J740247J365661
$$ 460750252 462753654 464007020 465283751 467817277 470639884 472833425 474573672 475939333
3616.1D75939333K668798L729195J654208m64112M95583M852861N431682J492619Q94815
$$ 475939333 478608131 482337326 483991534 483527422 484023005 488875866 494307548 495800167 496694982
3634.5D96694982J663774J713783J646519R05811L7432J565337N666256N431831N95629
$$ 496694982 498358756 500072539 501719058 502624869 502662301 504227638 509893894 515325725 515921354
3652.8E15921354K92361K850473K147496P71343O49035p0989M0591K653837K616644
$$ 515921354 516213715 519064188 521211684 521983027 522632062 522561073 522601664 525255501 527872145
3671.2E27872145N14031L555417L993988O7889p89940j046002j217663J502871M476488
$$ 527872145 528386176 531941593 535935581 536003470 535213530 534167528 532949865 534452736 538929224
3689.6E38929224K380431m79520p76291m07397M96864J924038R62973j311124j161992
$$ 538929224 541309655 540830135 540053844 539646447 540143311 542067349 543030322 541719198 540557206
3707.9E40557206J561820L670514J061916j811743j515746k89082K75373M52221L36647
$$ 540557206 542119026 545789540 546851456 545039713 543523967 543234885 543510258 543962479 544299126
3726.3E44299126j203060k011776p5877K712786L134966n35071m052699j394629M083991
$$ 544299126 543096066 541084290 541008413 543721199 546856165 546321094 542268395 540873766 544957757
3744.6E44957757J187444j275480L223360L018379j547635j840055N79894N53608j059831
$$ 544957757 546145201 544869721 548093081 551111460 549563825 547723770 548303664 548857272 547797441
3763E47797441o19292L12150J176953J258135o07312j593113m28200J178325O15120
$$ 547797441 547178149 547490299 548667252 549925387 549318075 547724962 547296762 548475087 549090207
3781.3E49090207m27425J9610N6445l64780p97093r91583k95460n59509J20044K452612
$$ 549090207 548662782 548682392 548738837 548374057 547576964 546585381 546289921 545730412 545850456 548303068
3801.7E48303068L47912n13256J449347p96735l230870j462042J453757K95222O26027
$$ 548303068 548650980 548137724 549587071 548790336 545559466 544097424 545551181 545846403 546472430
3820.1E46472430K553821l71337j766145j058877p72536m51088p43389N09918K440810
$$ 546472430 549026251 548654914 546888769 545829892 545057356 544606268 543862879 544372797 546813607
3838.4E46813607J075447l87013o07491k112448m013479k780378M677892P471383r69291
$$ 546813607 547889054 547502041 546894550 544782102 540768623 537988245 542666137 550137520 549168229
3856.8E49168229m318654k314806K49683O36161r56953K82049J837612L19242r41336
$$ 549168229 544849575 542534769 542784452 543420613 542463660 542745709 544583321 544902563 543961227
3875.2E43961227j851440o52730O45161j31011Q51273Q4698j300692O74248L28242
$$ 543961227 542109787 541457057 542102218 541971207 542822480 542907178 541606486 542280734 542608976
3893.5E42608976k244055j787722L62754J523912J916766P84278j215875j504183j053989
$$ 542608976 540364921 538577199 538939953 540463865 542380631 543164909 541949034 540444851 539390862
3911.9E39390862r71556l7372R45926K28882o40333j51157l7432p82132l22581P33376
$$ 539390862 538419306 538381934 539327860 539556742 538916409 538765252 538727820 537945688 537623107 538356483
3932.3E38356483K56956p72000r49740m67897K30790K9027m21047L7789J65224k79367
$$ 538356483 538613439 537841439 536891699 536423802 536654592 536683619 536262572 536300361 536465585 536186218
3952.7E36186218m13596l10302k35558j10626q2731k59102k94983k00391j66654j05620
$$ 536186218 535772622 535462320 535226762 535116136 535033405 534774303 534479320 534278929 534112275 534006655
3973.1E34006655m5836j51932k56181j49011n9784j93953l11733k29954j72854j89841
$$ 534006655 533960819 533808887 533552706 533403695 533343911 533149958 532838225 532608271 532435417 532245576
3993.4E32245576j58012k12907
$$ 532245576 532087564 531874657
3997.5E31874657
$$ 531874657
##END=$$ End of the data block
