##TITLE=T1PR $$ Begin of the data block
##JCAMP-DX=5.00 $$ ACD/SpecManager v 10.08
##SPECTROMETER/DATA SYSTEM=Alpha
##DATE=02 Mar 2014 10:12:22
##DATA TYPE=INFRARED SPECTRUM
##DATA CLASS=XYDATA
##ORIGIN=
##OWNER=
##NPOINTS=1765
##FIRSTX=399.75695801
##LASTX=3997.56933594
##MAXX=3997.56933594
##MINX=399.75695801
##MAXY=0.71848476
##MINY=0.24230278
##XFACTOR=1.0000000000
##YFACTOR=1.000000000000000e-9
##FIRSTY=0.54022694
##DELTAX=2.03957629
##XUNITS=1/CM
##YUNITS=ARBITRARY UNITS
##XYDATA=(X++(Y..Y))
399.8E40226936N078137L811121K464056K686262L125966K579033K109468J933754
416.1E64014733J708507J946450K121746J515925P45952Q91626J383126P89165K67029
434.4E75384259R99034J316309N65648M31776J022339Q14020M85063J000345Q85129
452.8E82903922r2388q8572M75585Q9646j16408N15282N52595p8380l4512K43962k27928
475.2E84142804l64482L62217M88162K9922L02672O60300J78278k43425J68740M11570
495.6E86136758M053O1870N59747M25756o5446j24931q1778m54425p18773l88026j74701
518.1E85180104l04461K2531M94301M20630L46959P05838Q35299N19693N00679P78497
538.4E89500070N61595J03712J28567J65582l50833o00219k17617l14235q66592o14405
$$ y = [540226936, 545305073, 549116194, 551580250, 554266512, 557392478, 559971511, 562080979, 564014733, 565723240, 567669690, 569791436, 571307361, 572053313, 572944939, 574328065, 575117230, 575384259, 576383293, 577699602, 578265250, 578697026, 579719365, 580533385, 581018448, 582018793, 582903922, 582811534, 582722962, 583198547, 583288193, 583171785, 583687067, 584239662, 584161282, 584126770, 584370732, 584142804, 583778322, 584140539, 584628701, 584658623, 584961295, 585621595, 585799873, 585556448, 585725188, 586136758, 586140811, 586202681, 586762428, 587188184, 587122738, 586997807, 586916029, 586461604, 585742831, 585354805, 585180104, 584875643, 584898174, 585392475, 585813105, 586160064, 586865902, 587701201, 588220894, 588721573, 589500070, 590061665, 590165377, 590293944, 590459526, 590108693, 589508474, 589290857, 588976622, 588110030, 587495625]
558.8E87495625Q1658o7949m44531q9944o5863q90374j065791k61306r7216m96626
579.2E84097683J0252O45519L42428K69652Q65757P18534j0788K84195P53581j7106
599.6E87959707p01249m03821m77732j011312n61773K26318j79350o28233M81904J536131
620E86240590J166522J102924J636029J271665P27773J360833J867593J103162O38426
638.4E97115517J076638Q03829j03951p6234M71949K71917k1339N14150P14362K83897
658.8F01050735O69479J294792p84517m802286j408458N161345L297746Q59201R49502
677.1F06287539Q98242M26471Q86321J309932O07669Q1301L52561j25170j673817k596617
697.5F06454432j729369n23448j001299k454996m161179o211936n846620j497447K296388
$$ y = [587495625, 587577283, 587509334, 587064803, 586974859, 586908996, 586018622, 584952831, 584691525, 584594309, 584097683, 584107935, 584753454, 585095882, 585365534, 586231291, 586949825, 586939037, 587223232, 587976813, 587959707, 587258458, 586854637, 586376905, 585365593, 584803820, 585030138, 584850788, 584222555, 584704459, 586240590, 587407112, 588510036, 590146065, 591417730, 592145503, 593506336, 595373929, 596477091, 597115517, 598192155, 598995984, 598892033, 598815799, 599287748, 599559665, 599538326, 600052476, 600766838, 601050735, 601720214, 603015006, 602230489, 597428203, 596019745, 601181090, 604478836, 605338037, 606287539, 607185781, 607612252, 608498573, 609808505, 610416174, 610497475, 610850036, 610724866, 609051049, 606454432, 604725063, 604201615, 603200316, 600745320, 596584141, 590372205, 584525585, 583028138, 585324526]
715.9E85324526K843141L808558O148100P208467P254004P285476O351173M460394
732.2F30683839L193140K633632J697123Q48114R23455J023590M26114R4891L51071
750.6F41874969J85788l22461k21670J14918j14739l65317L2782L91066J78993K30313
771F41984642P99298R16838N78642P48039J188099J049638Q26716J154423J268864
789.3F50515199Q01205P25150J161755J124620O99580P87139R86397M59611k9742J96874
809.7F57427788K69353k09033k74897J94073R7275l66450j37746J98483k62200o67692
830.1F56268954m93645p79331j628518j952470k126276k885223l440380l730356m204214
848.5F35028541n430818p800459q322776m923641n02229J781404N63502m375934j2788117
$$ y = [585324526, 588167667, 591976225, 598124325, 605332792, 612586796, 619872272, 626223445, 630683839, 633876979, 636510611, 638207734, 639055848, 639979303, 641002893, 641429007, 641523898, 641874969, 642060757, 641738296, 641516626, 641631544, 641516805, 641151488, 641184270, 641575336, 641754329, 641984642, 642783940, 643700778, 644279420, 645027459, 646215558, 647265196, 648091912, 649246335, 650515199, 651316404, 652041554, 653203309, 654327929, 655027509, 655814648, 656801045, 657260656, 657230914, 657427788, 657697141, 657488108, 657213211, 657407284, 657504559, 657138109, 657000363, 657198846, 656936646, 656268954, 655775309, 654995978, 653367460, 651414990, 649288714, 646403491, 642963111, 639232755, 635028541, 629597723, 621797264, 613474488, 608550847, 608048618, 609830022, 610393524, 606017590, 593229473]
866.8E93229473k4959863l6697566l8093239k4787486m77284K7379870M5378209M5147001
883.1E86119115L4119130K2702336J4342725Q729935M726052K502680K609312L274918
899.4F79126203K834678K425134K615988J945019O44386L03030K78175p20680j558066
917.8F87893867j263618j263559j987219j864075j133621j316130j667261j079858
934.1F76318526p32600j290501j381278r31918j412392k359629k474427k657056l731370
952.5F59347355m414022m282474m615009n307317n187094m790366n065143n217790
968.8F20468140m636765m361451m730641m748345m451573m669666m905820m319310
985.1E83644569l618121l463209l110647k353966k046883k143264j933098j730085
$$ y = [593229473, 568269610, 531572044, 493478805, 468691319, 468214035, 495593905, 540972114, 586119115, 620238245, 642940581, 657283306, 666013241, 670739293, 673241973, 675851285, 679126203, 681960881, 684386015, 687002003, 688947022, 689591408, 689894438, 690172613, 689451933, 687893867, 686630249, 685366690, 683379471, 681515396, 680381775, 679065645, 677398384, 676318526, 675585926, 674295425, 672914147, 671982229, 670569837, 668210208, 665735781, 663078725, 659347355, 654933333, 650650859, 646035850, 640728533, 635541439, 630751073, 625685930, 620468140, 615831375, 611469924, 606739283, 601990938, 597539365, 592869699, 587963879, 583644569, 580026448, 576563239, 573452592, 571098626, 569051743, 566908479, 564975381, 563245296]
1001.4E63245296k140522k696633k946317l379703m009604m105628l756106l699183
1017.7E36511600l796101l473937l048003k974391k885520k543927k311468k101540
1034.1E13376713j454056o74188l97741m35353l82483m39584p03335p07388l82423
1052.4E07800162k24412j39892L33429J035213J506746J730621J711845J154721J99616
1070.8E15108049m88997p05957q23379j021921p62344P75218K555430K999962K814531
1089.1E20450592K729058K500356K282440K000272J383901P68781M82917K34842q4400
1107.5E32748759m7147L65436P43746J110733J579583J776933J556278J478016J807749
1125.8E43120086K137661K372265K612412K541900J980662J288235P55549J67072m98653
$$ y = [563245296, 561104774, 558408141, 555461824, 552082121, 548072517, 543966889, 540210783, 536511600, 532715499, 529241562, 526193559, 523219168, 520333648, 517789721, 515478253, 513376713, 511922657, 511248469, 510850728, 510415375, 510032892, 509593308, 508889973, 508182585, 507800162, 507575750, 507435858, 507769287, 508804500, 510311246, 512041867, 513753712, 514908433, 515108049, 514619052, 513913095, 513089716, 512067795, 511305451, 512080669, 514636099, 517636061, 520450592, 523179650, 525680006, 527962446, 529962718, 531346619, 532115400, 532598317, 532833159, 532748759, 532701612, 533067048, 533810794, 534921527, 536501110, 538278043, 539834321, 541312337, 543120086, 545257747, 547630012, 550242424, 552784324, 554764986, 556053221, 556808770, 556975842, 556477189]
1144.2E56477189q38339q71122j036644j323283j373708j328290j379847j091302j61409
1162.6E47073245J023889K090335L095328L961265M412830M615844M848241M872322
1178.9E75993299M416109L739535L127695K384066J409769N38707j48594q83580j533448
1197.2E89043558j835287j926720k046585k016604j639545j276553j216292j206517
1213.5E75879455j092673j077831j141667j068830j003802j193106j382888j351535
1229.9E66567123j373470j514912j474440j285553j305043j400113j222849r56893
1246.2E56033850q75294p08998l33488j63674k41637j34409J24157J09732N4359K82824
1266.6E54147422M34697K78831K41994M24981L21448J4305O7652L26216K18153j1563
$$ y = [556477189, 555638850, 554767728, 553731084, 552407801, 551034093, 549705803, 548325956, 547234654, 547073245, 548097134, 550187469, 553282797, 557244062, 561656892, 566272736, 571120977, 575993299, 580409408, 584148943, 587276638, 589660704, 591070473, 591609180, 591460586, 590577006, 589043558, 587208271, 585281551, 583234966, 581218362, 579578817, 578302264, 577085972, 575879455, 574786782, 573708951, 572567284, 571498454, 570494652, 569301546, 567918658, 566567123, 565193653, 563678741, 562204301, 560918748, 559613705, 558213592, 556990743, 556033850, 555158556, 554449558, 554116070, 553952396, 553710759, 553576350, 553700507, 553810239, 553864598, 554147422, 554582119, 554860950, 555102944, 555527925, 555849373, 555863678, 555931330, 556257546, 556475699, 556464136]
1287E56464136o6042l19898q42333j118899j242876j744628k335429k560615k758503
1305.3E43474913l312171l727198l879547m246771m640877m472792l782571k899706
1321.6E12513280j715303l31580N59509O26683M63307L13639r0062n96881p02143o35862
1342E10404587r75669j383185j616895k014876k604723k851516k851456l042400l389239
1360.4D89674628l588826l625005l860235m182786m202485m317910m725665m663586
1376.7D56508130m720479n384446n796820n582422n702972o317496o645292p727295
1393D08630908r590328j0705710j1590957j2242467j2758195j3967186j4112234j3600916
1409.3C10062915j3441145j2746901j1459112j0546267r404540o062567k974853j124755
$$ y = [556464136, 556398094, 556078196, 555235863, 554116964, 552874088, 551129460, 548794031, 546233416, 543474913, 540162742, 536435544, 532555997, 528309226, 523668349, 519195557, 515412986, 512513280, 510797977, 510466397, 511025906, 511652589, 512115896, 512429535, 512339473, 511742592, 511040449, 510404587, 509428918, 508045733, 506428838, 504413962, 501809239, 498957723, 496106267, 493063867, 489674628, 486085802, 482460797, 478600562, 474417776, 470215291, 465897381, 461171716, 456508130, 451787651, 446403205, 440606385, 435023963, 429320991, 423003495, 416358203, 408630908, 399040580, 388334870, 376743913, 364501446, 351743251, 337776065, 323663831, 310062915, 296621770, 283874869, 272415757, 261869490, 252464950, 246402383, 243427530, 242302775]
1425.7B42302775L53635J512661K146483K315715K573579K728671K145618J621813
1442B57700950J317978J038790Q52406P40528O37561M52041M86345R66459J187086
1460.3B65380144R53674P70867O91563N86122N53161Q76397J383066J553894J606911
1478.7B74355799J766354K014696K143979K431870L218383M048347M091382M409850
1495B98480660N691081O412148O098450N541980O314754Q816481Q440256P107914O998390
1513.4C59902114P179081P572562P675081Q258939Q084714P231057P165074O483972
1529.7D19552594O070197O478399N675644M686773N891025O875366O106704N614072
1546D66950774N219937N080908M824519M510790M079551M599810N510002M056573L034174
$$ y = [242302775, 242656410, 244169071, 246315554, 248631269, 251204848, 253933519, 256079137, 257700950, 259018928, 260057718, 260910124, 261650652, 262288213, 262740254, 263226599, 264193058, 265380144, 266333818, 267104685, 267796248, 268382370, 268935531, 269811928, 271194994, 272748888, 274355799, 276122153, 278136849, 280280828, 282712698, 285931081, 289979428, 294070810, 298480660, 304171741, 310583889, 316682339, 322224319, 328539073, 337355554, 345795810, 352903724, 359902114, 367081195, 374653757, 382328838, 390587777, 398672491, 405903548, 413068622, 419552594, 425622791, 432101190, 437776834, 442463607, 448354632, 455229998, 461336702, 466950774, 472170711, 477251619, 482076138, 486586928, 490666479, 495266289, 500776291, 504832864, 507867038]
1564.3E07867038K633989K285361K218426J760482J169205J118303J168608R33349
1580.7E21154761N59151K43366j75655p17580j174450j466453j793444k109230k277672
1599E12242794k497911k801419l042280l139973l332645l506481l516794l865420m332066
1617.4D82207805l553480l113687l561497l455490l120333k838730k398253k393275
1633.7D57773060k681047j833975r50069p50869n37098j51455N38588J007586J534790
1652D53949511K834082L129244K942800L210634L664970L957868L770501L978610M527628
1670.4D85965848M383445M611820N019635M527151M053295M350543N591333N555570
1686.7E24058640M907608M942238M538060M812240N398035N403519O156802N598426
$$ y = [507867038, 510501027, 512786388, 515004814, 516765296, 517934501, 519052804, 520221412, 521154761, 521713912, 521957278, 521781623, 521064043, 519889593, 518423140, 516629696, 514520466, 512242794, 509744883, 506943464, 503901184, 500761211, 497428566, 493922085, 490405291, 486539871, 482207805, 478654325, 475540638, 471979141, 468523651, 465403318, 462564588, 460166335, 457773060, 455092013, 453258038, 452307969, 451557100, 451020002, 450868547, 451407135, 452414721, 453949511, 456783593, 459912837, 462855637, 466066271, 469731241, 473689109, 477459610, 481438220, 485965848, 490349293, 494961113, 499980748, 504507899, 508561194, 512911737, 518503070, 524058640, 528966248, 533908486, 538446546, 543258786, 548656821, 554060340, 560217142, 565815568]
1703E65815568M878104M883349M402339L924489L431618L086508L576576L829062L059388
1721.4F00887001K612114K628982K444386K081871J860857K371252K702951K183855
1737.7F19773269K294540K618253K469004K397656K630830K990424L070116K710462
1754F40954554K521336K344310K047122K163589K047002J558721J327277J300752J390993
1772.4F57655656J288414Q68500M72366J39893m4764j04188k40744l95596l07619Q0287
1792.8F59412205K30611J45495L91125R19938J257360J430810J659810J856864K042651
1811.1F69346869K172530K138853J968980J776337J619339J478970J314581J110851
1827.4F82927310J164735J305103J129449R69171R37164P24316N03122P09892R97543
$$ y = [565815568, 570693672, 575577021, 579979360, 583903849, 587335467, 590421975, 593998551, 597827613, 600887001, 603499115, 606128097, 608572483, 610654354, 612515211, 614886463, 617589414, 619773269, 622067809, 624686062, 627155066, 629552722, 632183552, 635173976, 638244092, 640954554, 643475890, 645820200, 647867322, 650030911, 652077913, 653636634, 654963911, 656264663, 657655656, 658944070, 659812570, 660284936, 660424829, 660380065, 660275877, 660035133, 659639537, 659331918, 659412205, 659642816, 659788311, 660179436, 661099374, 662356734, 663787544, 665447354, 667304218, 669346869, 671519399, 673658252, 675627232, 677403569, 679022908, 680501878, 681816459, 682927310, 684092045, 685397148, 686526597, 687495768, 688432932, 689157248, 689660370, 690370262, 691367805]
1845.8F91367805Q65340P42138P56263O81580N86152O08682O62148N68807M05968L33964
1866.2F97578847M47929O41823O95765O70016N57303M07696M05014M90844M55260L36051
1886.6G02686548L83556M97937M13061L62515M78685M47273K96414K98142L69311K97844
1907G06531286K52784L85761L92318J74582J38819L37541L09110J85251K77638L39866
1927.4G09324956J87576J06573K46405K76208J03474M2617J64748K02357J57655K07185
1947.8G11019754K10762Q1599O7175J87814J49488J4842N6088J39773O2287O3836K12729
1970.2G12266147K05338N1975N1737J66834Q2433o8128J2994J03950m5776r9898P9930
1992.6G12807536P5996q0347k6703P5281n1439j42694j0907J6212j56522j61051j6272
$$ y = [691367805, 692233145, 692975283, 693731546, 694413126, 694999278, 695607960, 696270108, 696838915, 697244883, 697578847, 698026776, 698668599, 699364364, 700034380, 700591683, 700999379, 701404393, 701895237, 702350497, 702686548, 703070104, 703568041, 703981102, 704343617, 704822302, 705269575, 705565989, 705864131, 706233442, 706531286, 706784070, 707169831, 707562149, 707736731, 707875550, 708213091, 708522201, 708707452, 708985090, 709324956, 709512532, 709619105, 709865510, 710141718, 710245192, 710287809, 710452557, 710654914, 710812569, 711019754, 711230516, 711312115, 711379290, 711567104, 711716592, 711731434, 711787522, 711927295, 711989582, 712053418, 712266147, 712471485, 712523460, 712575197, 712742031, 712824464, 712756336, 712769330, 712873280, 712827504, 712727606, 712807536, 712883532, 712803185, 712776482, 712851763, 712800324, 712657630, 712646723, 712662935, 712506413, 712345362, 712329090]
2015.1G12329090o5089j83880r1732j0132j41084j58668n841n3466k19524j57773k2054
2037.5G11219847q3029j36614j2815L2246r8645j05918J6868j0669q7440j0371M2975
2060G10766435m6373p1347K6465K7776o6281k0325P9572K9624l9935K0921N4955k6524
2084.4G10734963l8564M5836M2141n4241m1842L3438q225n7578p451K682p6532q8453
2108.9G10486174l0637m1247q8632n0723p093p2539j15454l6121Q285n5790o0379J6272
2133.4G09952116Q643n7817j5735N7876J3411j9610O9082J05381K4080L3676J50025
2155.8G10321128J63556Q9824J36196K36631J91927J17540J86503K44379J83702J89364
2176.2G12060750K57253K06948J25288J87695K47241J62422J32680K20299K00272P6115
$$ y = [712329090, 712264001, 712080121, 711988389, 711978257, 711837173, 711678505, 711672664, 711619198, 711399674, 711241901, 711219847, 711136818, 711000204, 710987389, 711019635, 710920990, 710815072, 710831940, 710821271, 710733831, 710723460, 710766435, 710720062, 710648715, 710675180, 710702956, 710636675, 710616350, 710695922, 710725546, 710685611, 710706532, 710761487, 710734963, 710696399, 710742235, 710784376, 710730135, 710688293, 710721731, 710713506, 710655928, 710648477, 710651159, 710574627, 710486174, 710455537, 710414290, 710325658, 710274935, 710267842, 710195303, 710079849, 710043728, 710052013, 709996223, 709935844, 709952116, 709960759, 709902942, 709887207, 709945083, 709958494, 709938884, 710007966, 710113347, 710137427, 710171103, 710321128, 710484684, 710574508, 710710704, 710947335, 711139262, 711256802, 711443305, 711687684, 711871386, 712060750, 712318003, 712524951, 712650239, 712837934, 713085175, 713247597, 713380277, 713600576, 713800848, 713876963]
2196.6G13876963R4592J84536J21594L0160Q6009J17660J9073K1994J29819Q3328k2591
2219G14743137L5167R7573K1815j4961O3658N7578m0590o199Q7797K9505o3062n186
2243.5G15006232M3571n5551r7156p093k5511j37686j08302l3021q2731j08957o259
2265.9G14387536L3498j9431K9862J31249J06871P1347J92523K11179j09493m28081
2286.3G14607060m78804n31793o56724o32167n94973p38144q95381j020312j333654
2304.7G07725108j738131j894176j771331j566351j552999k026081k730489k883315
2321F91562235k209544j545608j689136j941681j313448n36799o78182j028836q40842
2339.4F79778159k20359J397670M233539M423558O9023m927159o878853n672812l625751
$$ y = [713876963, 713971555, 714156091, 714277685, 714307845, 714393854, 714511514, 714530587, 714552581, 714682400, 714765728, 714743137, 714778304, 714875877, 714897692, 714882731, 714946389, 715003967, 714963377, 714957178, 715044975, 715074480, 715011418, 715006232, 715049803, 714994252, 714897096, 714890003, 714864492, 714726806, 714618504, 714585483, 714502752, 714393795, 714387536, 714421034, 714401603, 714431465, 714562714, 714669585, 714740932, 714933455, 715144634, 715035141, 714607060, 714128256, 713596463, 712939739, 712307572, 711712599, 710974455, 710079074, 709058762, 707725108, 705986977, 704092801, 702321470, 700755119, 699202120, 697176039, 694445550, 691562235, 689352691, 687807083, 686117947, 684176266, 682862818, 682326019, 681647837, 680619001, 679778159, 679557800, 680955470, 685189009, 689612567, 689681590, 684754431, 677875578, 672202766, 668577015]
2357.7F68577015j474678O13570K325833L645062M697025N329430N450070N336941
2374F94500268N232572N037129M570901L768385K714276J575291O87123K76863J21951
2392.4G18484759k7656p9096k98k1815j27017j00553k4975o9737j16885o9678r1910
2414.8G17755139j99974j84536j03116j52707k29001j89483j50919k10047k28882j72555
2435.2G15933919j93894k68340k59399k35260k91646l12268k61784k89738l97146m25815
2455.6G12998629m01855m47810m86373m42982m75586o29186p11382p15554p89523r11235
2476G06987143r67265j017868j143456j199662j151204j192213j259505j170337j087249
2494.4F96798384j094699j018941q59261p83384p97748p61867p43568q59439r67801
$$ y = [668577015, 667102337, 667715907, 670041740, 673686802, 678383827, 683713257, 689163327, 694500268, 699732840, 704769969, 709340870, 713109255, 715823531, 717398822, 718085945, 718362808, 718484759, 718457103, 718378007, 718377709, 718355894, 718228877, 718128324, 718103349, 718033612, 717916727, 717847049, 717755139, 717555165, 717370629, 717267513, 717114806, 716885805, 716696322, 716545403, 716335356, 716106474, 715933919, 715740025, 715471685, 715212286, 714977026, 714685380, 714373112, 714111328, 713821590, 713424444, 712998629, 712596774, 712148964, 711662591, 711219609, 710744023, 710114837, 709403455, 708687901, 707898378, 706987143, 706019878, 705002010, 703858554, 702658892, 701507688, 700315475, 699055970, 697885633, 696798384, 695703685, 694684744, 693825483, 693042099, 692244351, 691482484, 690738916, 689879477, 688911676]
2512.7F88911676r52363q75949p67172n74052l23832j46985k8849J59144L70145M81308
2533.1F86253071N27978N87106N80668M71950M26232M86911M98771M88520N42224N01394
2553.5F91364825L32117K65658K79069J59740L3736O8605J03951K2113m4644m5418
2573.9F92539752j07289j82628j44661j22726k05517k25246j70111k15710k96473k55168
2594.3F90614223k04026k57433k87413k46704k52843k85089k34246j53184j69873k26379
2614.7F88297033j76549j17182j63556j67071j20640j66178k30014k04563j69695j98006
2635.1F86583579k10524j85132k13802k79546k81930k62975l20256l71933l65257l98577
2655.5F83693647m51028m29749l94822m29332m55379m38333m67479n08011m86195m61876
$$ y = [688911676, 687959313, 687083364, 686316192, 685742140, 685418308, 685271323, 685242474, 685401618, 685771763, 686253071, 686781049, 687368155, 687948823, 688420773, 688847005, 689333916, 689832687, 690321207, 690863431, 691364825, 691696942, 691962600, 692241669, 692401409, 692435145, 692503750, 692607701, 692629814, 692585170, 692539752, 692432463, 692249835, 692105174, 691982448, 691776931, 691551685, 691381574, 691165864, 690869391, 690614223, 690410197, 690152764, 689865351, 689618647, 689365804, 689080715, 688846469, 688693285, 688523412, 688297033, 688120484, 688003302, 687839746, 687672675, 687552035, 687385857, 687155843, 686951280, 686781585, 686583579, 686373055, 686187923, 685974121, 685694575, 685412645, 685149670, 684829414, 684457481, 684092224, 683693647, 683242619, 682812870, 682418048, 681988716, 681533337, 681095004, 680627525, 680119514, 679633319, 679171443]
2675.9F79171443m91500n18083m88639m67420m95970n05150m80175m99367n26250n08487
2696.3F74190402n14626n47410n61773n48065n45025n87821o11842n93721n82338n63383
2716.7F68534398n45561n74291n97715n41211m76658n03540n32985m96864m79639m98056
2737.1F63287878m84049m57764m52876m41253m46022m56095m55915m83692n19633n43714
2757.5F58546865n61655n59806n63026n92470n98252n90384o16908o39200o45936o90221
2777.9F52489007p36952p23124p06971p46250p96854q04424p96438q12351q24035q17477
2798.3F44724131q40962q84891r30786j030326j120329j118958j121700j182735j205325
2816.6F35288119j207709j284361j380265j417160j452922j537622j636743j761556
$$ y = [679171443, 678679943, 678161860, 677673221, 677205801, 676709831, 676204681, 675724506, 675225139, 674698889, 674190402, 673675776, 673128366, 672566593, 672018528, 671473503, 670885682, 670273840, 669680119, 669097781, 668534398, 667988837, 667414546, 666816831, 666275620, 665798962, 665295422, 664762437, 664265573, 663785934, 663287878, 662803829, 662346065, 661893189, 661451936, 661005914, 660549819, 660093904, 659610212, 659090579, 658546865, 657985210, 657425404, 656862378, 656269908, 655671656, 655081272, 654464364, 653825164, 653179228, 652489007, 651752055, 651028931, 650321960, 649575710, 648778856, 647974432, 647177994, 646365643, 645541608, 644724131, 643883169, 642998278, 642067492, 641037166, 639916837, 638797879, 637676179, 636493444, 635288119, 634080410, 632796049, 631415784, 629998624, 628545702, 627008080, 625371337, 623609781]
2832.9F23609781j943230k178312k447843k810478l348172l929138m154206l610074
2849.3E99188328k419055j282096p22110o38187p04825q43048j092732j367509j539290
2867.6E88579476j579166j504182j293660j023471q97646r23335r22263r04679r84908
2886E78546166j111328j162648j149357j138627j080275r65178r34839j008809j082003
2904.3E68913102j198411j482844j914442k312958k431095k141058j555145q99494
2920.6E54977655l65734J7822K91050M72724O48081Q44598R94742J093686J152396
2939E60127020J137376J085996J058638J015842Q64149N92649L58581K86877L25501
2957.4E66852629L89576M83334O31750P72655Q59439R42230J032949J071155J032293
$$ y = [623609781, 621666551, 619488239, 617040396, 614229918, 610881746, 606952608, 602798402, 599188328, 596769273, 595487177, 594765067, 594126880, 593422055, 592579007, 591486275, 590118766, 588579476, 587000310, 585496128, 584202468, 583178997, 582281351, 581358016, 580435753, 579531074, 578546166, 577434838, 576272190, 575122833, 573984206, 572903931, 571938753, 571003914, 569995105, 568913102, 567714691, 566231847, 564317405, 562004447, 559573352, 557432294, 555877149, 554977655, 554611921, 554629743, 554920793, 555393517, 556041598, 556886196, 557880938, 558974624, 560127020, 561264396, 562350392, 563409030, 564424872, 565289021, 565881670, 566240251, 566527128, 566852629, 567242205, 567725539, 568357289, 569129944, 569989383, 570931613, 571964562, 573035717, 574068010]
2975.7E74068010R38237Q35537P52986O83546O37651N99205N04911L81291L00407K12550
2996.1E79914331J06335J9491p6175j58965k12968k95520l99708m63725n02765n46515
3016.5E77383816o03854o97315q08358r06706r91345j036167j034021j028419j025259
3034.9E69252372j059294j154244j216531j226008j224339j215458j240849j291871
3051.2E59623778j302004j260996j234293j272082j287878j237333j205205j185000
3067.5E49638987j154066j173734j210988j185536j141012j151323j169205j125336
3083.8E40327787j075804j086771j130164j167417j178741j152217j111150j114190
3100.1E31311333j166701j207650j212418j207352j243114j258552j183391j159727
$$ y = [574068010, 575006247, 575841784, 576594770, 577278316, 577915967, 578515172, 579020083, 579401374, 579701781, 579914331, 580020666, 580040157, 579963982, 579805017, 579592049, 579296529, 578896821, 578433096, 577930331, 577383816, 576779962, 576082647, 575274289, 574367583, 573376238, 572340071, 571306050, 570277631, 569252372, 568193078, 567038834, 565822303, 564596295, 563371956, 562156498, 560915649, 559623778, 558321774, 557060778, 555826485, 554554403, 553266525, 552029192, 550823987, 549638987, 548484921, 547311187, 546100199, 544914663, 543773651, 542622328, 541453123, 540327787, 539251983, 538165212, 537035048, 535867631, 534688890, 533536673, 532425523, 531311333, 530144632, 528936982, 527724564, 526517212, 525274098, 524015546, 522832155, 521672428]
3116.4E21672428j262963j372814j396418j366377j360655j381874j409769j431763
3132.8E10689795j409709j355589j374960j498282j572013j543462j515806j471996
3149.1D98947978j406103j448483j567453j621008j612901j613140j631290j597196
3165.4D86450404j531124j549363j610101j601278j568616j602053j630784j596689
3181.7D73760396j556515j541466j549393j566797j587809j598417j583666j571238
3198D61205095j552552j496434j467496j497269j517653j514078j521021j526266j486629
3216.4D47625697j424909j407832j433551j449555j424849j387477j342953j288682
3232.7D36465889j318753j377433j309067j223892j218021j208752j210928j247883
$$ y = [521672428, 520409465, 519036651, 517640233, 516273856, 514913201, 513531327, 512121558, 510689795, 509280086, 507924497, 506549537, 505051255, 503479242, 501935780, 500419974, 498947978, 497541875, 496093392, 494525939, 492904931, 491292030, 489678890, 488047600, 486450404, 484919280, 483369917, 481759816, 480158538, 478589922, 476987869, 475357085, 473760396, 472203881, 470662415, 469113022, 467546225, 465958416, 464359999, 462776333, 461205095, 459652543, 458156109, 456688613, 455191344, 453673691, 452159613, 450638592, 449112326, 447625697, 446200788, 444792956, 443359405, 441909850, 440485001, 439097524, 437754571, 436465889, 435147136, 433769703, 432460636, 431236744, 430018723, 428809971, 427599043, 426351160]
3249D26351160j249016j219332j208454j221031j235038j239807j230448j176625j077027
3267.4D15494382r94086j026451j108587j076132r97633r91017r99540r98348j004159
3285.7D06298429r78798r16421q77619r27150r93878j008272r97424r37611q69990
3304.1C97791266r00238j009584j108467j154513j138091j103758j126647j184404
3320.4C89065564j184911j175940j272052j376391j360744j284480j224339j191378
3336.7C78995329j217395j276851j282781j248389j201362j120686j109392j214892
3353C69323581j233160j138836j100183j112282j114964j076967j033396j081496j187354
3371.4C59244943j178891j065045j005471r78649r49979r26286q92102q17627o96302
$$ y = [426351160, 425102144, 423882812, 422674358, 421453327, 420218289, 418978482, 417748034, 416571409, 415494382, 414500296, 413473845, 412365258, 411289126, 410291493, 409300476, 408300936, 407302588, 406298429, 405319631, 404403210, 403525591, 402598441, 401604563, 400596291, 399598867, 398661256, 397791266, 396891028, 395881444, 394772977, 393618464, 392480373, 391376615, 390249968, 389065564, 387880653, 386704713, 385432661, 384056270, 382695526, 381411046, 380186707, 378995329, 377777934, 376501083, 375218302, 373969913, 372768551, 371647865, 370538473, 369323581, 368090421, 366951585, 365851402, 364739120, 363624156, 362547189, 361513793, 360432297, 359244943, 358066052, 357001007, 355995536, 355016887, 354066908, 353140622, 352248520, 351430893, 350734591]
3389.7C50734591p36266r26882r09150o56455n31644p43955r55731q09819n61863m83960
3410.1C43418866n16593n81771n95868n06103m29153m22240l53545k11387j23233j31816
3430.5C39547157r4771k384q3000k67565k50548o1035R8288J56671J17242J10030J73986
3453C39444071K51681L51280M21703M03106M04656N46813O76244N41985L05385L35037
3473.4C43681961N51880P43717P99089O69629N82426O99699Q13127Q04275Q08388Q62241
3493.8C51016432R42469R59396R33349R96858R70572Q45254R25302J105786J182377
3512.1C59877795J146644J051337J025498J104712J272232J330763J227379J218587
3528.4C69254947J289576J322538J395344J414001J295031J320719J532972J674056
$$ y = [350734591, 349998325, 349071443, 348162293, 347505838, 346974194, 346230239, 345274508, 344464689, 343902826, 343418866, 342902273, 342320502, 341724634, 341218531, 340789378, 340367138, 340013593, 339802206, 339678973, 339547157, 339452386, 339450002, 339367002, 339099437, 338848889, 338787854, 338886142, 339042813, 339160055, 339270085, 339444071, 339695752, 340047032, 340468735, 340871841, 341276497, 341823310, 342499554, 343041539, 343346924, 343681961, 344233841, 344977558, 345776647, 346446276, 347028702, 347728401, 348541528, 349345803, 350154191, 351016432, 351958901, 352918297, 353851646, 354848504, 355819076, 356664330, 357589632, 358695418, 359877795, 361024439, 362075776, 363101274, 364205986, 365478218, 366808981, 368036360, 369254947, 370544523, 371867061, 373262405, 374676406, 375971437, 377292156, 378825128, 380499184]
3544.7C80499184J540125J336216J442314J601994J531988J508832J618922J584321
3561.1C92663896J406103J635224K300352K297014J738071J620770J823544J951605
3577.4D07436579K015204J961857J786858J959055K431751K272307J827449J992434
3593.7D23683494K306342K369702K447576K395332K068132K063453K616852K873838
3610D42824721K685756K380580K074927K620548L169924K283573J290023J714647L762305
3628.4D64807004M303664K727329K406896K647072K642631K581030K116412J619041
3644.7D85851079K315104M267901M306823K177626K004147L149688K815485K076566
3661E08964419J843572J375854J356304K515435K547800J679183L085613L351152J553893
$$ y = [380499184, 382039309, 383375525, 384817839, 386419833, 387951821, 389460653, 391079575, 392663896, 394069999, 395705223, 398005575, 400302589, 402040660, 403661430, 405484974, 407436579, 409451783, 411413640, 413200498, 415159553, 417591304, 419863611, 421691060, 423683494, 425989836, 428359538, 430807114, 433202446, 435270578, 437334031, 439950883, 442824721, 445510477, 447891057, 449965984, 452586532, 455756456, 458040029, 459330052, 461044699, 464807004, 469110668, 471837997, 474244893, 476891965, 479534596, 482115626, 484232038, 485851079, 488166183, 492434084, 496740907, 498918533, 500922680, 504072368, 506887853, 508964419, 510807991, 512183845, 513540149, 516055584, 518603384, 520282567, 523368180, 526719332, 528273225]
3679.4E28273225R58681O75499N81563J767695K909422J912355P34747O09219P17580
3697.7E39139986J046777J596093J153827J87277K73407J526773K551854J425027r9182
3716.1E48801839l86595q7083J99437M33922M71771j18434l73245M77493J716554K051592
3736.5E53187251M70340j180410j39713K095103Q95619m7981J883864J800776j63019
3754.8E58801830l33667O11544N24819j79768n9724L31700Q02934Q69572O557n18799
3775.2E60856998m3929O70493M19855k9743K01345K55287N245k68102l69489j60039
3795.6E61537921l19778J05261J166225L38554J6213P77423k14934j309216o69361
3814E61428308M51267Q6725M39465J259565K3902o02901l93331l52323k85089l51668
$$ y = [528273225, 529231906, 529907405, 530488968, 532256663, 535166085, 537078440, 537813187, 538422406, 539139986, 540186763, 541782856, 542936683, 543123960, 543397367, 544924140, 547475994, 548901021, 548801839, 548415244, 548328161, 548527598, 548961520, 549433291, 549314857, 548941612, 549419105, 551135659, 553187251, 553657591, 552477181, 552337468, 554432571, 555328190, 555280209, 557164073, 558964849, 558801830, 558468163, 559079707, 559604526, 559424758, 559365034, 559696734, 560499668, 561369240, 561375797, 560856998, 560813069, 561483562, 561903417, 561873674, 562075019, 562330306, 562335551, 562067449, 561697960, 561537921, 561218143, 561323404, 562489629, 562828183, 562844396, 563621819, 563406885, 562097669, 561428308, 561879575, 561966300, 562405765, 563665330, 563689232, 563086331, 562693000, 562340677, 562055588, 561703920]
3834.4E61703920K55764J050532N34773J0669j38223r44317j912832j399159J920461
3852.7E61081588L264249k70427j734912r58025L2722J11759m97579J50680Q39770
3871.1E62019825J62423m13597p69913l09169J61767n2691L52025r0241o03617K88606
3891.5E60745418R2328j060129r39250l2126N66482Q25048L86238m30882n83709m96208
3911.9E59073210n39601j56164K64525j2934l19541j07705j18077m65393k47300K57373
3932.3E57628393Q9586l87907n29230l16083J0788q3744k93255q9109J132j78694k22326
3954.7E55629551j81317j74344j08718p9871j58012j81794j41322j27912j30117j09494
3975.1E54236650j13010j90556k09093j24097j11580j48296j14620p0691q0645j46508
$$ y = [561703920, 561959684, 563010216, 563544989, 563555658, 563417435, 562473118, 560560286, 559161127, 561081588, 564345837, 564075410, 562340498, 561382473, 561415195, 561526954, 561029375, 561180055, 562019825, 562182248, 561768651, 560998738, 560689569, 560851336, 560798645, 561150670, 561060429, 560456812, 560745418, 560837746, 559777617, 558838367, 558806241, 559372723, 560197771, 560584009, 560153127, 559569418, 559073210, 558533609, 558377445, 558641970, 558629036, 558309495, 558201790, 558083713, 557618320, 557371020, 557628393, 557717979, 557330072, 556800842, 556484759, 556495547, 556411803, 556118548, 556029439, 556030571, 555851877, 555629551, 555448234, 555273890, 555165172, 555085301, 554927289, 554745495, 554604173, 554476261, 554346144, 554236650, 554123640, 553933084, 553723991, 553599894, 553488314, 553340018, 553225398, 553154707, 553074062, 552927554]
3995.5E52927554k12312
3997.5E52715242
$$ y = [552927554, 552715242]
##END=$$ End of the data block
