##TITLE=T1PP $$ Begin of the data block
##JCAMP-DX=5.00 $$ ACD/SpecManager v 10.08
##SPECTROMETER/DATA SYSTEM=Alpha
##DATE=28 Feb 2014 10:59:46
##DATA TYPE=INFRARED SPECTRUM
##DATA CLASS=XYDATA
##ORIGIN=
##OWNER=
##NPOINTS=1765
##FIRSTX=399.75695801
##LASTX=3997.56933594
##MAXX=3997.56933594
##MINX=399.75695801
##MAXY=0.68625945
##MINY=0.04398564
##XFACTOR=1.0000000000
##YFACTOR=1.000000000000000e-9
##FIRSTY=0.28436080
##DELTAX=2.03957629
##XUNITS=1/CM
##YUNITS=ARBITRARY UNITS
##XYDATA=(X++(Y..Y))
399.8 284360796 294111043 303701222 313926309 324388862 334447742 344425887 354372650 363381088
416.1 363381088 372462779 382105798 390719742 399098575 407309830 414459348 421050787 427704841
432.4 427704841 434338540 440505624 445960194 451093316 456639171 462398291 467474848 471853614
448.7 471853614 476342887 481225073 485577017 489246219 493018001 496971190 500897646 504344821
465 504344821 507189810 510196269 513662934 517033458 519865930 522390246 525152981 528307557 531340659
483.4 531340659 533826888 535934567 538137317 540677249 543165863 545350015 547500312 549782097
499.7 549782097 552027404 553918958 555585623 557486832 559584975 561356723 562561393 563644767
516 563644767 565205455 567079604 568540096 569447637 570596755 572445333 574258983 575461209 576348126
534.4 576348126 577501714 579062700 580494463 581311584 581841886 582843184 584166110 584895670 584837377
552.7 584837377 584688246 585070491 585664988 585769057 585625827 586147904 587457895 588580191 588778794
571.1 588778794 588522375 588766336 589614987 590235651 590310693 590556979 591516495 592583060 592836320 592515111
591.5 592515111 592646301 593385696 593761742 593079209 591828227 590706348 589558005 588036954 586607695
609.8 586607695 586217940 587092698 588329911 588993907 589350700 590361357 592039287 593257189 593479991
628.2 593479991 593630075 594769061 596784413 598724723 600071549 601258516 602816463 604404807 605180740
646.5 605180740 605133712 605146229 605573237 605695605 604910791 603819370 603339851 603387892 603183150 602185130
666.9 602185130 601104677 601249218 601827860 601950347 601507664 601087093 600999773 600711286 599529386 597532809
687.3 597532809 595231533 592430949 588048160 581535637 573756397 565780938 557261527 546737432
703.7 546737432 533659577 519504249 506709933 496452957 487622321 479101181 472494304 471384108
720 471384108 477950186 491589606 510446548 532471538 555529833 577114761 594880462 608358264
736.3 608358264 618620694 626392186 631608665 634603083 636690736 638849080 640690506 641459465
752.6 641459465 641410768 641600072 642445326 643079937 642733991 642071903 642186344 642949045 643303216 642853677
773 642853677 642449081 642905891 643731952 643829405 643138051 642678142 642941535 643165112 642453551 641208112
793.4 641208112 640522540 640454412 640093148 638958454 637636006 636881649 636427164 635319948 633427203
811.7 633427203 631651044 630514801 629310966 627172947 624417126 621936500 619771183 616972506
828.1 616972506 612985790 608389080 603798687 598756611 592278719 583999991 573850095 560540080
844.4 560540080 544334590 531563044 526560128 522973299 512861311 495108724 471449763 442447245
860.7 442447245 406870723 361468017 302930683 236959606 183075309 156190470 152002737 162134558
877 162134558 186480030 226467654 279618800 341712564 407091290 467178196 514945686 549716234
893.3 549716234 574625194 592547297 605701923 616065979 624721110 631645381 636722386 640564442
909.6 640564442 643953443 646880448 648754954 649458289 649623275 649868548 650009215 649490893 648391366
928 648391366 647383571 646798730 646275997 645426869 644385636 643590331 643065631 642255127 640816927 639122128
948.4 639122128 637624145 636153162 634182870 631618202 628902674 626366794 623808324 620789647
964.7 620789647 617246568 613515317 609798312 605849683 601332426 596270978 590938807 585428178
981 585428178 579546869 573197901 566719830 560642719 555055916 549644113 544288814 539290905 534859836
999.4 534859836 530596137 525850654 520381510 514431834 508329093 502156138 495893955 489901394
1015.7 489901394 484831929 481013179 478246182 476196557 474768370 474075317 474048316 474273711 474372208
1034.1 474372208 474218160 473767996 472783685 471007258 468597561 466130406 464148164 462785184 461971909
1052.4 461971909 461798251 462444514 463794619 465281576 466241121 466427535 465920657 464619398 462166846
1070.8 462166846 458532244 454337597 450322926 446767122 443611592 441227794 440364778 441421479
1087.1 441421479 444292217 448372334 452702284 456371248 458755434 459619582 459300041 458624482 458362609
1105.4 458362609 458655596 459122092 459470272 459758878 460019052 459905475 459073752 457694501 456250936
1123.8 456250936 454935819 453548431 451865405 449928731 447920531 445840150 443488747 440815389
1140.1 440815389 438184679 436081856 434570611 433354050 432273209 431402802 430801988 430336118 429885000
1158.5 429885000 429653972 429944754 430778474 431854039 432785064 433502436 434272915 435193062 436056018
1176.8 436056018 436727315 437216133 437427551 437108487 436059505 434341341 432244301 429968268 427468389
1195.2 427468389 424690306 421784699 419016659 416444957 413882703 411168993 408285320 405240953
1211.5 405240953 402004838 398501337 394694805 390744567 386801153 382814497 378685772 374431461
1227.8 374431461 370195508 366111785 362124741 358117074 354153961 350375950 346797377 343310773
1244.1 343310773 339872986 336502671 333208293 329949468 326636374 323244244 319838524 316493958
1260.4 316493958 313188046 309811801 306296080 302717358 299125195 295480311 291734427 287874758
1276.8 287874758 283968508 280065298 276106060 272002697 267781496 263507336 259195209 254762769
1293.1 254762769 250190675 245572105 240979627 236413285 231839493 227279112 222750813 218292654
1309.4 218292654 213881999 209488332 205144241 200821787 196469232 192105353 187698290 183198243
1325.7 183198243 178665265 174159423 169744119 165449470 161138713 156573832 151875854 147408992
1342 147408992 143133879 138826191 134466246 130130425 125861421 121664032 117556073 113607481 109701924
1360.4 109701924 105684228 101824902 98289862 94828352 91467105 88198461 84911250 81858926
1376.7 81858926 79082347 76421484 73879249 71468040 69062740 66698663 64491101 62208679
1393 62208679 59749078 57387281 55136498 53036038 51148884 49378123 47874741 46686817 45734312
1411.4 45734312 44990454 44437401 44062946 43985642 44238508 44714935 45377813 46135455 46987951 47894932
1431.8 47894932 48744932 49644407 50674364 51550116 52244700 52837539 53375196 53905487 54374471 54760125
1452.2 54760125 55059433 55419739 56055915 56753773 57353415 58051214 58923285 59775308 60617942 61770316
1472.6 61770316 63293345 64845592 66339977 67851827 69455430 71055412 72699599 74618280
1488.9 74618280 76847114 79011291 81218809 83958991 86953901 89687914 91991961 94450355
1505.2 94450355 98060042 101715468 104777135 107748285 110804170 113979168 117114246 120562531
1521.5 120562531 124137789 127406836 130761966 133925781 136966035 140374497 143481299 146070302
1537.8 146070302 149483129 153746530 157711148 161550537 165276259 169184744 173286229 177465543
1554.1 177465543 181553483 186964542 194343626 200004727 204829708 209873900 215107411 220680252
1570.5 220680252 225465477 229672596 234593630 239253357 243160963 246991023 250768512 254354179
1586.8 254354179 257734567 260947108 263995737 266882807 269577175 272114903 274572700 276988059
1603.1 276988059 279255480 281346023 283353299 285242140 286797076 288136810 289772213 291413367
1619.4 291413367 292775691 294185519 295652926 297067553 298567384 299950272 301171184 302883983
1635.7 302883983 305163741 307358205 309406072 311291456 313457787 316257030 318602622 320993155
1652 320993155 324944586 328611314 331482232 334356636 337620616 341130674 344216794 347360015 351166636
1670.4 351166636 354748160 358252168 362174124 365748405 368709713 371677488 375887990 380283654
1686.7 380283654 383887023 387351334 390380323 393427819 396892816 400447845 404722661 408538282
1703 408538282 411754817 415270060 418518692 421205491 423483431 425715297 428704232 432100862 434776574
1721.4 434776574 437007010 439187855 441080600 442555964 443704486 445401937 447852075 449910432
1737.7 449910432 452012062 454653829 457608968 460756630 463957995 467380464 471009493 474155754
1754 474155754 476864100 479362726 481553614 483894944 486293584 488285631 489937097 491370916 493034154
1772.4 493034154 494883984 496142924 496614903 496528596 496039480 495014846 493372023 491154045 488413751
1790.7 488413751 485771835 483806610 482153744 480735093 480116993 480581969 481803209 483563423 486013502
1809.1 486013502 489389837 493432909 497639894 501915634 506257057 510415435 514304340 518052995
1825.4 518052995 521401763 524578929 527916789 530884445 533314109 535514891 537539840 539286196
1841.7 539286196 541126192 543264449 545255959 547090650 548892260 550540805 552030146 553489506
1858 553489506 555024803 556538403 557795942 558767200 559935868 561650813 563374519 564766467 565986276
1876.4 565986276 567217231 568501472 569742441 570860744 571880460 573001862 574317694 575525045
1892.7 575525045 576522410 577578783 578776419 579979420 581030309 581958354 582923174 584004819 585125208
1911.1 585125208 586071312 586811543 587649703 588757157 589792669 590683103 591627121 592620909 593594313
1929.4 593594313 594447136 595191360 595968366 596835315 597616553 598273277 599034369 599950850 600883305 601730108
1949.8 601730108 602428555 603034377 603692293 604409575 605069935 605619133 606165826 606850445 607692719 608514667
1970.2 608514667 609225929 609959662 610766113 611547172 612217426 612836123 613483310 614157498 614759684 615266562
1990.6 615266562 615846455 616557598 617278993 617911875 618441224 618952274 619544506 620160818 620691299 621137559
2011 621137559 621585011 622083545 622637928 623189449 623685658 624224901 624847770 625434995 625915527 626383841
2031.4 626383841 626936436 627534330 628072202 628520191 628973007 629509985 630090117 630601764 631042957 631527543
2051.8 631527543 632084727 632618666 633082092 633524060 633996665 634510517 635012746 635467350 635917604 636424363
2072.2 636424363 636957288 637446582 637872338 638293624 638771594 639262676 639687181 640049875 640436649 640877306
2092.6 640877306 641320229 641711235 642069578 642458975 642891109 643309116 643626451 643876791 644193470 644590557
2113 644590557 644944727 645208180 645461202 645771801 646108389 646395028 646621883 646854103 647154093 647484124
2133.4 647484124 647762120 647976041 648214459 648534000 648861945 649132490 649373710 649679661 650093019 650512099
2153.8 650512099 650843680 651180506 651615322 652076960 652477205 652841210 653257549 653752148 654263854 654708624
2174.2 654708624 655100822 655533135 656040132 656539202 656945050 657318950 657758653 658247888 658693612 659062207
2194.6 659062207 659433484 659870625 660311341 660690188 661017776 661353946 661747575 662141502 662459910 662738621
2215 662738621 663063049 663432896 663775563 664076149 664390922 664745450 665105283 665415287 665673792 665942490
2235.4 665942490 666259408 666601300 666896880 667164624 667488992 667861342 668221176 668554485 668881834 669221163
2255.8 669221163 669567525 669875860 670151889 670458496 670812190 671162963 671474695 671752334 672046721 672381043
2276.1 672381043 672686875 672958493 673239529 673525393 673767090 673937082 674096107 674297512 674530029 674740613
2296.5 674740613 674904704 675062895 675216675 675305009 675327480 675364792 675495565 675702274 675866604 675912142
2316.9 675912142 675901234 675943375 676067770 676182628 676211059 676299572 676586509 676928878 677136242 677247167
2337.3 677247167 677437246 677784204 678336382 678977251 679186165 678856373 678466320 678368270 678458929 678614318
2357.7 678614318 678890109 679286659 679741144 680233359 680753052 681337118 681934595 682434857 682871759 683352947
2378.1 683352947 683845580 684194565 684380412 684536040 684758484 684985578 685101390 685127079 685217321 685439229
2398.5 685439229 685634911 685668588 685660005 685794830 686021686 686124623 686051965 686002851 686116695 686259449
2418.9 686259449 686236441 686078191 685995698 686073840 686165333 686080933 685861230 685720980 685691059 685568690 685235023
2441.3 685235023 684853971 684614241 684435546 684085310 683490992 682843804 682307363 681726336 680871069 679790318
2461.7 679790318 678713143 677703381 676534295 675011933 673247039 671462893 669657588 667597711
2478.1 667597711 665158451 662531734 659957170 657359421 654520810 651512921 648664296 646136761
2494.4 646136761 643770516 641374707 639040709 636997163 635232747 633479595 631585240 629701793
2510.7 629701793 627999783 626440287 624894679 623406053 622224569 621504545 621129155 620957017 621066391
2529 621066391 621638000 622718632 624134958 625697136 627432764 629480183 631787539 634091020 636231661
2547.4 636231661 638314545 640474737 642573833 644336879 645760894 647106469 648496926 649758101
2563.7 649758101 650693774 651394367 652121544 652901113 653506577 653856695 654133618 654514015 654960573 655290246
2584.1 655290246 655435860 655558825 655806541 656103313 656295717 656385481 656547666 656883955 657242358 657480061
2604.5 657480061 657709777 658115864 658698201 659269452 659744322 660303831 661116779 662069976 662949085 663731098
2624.9 663731098 664563894 665537715 666555285 667447209 668228984 669083655 670056105 671005011 671793938
2643.3 671793938 672469735 673198581 673946202 674515486 674863517 675145030 675493002 675829947 675988436 675977349
2663.7 675977349 675983012 676074982 676105022 676000178 675863206 675790370 675772965 675739765 675651670 675534368 675447702
2686.1 675447702 675400376 675326407 675169051 674968719 674813151 674708188 674570262 674343646 674089193 673876286
2706.5 673876286 673680425 673433006 673126996 672849476 672632575 672379732 672028780 671654224 671352386 671159089
2726.9 671159089 671009600 670780778 670480013 670213163 669999361 669774234 669492126 669179797 668900013 668644786
2747.3 668644786 668364525 668065190 667792499 667541385 667239010 666841984 666404784 666025460 665694892 665305078
2767.7 665305078 664796174 664216578 663689494 663267434 662809134 662197351 661533117 660918951 660297334 659576178
2788.1 659576178 658796787 658051312 657332242 656568646 655734181 654865146 653991044 653123498 652202785 651150823
2808.5 651150823 650038898 648965538 647871792 646658838 645326495 643950582 642575741 641154587
2824.8 641154587 639581323 637793362 635849297 633793235 631527185 628917754 625977814 622714221
2841.1 622714221 618873894 614237726 609220862 604999602 602595448 601944327 602198601 602575243 602779567
2859.5 602779567 602794051 602509260 601798713 600746691 599518299 598202705 596932054 595820487 594776869
2877.8 594776869 593695104 592588127 591455638 590294540 589137256 588020563 586940885 585862994
2894.1 585862994 584816694 583847046 582895875 581873596 580728054 579373598 577612936 575215280 572131395
2912.5 572131395 568688035 565591753 563495338 562580228 562623322 563280880 564255953 565395415 566719532
2930.8 566719532 568214595 569754660 571245492 572671235 574020147 575247586 576322675 577229440
2947.2 577229440 577922106 578388095 578755558 579084873 579325497 579586267 580022931 580662370 581450462 582311928
2967.6 582311928 583210051 584109724 584994614 585887790 586727798 587486327 588254631 589020193 589663148 590151489
2987.9 590151489 590532601 590880215 591260970 591634870 592013001 592461169 592915714 593359113 593838274 594281197
3008.3 594281197 594625354 594964564 595355332 595718384 596019328 596246064 596302152 596186042 596023500 595860660
3028.7 595860660 595653057 595357299 595025420 594695568 594273388 593726814 593132377 592547715 591968477 591356575
3049.1 591356575 590707004 590015590 589284897 588574111 587900400 587190568 586403012 585618556 584956825 584394157
3069.5 584394157 583753586 582960188 582113981 581303298 580535173 579747319 578952193 578260541 577615023 576879501
3089.9 576879501 576078117 575291812 574549079 573778510 572897732 571987450 571134627 570281327 569390535 568478525
3110.3 568478525 567485988 566411495 565380812 564406276 563428164 562458813 561487794 560465515 559367657
3128.7 559367657 558233738 557127714 556025445 554832935 553560972 552327812 551161468 549997449
3145 549997449 548775792 547444761 546048284 544704020 543416202 542090178 540692091 539286852 537914634
3163.4 537914634 536532342 535086453 533575058 532059729 530579925 529096067 527571976 526028156
3179.7 526028156 524485350 522943735 521391273 519820392 518266320 516735315 515176713 513585865
3196 513585865 511997283 510441124 508926094 507404983 505832732 504256427 502742112 501242101 499713421
3214.3 499713421 498181462 496656805 495155752 493658572 492129385 490586340 489054769 487519592
3230.7 487519592 485986263 484492093 483025372 481555879 480070859 478567630 477050632 475534827
3247 475534827 474051505 472616732 471184492 469710559 468225390 466760337 465292126 463798225 462306768
3265.3 462306768 460845947 459416509 458010644 456628263 455285400 453965753 452632815 451315522
3281.6 451315522 450038373 448756814 447461039 446183920 444953203 443732858 442457527 441179812
3298 441179812 439966738 438771963 437528193 436207533 434856117 433538079 432216585 430832386 429386199
3316.3 429386199 427906275 426415801 424898773 423323929 421680629 420004904 418333113 416632593
3332.6 416632593 414884180 413142830 411436975 409718931 407987654 406287700 404627115 403016597
3348.9 403016597 401436239 399859101 398301214 396770269 395269156 393769324 392241776 390753359
3365.3 390753359 389364004 388023645 386635363 385222584 383929193 382801294 381761938 380715579
3381.6 380715579 379660547 378687412 377823561 377019554 376222700 375409812 374636620 373977631 373405993
3399.9 373405993 372830421 372220457 371649534 371163577 370747119 370406389 370142758 369908303 369690955 369535774
3420.3 369535774 369456619 369484395 369644523 369862407 370069683 370375037 370843351 371312410 371711999 372168064
3440.7 372168064 372720450 373369128 374161988 375021189 375883669 376792759 377781928 378856033 380010158
3459.1 380010158 381197006 382382452 383638710 385012299 386399508 387732208 389108598 390559763
3475.4 390559763 392059356 393596798 395145893 396716267 398344815 400031030 401771247 403567612
3491.7 403567612 405333430 407051831 408785790 410569489 412460387 414415479 416297317 418210208
3508 418210208 420276195 422400683 424514592 426609397 428694159 430764019 432894021 435116112 437358409
3526.4 437358409 439660758 442067325 444474250 446882427 449382365 451884687 454351634 456863523
3542.7 456863523 459510267 462288916 465005815 467666954 470486641 473356992 476141930 478979439
3559 478979439 481825650 484430283 487114608 490655571 494573385 497952640 501076877 504371047 507781327
3577.4 507781327 511192441 514510453 517600834 520835578 524853349 528981745 532369852 535704136
3593.7 535704136 539440691 543207765 546986878 550796330 554218054 557410300 561095178 565043211
3610 565043211 568753839 572290897 575552046 579187632 583489716 587093115 589533031 591824710 595755696
3628.4 595755696 600564361 603900313 606670916 609558761 612372339 615110874 617415965 619044065
3644.7 619044065 620840847 624244094 628287494 630668223 632396221 634913623 637259543 638939679
3661 638939679 640435219 641495466 642158985 643519282 645263672 646228373 647982061 650315166 651488781
3679.4 651488781 652201533 652668774 652773261 653496563 655372322 656979799 657710910 658156931 658532143
3697.7 658532143 658988178 659818530 660490930 660449624 660254359 660754919 662090898 662960887 662939906 662775576
3718.1 662775576 662790000 662946582 663214386 663540065 663474977 662976384 662713885 663312137 664555609 664947331
3738.5 664947331 663909137 663165510 664197564 664809108 664460540 665367663 666646779 666680038 666382551
3756.9 666382551 666721523 667212486 667149782 666953206 666909218 667247951 667876363 667950332 667517543 667339325
3777.3 667339325 667725563 668036163 667995632 668097019 668263614 668275893 668098986 667649090 667220950 666820049
3797.7 666820049 666644633 667283297 667582512 667571783 668195665 668285787 667432964 666700780 666765153 666677713
3818 666677713 666668057 667571485 667912900 667671084 667464554 667141020 666792691 666368783 666291893 666962504
3838.4 666962504 667526901 667705476 667773724 667291641 665984333 664614975 665264487 667572856 667942643
3856.8 667942643 666971207 666185141 666020334 666206837 665998518 665922582 666414976 666687012 666657329 666215837
3877.2 666215837 665817916 665855348 665762365 665992796 666203141 665854216 665944636 666170835 665599227 664790154
3897.6 664790154 664450049 664651811 665338397 666037381 666144788 665893734 665571928 665146649 664928138 665100455
3918 665100455 665195584 665014029 664931953 664946795 664724648 664512277 664647400 664838731 664787054 664518535 664219081
3940.4 664219081 664143682 664145410 664057732 664047658 664110541 664173961 664180696 664039195 663840353 663774729 663833022
3962.9 663833022 663826942 663684189 663496971 663380802 663369000 663387477 663346589 663258851 663246810 663329005 663326561
3985.3 663326561 663175285 663048565 663048148 663090050 663091958 663061321
3997.5 663061321
##END=$$ End of the data block
