##TITLE=T1PF $$ Begin of the data block
##JCAMP-DX=5.00 $$ ACD/SpecManager v 10.08
##SPECTROMETER/DATA SYSTEM=Alpha
##DATE=28 Feb 2014 10:59:46
##DATA TYPE=INFRARED SPECTRUM
##DATA CLASS=XYDATA
##ORIGIN=
##OWNER=
##NPOINTS=1765
##FIRSTX=399.75695801
##LASTX=3997.56933594
##MAXX=3997.56933594
##MINX=399.75695801
##MAXY=0.77264947
##MINY=0.40764508
##XFACTOR=1.0000000000
##YFACTOR=1.000000000000000e-9
##FIRSTY=0.65279490
##DELTAX=2.03957629
##XUNITS=1/CM
##YUNITS=ARBITRARY UNITS
##XYDATA=(X++(Y..Y))
399.8 652794898 657781005 661408603 664961398 668744981 672239959 675514042 678482354 680589557
416.1 680589557 682262540 684616566 687327743 689774752 691685081 693275034 695074499 696654260
432.4 696654260 697617769 698660433 700182259 701406956 701958954 702568293 703741848 704984486 705733001
450.7 705733001 706316829 707105219 707729638 708079278 708622575 709601343 710637808 711096346 711167216 711556911
471.1 711556911 712216496 712419271 712387860 712971985 713801801 714043677 714021683 714612722 715725839 716349065
491.5 716349065 716265857 716534317 717315793 717607498 717418671 717706561 718510091 718901575 718643248 718547046
511.9 718547046 718805134 718720078 718281448 718204856 718561828 718714595 718498588 718505621 718992472 719508410
532.3 719508410 719534874 719343066 719554067 719945133 719907641 719570756 719514430 719649553 719452024 719059646
552.7 719059646 718803346 718460619 718049824 717941761 718034506 717973530 717765927 717711926 717821598 717706859
573.1 717706859 717304707 717113316 717260301 717234015 716966093 717153192 717988372 718602121 718559563 718566656
593.5 718566656 719085038 719480157 719151556 718667030 718708038 718720138 717957020 716997147 716831744 717157841
613.9 717157841 717068613 716872394 717557311 718907595 719859421 720260441 720961869 722214460 723226249
632.3 723226249 723558962 724014223 725264728 726543128 726942718 727058053 727790475 728650987 728737652 728324294
652.7 728324294 728371382 728852332 728883564 728425384 728366494 728529334 727586508 726531029 727588832 729265273
673.1 729265273 730340302 730520606 730563998 731342912 732277393 732286632 731663883 731480241 731639266 731069863
693.5 731069863 729568481 728012383 726870835 725428104 722942412 719761431 716390073 712657571
709.8 712657571 708859026 706369996 705864012 706584573 708342850 711931467 717563927 724322855 730785608
728.1 730785608 736188948 740685284 744288087 746688485 748088002 749228299 750502706 751666129
744.4 751666129 752538443 753395438 754362047 755144358 755601883 755920589 756189287 756208420 755885720 755489945
764.8 755489945 755315304 755357683 755582809 756192148 757192850 758172572 758877277 759513080 760181725 760643899
785.2 760643899 760835528 761168957 761904240 762612641 762994766 763491869 764413118 765272915 765571356 765664697
805.6 765664697 766090989 766508877 766327679 765835404 765775263 766024947 765810788 765248358 765138090 765440047
826 765440047 765240192 764289141 763398409 762884319 761910021 759920776 757527769 755191743 751962841
844.4 751962841 747217655 742959857 740554273 737760186 733254910 728712082 724771023 719657600
860.7 719657600 711118639 697162986 674724281 642203391 607184172 582601190 573830247 579888403
877 579888403 599628448 628939509 660723507 689846277 713732600 730894864 741888583 749059081
893.3 749059081 754217625 757983267 760965168 763910651 766796231 769023061 770528316 771758795
909.6 771758795 772641301 772649467 771748364 770443738 768914998 766864657 764391959 762241602 760850370
928 760850370 759948850 759414852 759633422 760696173 761941373 762807846 763459861 764051139 764153779 763423622
948.4 763423622 762232780 761043847 759595275 757486105 755079091 752961218 750987411 748718858
964.7 748718858 746409595 744647443 743293941 741618991 739376605 736930966 734330356 731088817
981 731088817 727178693 723401546 720229626 717207253 713988900 711047411 708798707 706806064 704438090
999.4 704438090 701835990 699478328 697120488 694131672 690567017 687063277 683843136 680595398
1015.7 680595398 677311003 674538255 672570467 670986116 669386208 668008029 667165458 666565895 665811896
1034.1 665811896 665107965 664826751 664707541 664118826 662977397 661797166 660827756 659768462 658538640
1052.4 658538640 657603860 657265902 657277822 657372475 657664716 658257365 658754706 658629596 657901585 657049477
1072.8 657049477 656340003 655646205 654940665 654591501 655096114 656405389 658046246 659988344 662394762
1091.2 662394762 664885640 666876495 668292403 669431329 670350909 670924127 671318173 671841323 672501385
1109.5 672501385 673143566 673840284 674784303 675875962 676785469 677405238 677966535 678611338 679217577
1127.9 679217577 679799795 680489421 681134343 681446850 681357741 680972099 680332065 679394126 678215086 677040815
1148.3 677040815 676060319 675175786 674305856 673674107 673528850 673833430 674505830 675719380 677573204
1166.6 677573204 679744124 681827426 683798313 685876191 688001573 689846992 691307962 692524552
1182.9 692524552 693479955 693926930 693800151 693426788 693070590 692583859 691789567 690888643 690202713 689676285
1203.3 689676285 689065933 688480437 688169837 687940538 687361062 686399043 685385406 684448183 683336854
1221.7 683336854 681948841 680589736 679486096 678395629 677062631 675719321 674644351 673668623
1238 673668623 672499239 671228886 670122027 669167638 668124497 666952252 665878057 664960265 663991153
1256.4 663991153 662867785 661795199 660950959 660198033 659325957 658399820 657567799 656775534 655869365
1274.7 655869365 654834270 653779685 652721822 651602209 650373042 649072468 647725165 646274865
1291 646274865 644654155 642868757 640966952 638971865 636873424 634672284 632424653 630139112 627829492
1309.4 627829492 625443518 622978687 620555878 618233562 615990818 613754153 611422420 608947754
1325.7 608947754 606328309 603498816 600476682 597356796 594190300 590879202 587510169 584370553
1342 584370553 581359923 578172207 574640095 570811272 566859365 562873363 558762372 554480493 549979925
1360.4 549979925 545334220 540874183 536492050 531882465 527249336 522567630 517719269 513129294
1376.7 513129294 508699417 503993809 499035478 494224012 489697963 485282898 480683833 475237250
1393 475237250 468920410 462618917 456384778 450184226 444076836 437914491 432259709 427156895 422318965
1411.4 422318965 417932481 414137721 410850048 408498079 407645077 407867879 408799738 410163760 411918104
1429.7 411918104 413990617 415954232 417996883 420439422 422574401 424225748 425525308 426519692
1446 426519692 427490771 428512186 429282159 429600626 430058897 431729883 433792979 435308933 436719447
1464.4 436719447 438414723 439944595 441148609 442781180 445249051 447912306 450377673 452628434
1480.7 452628434 454803795 456794411 458647311 460907489 463927597 466910183 469687521 473185450
1497 473185450 477443695 481453747 484493971 487336963 492056489 497438252 501849413 505717516 509329557
1515.4 509329557 513026834 516787291 521099806 525767863 530066907 534350216 538152695 541496992
1531.7 541496992 545267522 548712552 551119089 554274142 559153378 564101934 568608880 572540104
1548 572540104 576283813 579946637 583235860 585772276 589189708 595349491 600326419 603696644 606556654
1566.4 606556654 609260440 612277150 614753425 616355240 618330538 620720387 622585595 623884320
1582.7 623884320 624888778 625708938 626256406 626429021 626355231 626265824 626092732 625614285 624848723 624029756
1603.1 624029756 623139322 621992767 620599210 619124234 617417634 615207076 613052964 611653209
1619.4 611653209 610249877 608573973 607155144 605986357 605064213 604170322 602868319 601845324 602325201
1637.8 602325201 603407323 604161441 604440987 604870737 606308579 607650697 608709455 611584127 615162551
1656.1 615162551 617810369 619944453 622284532 625117183 627599657 629842818 632688224 635646522
1672.4 635646522 638692200 642196417 645235896 647323668 649262488 652911782 657294154 660761893
1688.8 660761893 663890958 666501343 668879032 671486080 674450219 678681076 682707250 685848117
1705.1 685848117 689055204 692063332 694430649 696010172 697133601 699047565 702005744 704547763
1721.4 704547763 706370056 707875311 709125698 710023105 710529804 711422861 713262141 714917004 716271102
1739.7 716271102 717716157 719112515 720276892 721262276 722559392 724378645 725990832 727172315
1756.1 727172315 728155017 728987217 729972482 731062949 731792212 732079387 732161045 732688010 733843029
1774.4 733843029 734757960 735069335 735056639 734989047 734825313 734405458 733561754 732415557 731671214 731491208
1794.8 731491208 731219649 730839312 730919003 731549621 732294798 733001292 733864188 735113502 736592293
1813.2 736592293 737970114 739290774 740654945 741766930 742481887 743143857 743849695 744636118 745676398
1831.5 745676398 746633470 747341275 747999668 748439789 748467505 748614669 749378622 750239849 750826538 751271427
1851.9 751271427 751699924 752097428 752409995 752695501 752984107 753096640 752909899 752877295 753494382 754310012
1872.3 754310012 754814982 755077422 755311251 755560160 755774975 755937874 756025612 756114542 756370425 756681561
1892.7 756681561 756896734 757109344 757340968 757539511 757693946 757800460 757866502 757975280 758205950 758399487
1913.1 758399487 758367062 758285224 758409441 758603036 758783162 759029865 759256899 759369195 759380519 759386241
1933.5 759386241 759460628 759528279 759457886 759359121 759476483 759739280 759895325 759917259 759945035 760032773 760105491
1955.9 760105491 760095775 760065615 760107160 760160625 760138631 760150135 760290086 760460675 760544121 760531783 760538280
1978.4 760538280 760604084 760621369 760543346 760469854 760475576 760511935 760521770 760513306 760543585 760616839 760627091 760533094
2002.8 760533094 760454416 760471046 760500193 760444939 760343790 760280609 760269284 760243952 760166347 760123789 760145843
2025.3 760145843 760130405 760047019 759995341 760015666 760013878 759925842 759809673 759767652 759804845 759825885 759796619
2047.7 759796619 759778917 759789288 759771407 759708643 759673715 759702146 759714246 759678900 759670079 759719670 759761751 759748638
2072.2 759748638 759709299 759686351 759708941 759766340 759793520 759764552 759738445 759756744 759778857 759747565 759702206
2094.6 759702206 759721518 759768128 759754241 759694517 759669781 759686828 759675801 759616196 759594917 759654880 759689867
2117.1 759689867 759617567 759531796 759546161 759582341 759523928 759437144 759438396 759499311 759501934 759424388 759394288 759473979
2141.5 759473979 759546757 759536743 759526432 759583354 759629428 759590626 759547591 759612978 759740531 759813368 759829402
2164 759829402 759858787 759935617 760022759 760066628 760105729 760195971 760293186 760356009 760406137 760465026 760536730 760592580
2188.4 760592580 760616660 760644317 760693610 760740340 760755360 760756433 760803163 760877669 760897219 760866582 760868847 760929704
2212.9 760929704 760982096 760971546 760945618 760957122 760973215 760958135 760927081 760927260 760972083 760984778 760925293 760879874
2237.4 760879874 760905087 760932922 760910273 760891497 760920227 760945201 760907590 760834396 760807872 760840476 760854185
2259.8 760854185 760812283 760772049 760785103 760825872 760854006 760861039 760878801 760919869 760938764 760936677 760939896 760918140
2284.3 760918140 760842264 760727584 760595798 760445178 760275245 760090709 759882927 759662628 759432316 759138405
2304.7 759138405 758733273 758241713 757763803 757375479 756968796 756388247 755685210 755065858 754624009 754196167
2325.1 754196167 753634155 753052473 752637923 752337813 752034605 751817644 751737952 751780808 752204299 753195941
2345.5 753195941 753946006 753619134 752326012 750679374 749284208 748423159 748120070 748264909 748840332
2363.8 748840332 749858558 751107752 752330899 753517449 754755259 755958915 756949067 757699549 758293927
2382.2 758293927 758738995 758964658 758978605 758925736 758920372 758911490 758802652 758630514 758532882 758510590 758423090
2404.6 758423090 758244395 758099794 758047104 757968187 757803500 757676125 757630765 757565260 757419229 757230401
2425 757230401 757076561 756963491 756804883 756596863 756433129 756321013 756167769 755941391 755709827 755522549
2445.4 755522549 755355120 755147219 754882097 754622579 754390299 754115701 753778517 753439367 753124297 752773464
2465.8 752773464 752332807 751837134 751344979 750842869 750275552 749641836 748964429 748261392 747539222 746770084
2486.2 746770084 745942712 745093763 744280457 743518531 742791712 742101371 741454422 740844071 740234256 739607811
2506.6 739607811 739010394 738459766 737900078 737307727 736733079 736242712 735850513 735514164 735249043 735139608
2527 735139608 735183239 735286534 735427797 735665858 736012518 736375809 736680925 736993849 737396538 737815857
2547.4 737815857 738139868 738423884 738758385 739068568 739254177 739355981 739476264 739625633 739707887 739675105
2567.8 739675105 739623785 739638269 739641368 739531815 739380836 739322603 739304602 739181757 738983095 738846004 738778830
2590.2 738778830 738674283 738505602 738353550 738255560 738150954 737991273 737824202 737728834 737680733 737584591
2610.6 737584591 737447500 737369597 737375259 737381399 737331748 737269402 737271726 737313390 737278104 737182736 737129211 737105191
2635.1 737105191 737064719 737000525 736946642 736934900 736904860 736800134 736658454 736546695 736460865 736313939 736088812
2657.5 736088812 735884130 735742390 735591948 735364854 735099971 734891295 734724104 734501183 734242976 734047711
2677.9 734047711 733875871 733600020 733252287 732987940 732815325 732594371 732267857 731957078 731772780 731615245
2698.3 731615245 731348038 731027365 730790675 730622768 730358183 729963541 729614377 729394913 729174614 728854358
2718.7 728854358 728535831 728324473 728133082 727845907 727509379 727241337 727036715 726787746 726473212 726196110
2739.1 726196110 726010323 725814879 725542605 725274861 725068867 724840283 724534214 724227607 723975956 723729193
2759.5 723729193 723411560 723052561 722746849 722487152 722179234 721812308 721483946 721203208 720860660 720445216
2779.9 720445216 720055461 719718337 719352365 718909562 718466699 718070567 717655540 717168987 716642201 716128528
2800.3 716128528 715613365 715037286 714386106 713720679 713060439 712345779 711565018 710761726 709978342 709211886
2820.7 709211886 708413005 707585216 706771672 705951929 705073476 704104662 703035712 701866329 700581431
2839.1 700581431 699157834 697522879 695573688 693401396 691396356 689931273 689020991 688442290 688006222
2857.4 688006222 687597394 687108338 686457276 685648799 684724927 683740020 682776988 681895196 681113839 680395842
2877.8 680395842 679689765 678996682 678312719 677601695 676853299 676105142 675398827 674742997 674137473 673584580
2898.2 673584580 673074961 672591329 672097385 671527863 670793295 669826925 668632925 667306960 666040182
2916.6 666040182 665020287 664332569 663967490 663889289 664032102 664285123 664631248 665114462 665683568 666279972
2937 666279972 666894913 667488754 668026984 668513477 668911815 669174731 669336498 669430912 669445038 669451356 669556201
2959.4 669556201 669789970 670159400 670647919 671234548 671926022 672706544 673513830 674267411 674950242 675595999
2979.8 675595999 676186144 676704347 677185297 677652895 678096652 678485870 678818882 679122806 679382443 679557025
3000.2 679557025 679664314 679757178 679837406 679868937 679860711 679823220 679744482 679638743 679481804 679220259 678866327
3022.6 678866327 678471267 678046286 677573681 677109778 676693857 676227093 675656557 675052226 674469769 673892200
3043 673892200 673265755 672591031 671915829 671238244 670525849 669814110 669143617 668457627 667733967 667058468
3063.4 667058468 666461349 665843606 665142059 664424062 663752735 663135290 662541509 661893725 661174178 660460532
3083.8 660460532 659792840 659124017 658392251 657598436 656815708 656097114 655389130 654640436 653859556 653050542
3104.2 653050542 652249992 651468933 650666356 649882078 649150312 648387194 647521257 646541417 645494759
3122.6 645494759 644492507 643569589 642645836 641675711 640688002 639704764 638754547 637816310 636792958
3140.9 636792958 635663748 634488642 633343339 632293582 631310999 630249977 629035234 627792954
3157.2 627792954 626612186 625431776 624213457 622987568 621770799 620525777 619233787 617924511
3173.5 617924511 616636455 615392208 614157915 612892568 611608744 610317409 609002054 607668042
3189.9 607668042 606325924 604995131 603707016 602408469 601043344 599690020 598398924 597101688
3206.2 597101688 595766485 594456613 593216896 591969132 590630949 589278340 588011384 586780787
3222.5 586780787 585486054 584165812 582942665 581816077 580653727 579371870 578056157 576823413
3238.8 576823413 575634122 574436605 573311567 572238326 571056068 569783807 568595529 567509711
3255.1 567509711 566370845 565137148 563930571 562826216 561781168 560762703 559794188 558797240 557688415
3273.5 557688415 556527078 555387676 554296255 553240657 552208006 551180482 550157249 549233854
3289.8 549233854 548393130 547410309 546236336 545041561 543926358 542909861 541953087 540924847 539713562
3308.2 539713562 538332224 536891103 535511672 534203827 532898247 531562388 530215502 528843582
3324.5 528843582 527343631 525722802 524109840 522549868 521053016 519617915 518103778 516446352
3340.8 516446352 514795423 513185263 511617005 510185838 508732855 507074475 505382240 503838539
3357.1 503838539 502405941 500953496 499457836 498097837 496882558 495533854 493919760 492261887
3373.4 492261887 490815729 489539087 488286167 487018287 485777646 484651744 483688712 482874006 482016414
3391.8 482016414 480880827 479693770 478860557 478253067 477403373 476254761 475205690 474423647 473777890
3410.1 473777890 473166645 472464740 471658736 470963120 470455527 470009774 469618976 469392717 469301283 469184905
3430.5 469184905 469089329 469121575 469061553 468758672 468477190 468412459 468568891 468916476 469238520 469482094
3450.9 469482094 469830185 470299244 470827878 471408814 471969247 472561330 473392844 474373221 475118160 475554049
3471.3 475554049 476071984 476862878 477786183 478727043 479570448 480349779 481291622 482400298 483492315
3489.7 483492315 484538406 485614687 486752063 487857252 488948643 490180910 491381347 492400110
3506 492400110 493541300 494932085 496401250 497793496 499023020 500176370 501453578 503001332 504598379
3524.4 504598379 506015062 507457793 509021103 510615408 512324750 514069915 515611470 517106473
3540.7 517106473 518812239 520736873 522592545 524167180 525838792 527800262 529702842 531496882
3557 531496882 533376694 535087228 536404967 538142443 541021705 543917418 545984566 547885358 550047994
3575.3 550047994 552354932 554670215 556770265 558536768 560647428 563647389 566454709 568538189
3591.7 568538189 570813119 573471308 576108634 578770280 581301928 583307385 585246444 587845325
3608 587845325 590677917 593292892 595646620 597727656 600623608 604240954 606628299 607496202 608670056
3626.3 608670056 612366617 616665244 619072378 621133864 623354018 625445604 627388954 628654420
3642.6 628654420 629117787 630289495 633900166 637800395 639378190 640810549 643365562 645411909
3659 645411909 646692336 647609293 647773743 647815824 649138749 650427878 650979877 653302372 655892134
3677.3 655892134 656795800 657184064 656988204 656453192 657243729 659533560 661097646 661570191 661743045
3695.7 661743045 661790788 662200212 663320899 663911581 663311660 662584722 663157880 665122569 666132748
3714 666132748 665704548 665068448 664731920 664649129 664819658 664962411 664215744 662944138 662476420 663607478
3734.4 663607478 665462792 665543437 663735032 663174927 664882362 665088832 664705038 666728556 668646932
3752.8 668646932 668461680 668071806 668692112 669189870 668895006 668660462 668759882 669459820 670283318 670185328
3773.2 670185328 669566154 669426262 669952273 670140266 669970214 670141995 670359552 670305669 669830501 669081807
3793.6 669081807 668510675 667791963 667736113 668907106 669131637 669264793 670226812 669949889 668438315
3811.9 668438315 667516649 667635024 667325377 667751551 669139326 669161201 668644190 668257475 667806983 667314947
3832.3 667314947 666667521 666758299 667770982 668351114 668573678 668681443 667772412 665510356 663632452
3850.7 663632452 665557384 669126570 669014394 667389870 666377664 666286826 666285992 665731668 666027546 667001009
3871.1 667001009 667347729 667129695 666317880 665958583 666017115 665940166 666513324 666489065 665920675 666350424
3891.5 666350424 666465223 665362000 664360046 664206624 664763629 665847719 666568160 666390657 665955305
3909.8 665955305 665431678 664799750 664664745 665065408 665171266 664899588 664846957 664787114 664377332 664244473
3930.2 664244473 664616942 664768755 664463103 663980842 663628399 663629115 663627028 663507521 663564444 663631618 663549364
3952.7 663549364 663422287 663261592 663093328 663058639 663069308 662900925 662646115 662499189 662433028 662396669
3973.1 662396669 662404835 662373602 662267089 662144244 662015915 661883175 661777854 661729991 661665618 661539257
3993.4 661539257 661437035 661381066
3997.5 661381066
##END=$$ End of the data block
