##TITLE=$$ Begin of the data block
##JCAMP-DX=5.00 $$ ACD/SpecManager v 10.08
##SPECTROMETER/DATA SYSTEM=Alpha
##DATE=13 Jun 2014 08:26:00
##DATA TYPE=INFRARED SPECTRUM
##DATA CLASS=XYDATA
##ORIGIN=
##OWNER=
##NPOINTS=1765
##FIRSTX=399.75695801
##LASTX=3997.56933594
##MAXX=3997.56933594
##MINX=399.75695801
##MAXY=0.74964941
##MINY=0.07254783
##XFACTOR=1.0000000000
##YFACTOR=1.000000000000000e-9
##FIRSTY=0.39172232
##DELTAX=2.03957629
##XUNITS=1/CM
##YUNITS=ARBITRARY UNITS
##XYDATA=(X++(Y..Y))
399.8 391722322 400386393 408738226 418714255 429375798 438741714 447167695 456090838 465138286
416.1 465138286 474413007 483387560 490758926 497854412 504393935 509716630 515347600 521882296
432.4 521882296 527934790 532654285 537279606 542829275 548084199 551819324 555185318 559335232
448.7 559335232 563480854 566365004 568381131 571298599 574710310 576509416 577306449 579150259 582137823
467.1 582137823 584629476 586494327 589036107 592216074 595147669 597507060 599747121 602549553
483.4 602549553 605494916 607808769 609777749 612101912 614555776 616329253 617537737 619043171
499.7 619043171 621026695 622708142 623682380 624473035 625564933 626636028 627287269 627672076 628034592
518.1 628034592 628484905 628969908 629431486 629981041 630592763 631107926 631604373 632222354 633117676 634285867
538.4 634285867 635323703 636073291 636819482 637747109 638569653 638940036 639046550 639184594 639204621 638922632
558.8 638922632 638682723 638917446 639447987 639744878 639696836 639661372 639813244 639961660 640012324 640124798
579.2 640124798 640454650 641066015 641852617 642666519 643442750 644055665 644435227 644761562 645033836 644863725
599.6 644863725 644211292 643462658 642570257 641298413 640133083 639729381 639863670 639964581 640266180
618 640266180 641262531 642602623 643615961 644258261 645090759 646290004 647462845 648498774 649789870
636.3 649789870 651440620 652798891 653355122 653662622 654429674 655172348 655077517 654528320 654350877 654345214
656.7 654345214 653864086 653069615 652636528 652425826 651477456 650396168 650731325 651550114 652105212 652094603
677.1 652094603 651772380 651619256 651418924 650639713 649251401 647574604 645502627 642465651 638115942
695.5 638115942 632597506 626671791 620622694 613211095 603584588 592572868 581665874 572732389
711.8 572732389 567230701 564713836 564223051 566575766 573094249 583820939 597859740 613845468
728.1 613845468 629943311 644448102 656627178 666503251 674043477 679287493 682799339 685404539
744.4 685404539 687452257 688769519 689400554 689812541 690347791 690803289 690851271 690698326 690727711 690892220
764.8 690892220 691029251 691193581 691584289 692198217 692687571 692866921 693032861 693472743 693917155 694012284
785.2 694012284 693882823 693820357 693818033 693708837 693446994 693181992 693156004 693274438 693187416 692864954 692540646
807.7 692540646 692178845 691543698 690564811 689434648 688332736 687122285 685546994 683634639 681675375
826 681675375 679617703 677050054 673786461 670021951 665915966 661230385 655454814 648163259 638460636
844.4 638460636 626396894 616435528 611957192 608755827 601791084 590697408 576085150 557150602
860.7 557150602 531777024 495463699 441215545 369060844 298723072 254227549 238551021
875 238551021 244000480 269731820 315466434 375236243 441632897 507402718 564412177 607126474
891.3 607126474 635672510 654017270 666632295 676295817 683694839 688868046 692552626 695729017
907.6 695729017 698565722 700547516 701637506 702558517 703597486 704078853 703646064 702951491 702632785
926 702632785 702398419 701623321 700520337 699871480 699728012 699346185 698501825 697848380 697715878 697430372
946.4 697430372 696334958 694754124 693290114 691762328 689559162 686717927 683907092 681330442
962.7 681330442 678343177 674552858 670519710 666730821 662661910 657606244 651744246 645667434
979 645667434 639320195 632234693 624605119 617218018 610397398 603778422 597151101 590938926 585581660
997.3 585581660 580704212 575558901 570057631 564582586 559081316 553118408 546742618 540609419
1013.7 540609419 535244405 530596554 526528656 523346722 521387398 520338118 519580662 519081175 519211948
1032 519211948 519910812 520588279 520837128 520786464 520592332 520006180 518858612 517548442 516712725 516659260
1052.4 516659260 517292082 518567204 520620048 523310781 525938869 527718186 528314292 527634442 525460064
1070.8 525460064 521895528 517777681 514038384 510986388 508669257 507730544 508710384 511206686 514633477
1089.1 514633477 518620670 522661269 526117802 528491020 529617608 529887557 530085564 530736268 531794131
1107.5 531794131 533030927 534437180 536072493 537666023 538762808 539289653 539588273 539906263 540138364
1125.8 540138364 540175378 540182710 540176928 539738834 538563550 536797941 534777880 532716513 530635297 528681099
1146.2 528681099 527173817 526189923 525520205 525105774 525189996 526025116 527595460 529752791 532444775
1164.6 532444775 535540342 538634121 541270494 543405890 545372128 547319233 549009860 550167978
1180.9 550167978 550835848 551117718 550847888 549856365 548277438 546405911 544356585 542071223 539625764
1199.3 539625764 537298799 535225630 533282697 531333804 529354751 527308166 525029361 522384286
1215.6 522384286 519456804 516463697 513459444 510324359 507011056 503688931 500536919 497504503
1231.9 497504503 494469285 491474926 488649517 485956460 483229369 480399817 477608830 474910289
1248.2 474910289 472191006 469345570 466382653 463419408 460442364 457347780 454168737 451043695
1264.5 451043695 447954983 444780201 441417903 437942237 434491038 431001037 427330285 423503250
1280.8 423503250 419684142 415826410 411765456 407494277 403168470 398798585 394244432 389443099
1297.2 389443099 384520680 379612088 374660671 369581342 364370823 359203607 354105145 348960310
1313.5 348960310 343778700 338601887 333407909 328149736 322691768 316986501 311173320 305251628
1329.8 305251628 299260467 293313861 287383974 281153828 274580866 268155664 261962771 255691528
1346.1 255691528 249206662 242551938 235829577 229101196 222382501 215789348 209111929 202007711
1362.4 202007711 194994599 188485548 181994647 175559372 169171125 162535220 156176776 150203034
1378.7 150203034 144308537 138626605 133235618 127790615 122450382 117698647 112993106 107906356
1395.1 107906356 102971651 98266296 93917556 90035856 86263284 82896367 80116794 77744074
1411.4 77744074 75785108 74296176 73187292 72547831 72586469 73157571 74061774 75155184 76481678
1429.7 76481678 77935286 79300761 80687262 82164720 83392009 84410571 85325696 86146571 86908333
1448.1 86908333 87594263 88218458 88781543 89423329 90256467 91105595 91941841 92955641 94129197
1466.4 94129197 95268205 96453086 97992696 99839620 101682946 103555910 105539337 107717812
1482.8 107717812 110023163 112581715 115709536 119336702 122830190 126469418 130966216 135750070
1499.1 135750070 140118375 143986657 148318663 154372945 159941331 164438948 168910250 173621222
1515.4 173621222 178556591 183441013 188757479 194008663 198694304 203553826 208183736 212784424
1531.7 212784424 217906311 222461313 226558447 232219994 238641694 244138867 249494389 254901946
1548 254901946 260760009 266909152 273213267 279564887 287919879 298075885 305093408 311390847
1564.3 311390847 318251491 325301290 332498789 338473618 343900532 350199312 355712861 360205859
1580.7 360205859 364720494 369193643 373308301 377066553 380620122 383971840 387006581 389641345
1597 389641345 392067432 394464076 396770656 398771971 400511503 402115762 403536648 404658258 405580372
1615.3 405580372 406496108 407285184 407927275 408437401 408824772 409198910 409667492 410213381 410912842 411926746
1635.7 411926746 413027406 414023250 415124744 416504890 418415606 420648038 422417313 424510390
1652 424510390 427648485 430208892 432457775 435123861 438390672 441940159 445219964 448742896 452794999
1670.4 452794999 456528515 460387707 464556754 468246698 471707106 475714952 480765074 485111117
1686.7 485111117 488740295 492743403 496699393 501018524 505761385 510391712 515472531 519577861
1703 519577861 522973955 526611805 530020416 533147812 536074817 538959503 542187452 545178711 547450244
1721.4 547450244 549600720 551953733 554376841 556842566 559240520 562000155 564846575 567111731
1737.7 567111731 569461048 571981609 574442804 576970994 579516232 582073152 584542453 586684644
1754 586684644 588755071 590818822 592730343 594722569 596558332 598118961 599662244 601183653 602650762
1772.4 602650762 603722036 604166865 604193330 603859186 603081882 601754069 599951327 597973883 595790505
1790.7 595790505 593408704 591333807 589802980 588891268 588824987 589592993 590997696 593026519 595754266
1809.1 595754266 599104464 602682054 606276751 610011160 613792717 617307544 620569885 623779416
1825.4 623779416 626734078 629512191 632103920 634262025 636265993 638272166 640033543 641546309
1841.7 641546309 643224955 645013332 646492779 647779226 649064183 650405347 651765227 653027534
1858 653027534 654209077 655384123 656547904 657662988 658806264 659977674 661034644 662050843 663067758
1876.4 663067758 664050698 665043056 666060209 667024255 667926133 668895006 669917941 670846939 671694040
1894.7 671694040 672529697 673377991 674261808 675104856 675895870 676702261 677542269 678367496 679087400 679741144
1915.1 679741144 680503011 681368530 682118356 682812810 683535576 684258759 684969604 685578704 686133742 686785579
1935.5 686785579 687513888 688162506 688760042 689404488 690055728 690638423 691133261 691617370 692171097 692738295
1955.9 692738295 693211138 693634391 694112301 694668710 695217013 695711076 696241736 696869731 697508514 698057055
1976.3 698057055 698550880 699098647 699698508 700200975 700607359 701049566 701574504 702068567 702435672 702826083
1996.7 702826083 703338742 703844607 704247355 704610586 705012441 705446661 705834389 706150651 706507444 706992626
2017.1 706992626 707446575 707740307 708035052 708434343 708844244 709167063 709449947 709798276 710202277 710559249
2037.5 710559249 710861564 711220503 711653948 712036550 712308884 712591231 712960422 713355899 713696361 713990748
2057.9 713990748 714327335 714718044 715079784 715356350 715609491 715933859 716312647 716632485 716877937 717157722
2078.3 717157722 717519879 717871547 718139350 718408704 718735337 719047904 719284773 719495416 719766855 720075488
2098.7 720075488 720315158 720504522 720773578 721111238 721358180 721459091 721567810 721799910 722064555 722242832
2119.1 722242832 722370625 722544611 722759485 722945273 723076463 723219633 723430812 723650396 723784864 723891497
2139.5 723891497 724099457 724374652 724589229 724745452 724960387 725265503 725557268 725764155 725991666 726346076
2159.9 726346076 726744533 727061391 727323651 727639556 728025734 728392720 728686512 729001701 729404569 729795635
2180.3 729795635 730069816 730313659 730684161 731131196 731486082 731729448 732002854 732372761 732729256 732981920
2200.7 732981920 733194709 733452141 733749688 734004080 734181285 734401464 734731317 735044122 735229075 735385239
2221.1 735385239 735640228 735932171 736124337 736219764 736369371 736586809 736677051 736614287 736604035 736734629
2241.5 736734629 736942589 737187862 737502515 737915099 738360405 738694489 738879025 739096165 739457607 739798188
2261.9 739798188 739973843 740108252 740370035 740717828 740974486 741117835 741316020 741615057 741886497 742033541
2282.3 742033541 742115021 742248833 742393970 742407143 742359519 742436409 742570519 742574692 742434859 742286026 742214322
2304.7 742214322 742107153 741818726 741504371 741408229 741372526 741080940 740561843 740111947 739941061 739870906
2325.1 739870906 739600003 739303172 739324868 739519179 739527822 739387989 739400387 739652455 740181386 741153002
2345.5 741153002 741907120 741616368 740513861 739344835 738528073 738163650 738234460 738563597 739115059
2363.8 739115059 739986897 741114855 742294788 743380070 744427741 745541692 746616602 747480869 748125315
2382.2 748125315 748649061 749050796 749261439 749303639 749321938 749411821 749508560 749533236 749498963 749501169 749585688
2404.6 749585688 749649405 749605179 749543250 749550879 749573708 749531090 749417365 749330401 749302685 749228835 749069810
2427.1 749069810 748911500 748818576 748738766 748571157 748323858 748082519 747857213 747567356 747182488 746779084
2447.5 746779084 746384859 745938241 745391369 744763613 744104266 743399560 742571592 741597593 740554154
2465.8 740554154 739471138 738245070 736774921 735122919 733412385 731640160 729686558 727502346
2482.1 727502346 725202441 722895384 720555186 718132377 715712309 713429749 711294115 709239721
2498.5 709239721 707259655 705439210 703797281 702193379 700555384 698987961 697587907 696316063
2514.8 696316063 695096612 694016576 693246186 692816436 692627192 692642689 692987382 693739772 694789052
2533.1 694789052 695984960 697306931 698806882 700419724 702015042 703577816 705208361 706942558
2549.4 706942558 708608508 710049927 711306274 712468982 713576436 714575052 715410769 716137230 716809094
2567.8 716809094 717382491 717814505 718156338 718497574 718838930 719103634 719300032 719481885 719635606 719729185
2588.2 719729185 719786942 719871461 720011294 720176756 720320821 720439076 720580220 720794797 721043825 721269608
2608.6 721269608 721540034 721943021 722450852 722965717 723480821 724067092 724712193 725347340 725970685 726628542
2629 726628542 727304339 727944255 728541613 729119658 729708552 730303526 730841279 731294930 731703341 732092321
2649.4 732092321 732417226 732618809 732746243 732902467 733068347 733135283 733095050 733037055 733000517 732922256
2669.8 732922256 732757270 732564211 732410252 732270181 732074082 731848598 731659293 731500983 731332541 731106758
2690.2 731106758 730829120 730568945 730329096 730065405 729799569 729549408 729306698 729050338 728750050 728437901
2710.6 728437901 728157699 727876604 727576613 727269530 726931334 726559937 726191700 725867629 725580513 725283623
2731 725283623 724963725 724630952 724294543 723958313 723639429 723325968 722969055 722581506 722230077 721902609
2751.4 721902609 721545160 721187949 720851541 720480740 720061362 719637215 719214201 718780577 718354106 717889190
2771.8 717889190 717350006 716846287 716401875 715916634 715375841 714797199 714163542 713485837 712819159 712171972
2792.2 712171972 711504221 710808694 710115671 709418356 708674610 707896113 707048595 706085026 705125332 704232454
2812.5 704232454 703296602 702284813 701229632 700141668 699018061 697816610 696513355 695124507
2828.9 695124507 693666220 692125678 690434515 688547254 686545432 684399605 681818426 678619266
2845.2 678619266 675090253 671966374 669816077 668508947 667576492 666719496 665857077 664961457 663913727
2863.5 663913727 662616611 661127329 659515142 657873750 656464756 655427456 654566050 653718472 652890503
2881.9 652890503 652057171 651198506 650312781 649404049 648498237 647582531 646693289 645900607 645120442 644250751
2902.3 644250751 643325150 642289877 640920758 639060974 636784852 634405613 632288158 630656123
2918.6 630656123 629593134 629026532 628796577 628760695 628879786 629256964 629907072 630695939 631582975 632598698
2939 632598698 633585274 634382129 635086060 635761321 636252761 636415660 636345506 636220217 636090815 636022985
2959.4 636022985 636124313 636456132 637035847 637832046 638804257 639838398 640805781 641727388 642572165
2977.8 642572165 643274307 643940449 644647300 645302057 645802319 646124899 646368980 646678150 646994174 647209108
2998.1 647209108 647344410 647444248 647578418 647734344 647753596 647599518 647493482 647559285 647621214 647557557
3018.5 647557557 647441864 647264302 646961212 646531522 645995140 645445526 644896090 644276798 643576205 642784655
3038.9 642784655 641961873 641186476 640441298 639675260 638836801 637927949 636987984 636049151 635171592 634332538
3059.3 634332538 633428037 632449985 631487608 630640626 629886389 629096031 628216088 627265811 626290441 625355542
3079.7 625355542 624468803 623623788 622829854 621987045 621053040 620147049 619296670 618415952 617437959 616418242
3100.1 616418242 615454078 614458323 613354445 612280607 611306489 610292912 609143496 607935131 606807292
3118.5 606807292 605782628 604712903 603502631 602220595 600944221 599689245 598428607 597120225
3134.8 597120225 595753968 594357967 592964888 591560900 590129495 588675559 587187529 585686028
3151.1 585686028 584185958 582656324 581081152 579487503 577925026 576363742 574754179 573119879
3167.4 573119879 571459472 569783032 568124771 566461444 564763308 563051403 561359942 559683084
3183.7 559683084 557993233 556281030 554573417 552888811 551190376 549463689 547747552 546061039
3200.1 546061039 544407606 542772889 541124582 539483726 537867188 536234200 534570694 532914698
3216.4 532914698 531299412 529718578 528143108 526566327 525008976 523456156 521865308 520271003
3232.7 520271003 518714130 517159462 515591919 514043510 512528419 511016011 509469151 507878661
3249 507878661 506296456 504779398 503272891 501717865 500145137 498576880 497022122 495489269 493985564
3267.4 493985564 492549598 491148680 489718944 488311201 486964673 485651881 484363675 483081460
3283.7 483081460 481792271 480523795 479332864 478205383 477056444 475885928 474749297 473637313
3300 473637313 472518474 471417844 470320195 469170839 467974514 466746718 465510130 464286387 463069052
3318.4 463069052 461847454 460603625 459281027 457833141 456332117 454886824 453506500 452148378
3334.7 452148378 450779408 449361831 447907180 446511805 445237160 444048017 442895740 441721141
3351 441721141 440481216 439247340 438117772 437078476 436040103 434973687 433947176 433011800 432094723
3369.3 432094723 431076854 430030644 429087162 428226292 427414179 426609963 425826579 425126433 424517363
3387.7 424517363 423991710 423458546 422843993 422241032 421772212 421423227 420999736 420434326 419957072 419650227
3408.1 419650227 419395357 419167519 418989807 418852746 418786466 418771476 418693751 418624133 418733478 419006377
3428.5 419006377 419321090 419677168 420076638 420397878 420644194 420954168 421344697 421843022 422512859 423182547
3448.9 423182547 423781037 424446076 425204754 426091343 427113950 428095460 429023236 430088520 431282520
3467.2 431282520 432399988 433379471 434380084 435488373 436745554 438128293 439480633 440736800
3483.6 440736800 442005634 443394661 444849670 446275562 447713017 449254543 450824052 452364594
3499.9 452364594 453967333 455589265 457132071 458726972 460446239 462202787 463949978 465667725
3516.2 465667725 467369556 469114631 471047044 473086596 475040704 476997793 479025126 481031328
3532.5 481031328 483087838 485300481 487479985 489557385 491759479 494201541 496638030 498855591
3548.8 498855591 501122355 503586471 505960345 508237183 510656774 513145089 515478075 518040419
3565.1 518040419 521409512 524693966 527169764 529534042 532215238 535058379 537952006 540778458
3581.5 540778458 543440163 546394050 550082803 553479254 556016207 558715284 561874270 565014124
3597.8 565014124 568141043 571204841 573889673 576585948 579966724 583469152 586550653 589411318
3614.1 589411318 591930270 594907761 598600924 601451337 603298426 605488181 609896421 614892006
3630.4 614892006 617668033 619932294 622604072 625309944 627975583 630217612 631910622 634243965
3646.7 634243965 638648629 642929494 644503534 645692170 648360550 650786281 652311981 653737664
3663 653737664 654886961 655996382 658354759 660840333 661907315 664173663 666869342 667580426 667802155
3681.4 667802155 668012738 668122947 669286489 671592116 672730386 672536254 672361851 672543287 673222721
3699.8 673222721 674626350 675729990 675893724 676251829 677815914 680063963 681013525 680655301 680333555
3718.1 680333555 680476606 680918217 681468666 681925535 681744456 681272209 681684554 683244526 684866309
3736.5 684866309 684892416 683280110 682482481 684291363 685257077 684749603 685953200 687166333 686385512
3754.8 686385512 685560107 685993135 686499238 686107039 685815871 685995281 686548471 687167346 686940730 686285317
3775.2 686285317 686255813 686943054 687224090 686967909 687007546 687076390 686936200 686720490 686420619 686369717
3795.6 686369717 686251700 686286747 687367618 687613964 687259197 687876284 687739134 686482728 685821414
3814 685821414 686529100 686896980 687154233 688205719 688017368 687228739 686829150 686492264 686338603 686150432
3834.4 686150432 686375439 687471807 688066423 687825084 687439144 686594546 685058415 683871150 685600340
3852.7 685600340 688714743 688409388 686606526 685588241 685724258 686140776 685751617 685728550 686523080
3871.1 686523080 686684906 686281323 685438037 685023487 685390830 685382605 685636878 685642838 684980571 685214281
3891.5 685214281 685443997 684477210 683635414 683746874 684320211 685121834 685570896 685075581 684331477 683814228
3911.9 683814228 683349192 683255017 683661759 683828294 683518171 683328509 683289587 683010519 682855368 683084726
3932.3 683084726 683099508 682673514 682200193 681940973 682037592 682148457 681996226 681964457 681996763 681817174
3952.7 681817174 681625962 681525230 681361735 681208909 681178153 681076765 680879295 680761874 680714428 680668592
3973.1 680668592 680637538 680571556 680434883 680326343 680291474 680239797 680116594 679992616 679933548 679897368 679857910
3995.5 679857910 679797947
3997.5 679797947
##END=$$ End of the data block
