##TITLE=$$ Begin of the data block
##JCAMP-DX=5.00 $$ ACD/SpecManager v 10.08
##SPECTROMETER/DATA SYSTEM=Alpha
##DATE=13 Jun 2014 08:26:00
##DATA TYPE=INFRARED SPECTRUM
##DATA CLASS=XYDATA
##ORIGIN=
##OWNER=
##NPOINTS=1765
##FIRSTX=399.75695801
##LASTX=3997.56933594
##MAXX=3997.56933594
##MINX=399.75695801
##MAXY=0.75124300
##MINY=0.07262967
##XFACTOR=1.0000000000
##YFACTOR=1.000000000000000e-9
##FIRSTY=0.39237568
##DELTAX=2.03957629
##XUNITS=1/CM
##YUNITS=ARBITRARY UNITS
##XYDATA=(X++(Y..Y))
399.8C92375678R006858Q554607R891361J0514975R357691Q591026R148657R371162
416.1D66812015R498506Q433760O949931P234693O576180N168915N419075O274820
432.4E22367895O068349N203247M925787N235493M824162L588497L361226M135787
448.7E59710443M081190K807259K053380L040493L381133J648843P31111J616358K652586
467.1E81722796K656460K229035K459645L043294K980173K324342K194822K783477
483.4F02394044K927959K331138J785457K062917K578139K194703J429498J360893
499.7F19064748J744271J576602J019478P99954R77516J028895O99461M87566N85198
518.1F27983689O08802L49105J59561M07100P42972O62267M33743N28455R05454J129985
$$ y = [392375678, 401382536, 409937143, 419828504, 430343479, 439701170, 448292196, 457440853, 466812015, 476310521, 484744281, 491694212, 498928905, 505505085, 510674000, 516093075, 522367895, 528436244, 533639491, 538565278, 543800771, 548624933, 552213430, 555574656, 559710443, 563791633, 566598892, 568652272, 571692765, 575073898, 576722741, 577453852, 579070210, 581722796, 584379256, 586608291, 589067936, 592111230, 595091403, 597415745, 599610567, 602394044, 605322003, 607653141, 609438598, 611501515, 614079654, 616274357, 617703855, 619064748, 620809019, 622385621, 623405099, 624205053, 625182569, 626211464, 626910925, 627398491, 627983689, 628592491, 628941596, 629101157, 629508257, 630251229, 630913496, 631347239, 631875694, 632781148, 633911133]
538.4F33911133R66072P45714Q48531J038850Q17001L30984P6890J21772R1017j76788
558.8F38771176k29716R1195L62694L11613O2347j29759j30773j1742R2626K37524
579.2F39427185M79758P55429Q66234P27714O02364N77569M67599L65614K84195p8082
599.6F44475579n34057p66039j052976j379192j114070l43979R0659P5817L09289R40263
620F40701294J323283J116991P33018Q55565J250744J184701R10104J138270J631736
638.4F50845706J454473O43849L33608O64115N73694j36256m41670P152J44243m77850
658.8F53611064q95023n20587k11478q96871j088261L34322Q19504M72129o2824l06546
679.2F51255429j93656k48313p86245j473665j797557k039849k927006m325807n521834
$$ y = [633911133, 634877205, 635622919, 636471450, 637510300, 638327301, 638658285, 638735175, 638856947, 638947964, 638771176, 638541460, 638632655, 638995349, 639306962, 639369309, 639239550, 639108777, 639097035, 639189661, 639427185, 639906943, 640662372, 641528606, 642256320, 642858684, 643436253, 643903852, 644269466, 644553661, 644475579, 643941522, 643175483, 642122507, 640743315, 639629245, 639285266, 639375925, 639451742, 639761031, 640701294, 642024577, 643141568, 643874586, 644730151, 645980895, 647165596, 648075700, 649213970, 650845706, 652300179, 652944028, 653277636, 653941751, 654515445, 654379189, 653937519, 653944671, 654088914, 653611064, 652716041, 652195454, 651983976, 651087105, 649998844, 650333166, 651152670, 651624799, 651561975, 651255429, 651061773, 650813460, 650027215, 648553550, 646755993, 644716144, 641789138, 637463331, 631941497]
697.5F31941497n905926o041109p415355r640515j0980010j0795414q880436n553663
713.8E66729069k555490m98950K348780O499708J0716677J4097333J6018092J6029954
730.2F29385173J4448703J2208461R893418P466674N187511L540874K618908J994014
746.5F86743736J222730N89788N30481O74129M45962l3260k12133P9453L42727K31266
766.9F90614879P4864K58684N25295M63129K46107K52187M53294M65035J79529q9824
787.3F93443179r1791k6107j32561k51472j82688J3590R4593q6129l17216k97308k65777
809.7F91900313n75841j031696j202166j097262j120389j488328j920461k059103k183616
828.1F79221451k626776l246248l731191m081428m689873n804956p278859r622097
$$ y = [631941497, 626035571, 619994462, 612579107, 602938592, 591958582, 581163168, 572282732, 566729069, 564173579, 563674629, 566023409, 572523117, 583239794, 597337127, 613355219, 629385173, 643833876, 656042337, 665935755, 673402429, 678589940, 682130814, 684749722, 686743736, 687966466, 688556254, 689086735, 689760864, 690206826, 690173566, 689961433, 690040886, 690383613, 690614879, 690689743, 690948427, 691473722, 691936851, 692182958, 692435145, 692888439, 693353474, 693533003, 693443179, 693351388, 693325281, 693192720, 692941248, 692758560, 692772150, 692866743, 692780614, 692463398, 692166090, 691900313, 691324472, 690292776, 689090610, 687993348, 686872959, 685384631, 683464170, 681405067, 679221451, 676594675, 673348427, 669617236, 665535808, 660845935, 655040979, 647762120, 638140023]
844.4F38140023j1984647r941995m525065l260136o985366j1099517j4587164j8860102
860.7E56896031k5312364l6302984n4261357p2118461p0218205m4396609j5659392
875B38626659N454227K5763169M5761049N9778303O6422760O5810353N7006657M2629778
891.3F07252955K8466821J8362522J2649060R644031P378101N167544L680349L213167
907.6F95814550K863407J927197J043439R08613R93192M58241l92020o63280l40045
926G02613294k81870p81894j055419o10173j37925l86477q51095o90460j96755l10957
946.4F97310269j069725j567602j473665j520515k191066k846957k822458k601803
962.7F81216478k999842l760755m031718l814459m042625m998207n844831o103576
$$ y = [638140023, 626155376, 616213381, 611688316, 608428180, 601442814, 590343297, 575756133, 556896031, 531583667, 495280683, 441019326, 368900865, 298682660, 254286051, 238626659, 244080886, 269844055, 315605104, 375383407, 441806167, 507616520, 564623177, 607252955, 635719776, 654082298, 666731358, 676375389, 683753490, 688921034, 692601383, 695814550, 698677957, 700605154, 701648593, 702557206, 703550398, 704008639, 703616619, 702953339, 702613294, 702331424, 701549530, 700494111, 699883938, 699746013, 699359536, 698508441, 697817981, 697621226, 697310269, 696240544, 694672942, 693199277, 691678762, 689487696, 686640739, 683818281, 681216478, 678216636, 674455881, 670424163, 666609704, 662567079, 657568872, 651724041, 645620465]
979F45620465o343782p052362p632911p397652o803870o609618o628573o203652n347490
997.3E85600555m865706n129337n495012n466044n482614n993188o452798o128967
1013.7E40586889n280018m607201m089474l229261k000332j053869p15256m68850R0062
1032E19232690O56724O77586K41458q5771k34306o02364j114011j241267p96139o9678
1052.4E16664922O02782J265585K064109K719581K641738J781642O10054o97494k208829
1070.8E25444090l575623m147350l798366l065884k251446q62241R85265K459466L426850
1089.1E14614761L989518L998160L426254K388417J145363K77996K05398O38783J005113
1107.5E31689763J195312J442790J704991J643240J122773N33998K97546L02374J92285
$$ y = [645620465, 639276683, 632224321, 624591410, 617193758, 610389888, 603780270, 597151697, 590948045, 585600555, 580734849, 575605512, 570110500, 564644456, 559161842, 553168654, 546715856, 540586889, 535306871, 530699670, 526610196, 523380935, 521380603, 520326734, 519611478, 519142628, 519232690, 519889414, 520567000, 520808458, 520722687, 520488381, 519886017, 518772006, 517530739, 516734600, 516664922, 517267704, 518533289, 520597398, 523316979, 525958717, 527740359, 528350413, 527652919, 525444090, 521868467, 517721117, 513922751, 510856867, 508605421, 507743180, 508728445, 511187911, 514614761, 518604279, 522602439, 526028693, 528417110, 529562473, 529840469, 530045867, 530684650, 531689763, 532885075, 534327865, 536032856, 537676096, 538798869, 539332867, 539630413, 539932787, 540125072]
1125.8E40125072o378j4603r239m28140j166820j750827j988769k045154k078295j938879
1146.2E28697968j485765r59278o62267m67539K9326Q45373J593232K152025K700985
1164.6E32444060L133535L088176K578259K084017J935184J936674J706421J197577
1180.9E50103903O89983K62618k95400j006604j577496j851320k029002k287924k472461
1199.3E39536297k343297k065122j939535j971006k011180k041579k226889k606928
1215.6E22330761k935886l013790l018081l141523l300368l301204l154039l057331
1231.9D97408539l044903k963364k785832k695680k750188k824545k773761k685071
1248.2D74885195k720177k871602k987981k978832k975821l080339l194332l153234
$$ y = [540125072, 540118694, 540104091, 540094852, 539666712, 538499892, 536749065, 534760296, 532715142, 530636847, 528697968, 527212203, 526252925, 525590658, 525123119, 525152445, 525997818, 527591050, 529743075, 532444060, 535577595, 538665771, 541244030, 543328047, 545263231, 547199905, 548906326, 550103903, 550793886, 551056504, 550761104, 549754500, 548177004, 546325684, 544296682, 542008758, 539536297, 537193000, 535127878, 533188343, 531217337, 529206157, 527164578, 524937689, 522330761, 519394875, 516381085, 513363004, 510221481, 506921113, 503619909, 500465870, 497408539, 494363636, 491400272, 488614440, 485918760, 483168572, 480344027, 477570266, 474885195, 472165018, 469293416, 466305435, 463326603, 460350782, 457270443, 454076111, 450922877]
1264.5D50922877l077925l146559l349334l470540l458589l525049l713876l835767
1280.8D23345238l795147l822207m037261m287035m345655m366428m559398m824221
1297.2C89307886m953444m928350m928559n026281n180687n178064n116105n150616
1313.5C48845780n167157n142211n181253n278349n462766n691141n820066n940318
1329.8C05162519n996823n942434n922675o220401o556600o409466o196082o292373
1346.1B55625665o493851o643951o719455o745279o728456o588071o674707p084578
1362.4B01947317o989643o521345o518602o446913o384894o624743o344781n972266
1378.7A50144130n906358n684868n367979n410895n320169m741564m695386n083390
$$ y = [450922877, 447844952, 444698393, 441349059, 437878519, 434419930, 430894881, 427181005, 423345238, 419550091, 415727884, 411690623, 407403588, 403057933, 398691505, 394132107, 389307886, 384354442, 379426092, 374497533, 369471252, 364290565, 359112501, 353996396, 348845780, 343678623, 338536412, 333355159, 328076810, 322614044, 316922903, 311102837, 305162519, 299165696, 293223262, 287300587, 281080186, 274523586, 268114120, 261918038, 255625665, 249131814, 242487863, 235768408, 229023129, 222294673, 215706602, 209031895, 201947317, 194957674, 188436329, 181917727, 175470814, 169085920, 162461177, 156116396, 150144130, 144237772, 138552904, 133184925, 127774030, 122453861, 117712297, 113016911, 107933521]
1395.1A07933521m943356m709229m338733l876210l772050l368005k787806k362601
1411.4G7775531j927697j476854j120344o20968P9438N61893Q76374J106501J327276
1429.7G6581150J404643J343660J429245J525618J248628J024641Q94927P97525P70569
1448.1H7020606P08297O34841N58384O26803Q40857Q57815Q18506J009375J196422
1466.4I4271906J144178J176946J565441J895108J845024J842223J972944K175689
1482.8A07889459K307415K593107L152624L626585L511816L668405M511312M775420
1499.1A36036143M355341L864974M333853O021172N532399M520327M478156M639626
1515.4A73781991M868895M896074N376026N295754M694641M864320M623577M587859
$$ y = [107933521, 102990165, 98280936, 93942203, 90065993, 86293943, 82925938, 80138132, 77775531, 75847834, 74370980, 73250636, 72629668, 72709106, 73270999, 74147373, 75253874, 76581150, 77985793, 79329453, 80758698, 82284316, 83532944, 84557585, 85452512, 86250037, 87020606, 87728903, 88363744, 88922128, 89548931, 90389788, 91247603, 92066109, 93075484, 94271906, 95416084, 96593030, 98158471, 100053579, 101898603, 103740826, 105713770, 107889459, 110196874, 112789981, 115942605, 119569190, 123081006, 126749411, 131260723, 136036143, 140391484, 144256458, 148590311, 154611483, 160143882, 164664209, 169142365, 173781991, 178650886, 183546960, 188922986, 194218740, 198913381, 203777701, 208401278, 212989137]
1531.7B12989137N157873M631891M138425N631030O339952N442799N361571N446673
1548B55139351N914271O203145O322890O332010Q323997J0165811P028282O277799
1564.3C11707556O839425P036507P181763N975843N449116O324500N521178M501164
1580.7C60537052M516483M429072M067838L752202L538161L315628L043562K689183
1597C89889181K444774K359360K269089J974106J683623J538187J386732J101613Q60691
1615.3D05507356Q19355P44879O14584M65035L91007M27097M97788N16355O34879R52035
1635.7D11570370J090437J055956J185477J421928J896739K198846J735180K072782
1652D24227715L226965K680540K291382K665430L294766L606707L310114L546923M101485
$$ y = [212989137, 218147010, 222778901, 226917326, 232548356, 238888308, 244331107, 249692678, 255139351, 261053622, 267256767, 273579657, 279911667, 288235664, 298401475, 305429757, 311707556, 318546981, 325583488, 332765251, 338741094, 344190210, 350514710, 356035888, 360537052, 365053535, 369482607, 373550445, 377302647, 380840808, 384156436, 387199998, 389889181, 392333955, 394693315, 396962404, 398936510, 400620133, 402158320, 403545052, 404646665, 405507356, 406326711, 407071590, 407686174, 408151209, 408542216, 408969313, 409467101, 409983456, 410618335, 411570370, 412660807, 413716763, 414902240, 416324168, 418220907, 420419753, 422154933, 424227715, 427454680, 430135220, 432426602, 435092032, 438386798, 441993505, 445303619, 448850542, 452952027]
1670.4D52952027L773272L868044M177183L707349L446668L965646N089432M461796
1686.7D85441417L711402M051417L962666M288882M704237M593611N092263M146635
1703E19992530L413499L669142L448725L150106K941489K878785L220022L044843K345562
1721.4E48104703K187491K372205K438426K450288K359211K728820K836227K259910
1737.7E67737281K379001K600550K500892K479613K476155K549112K527833K198160
1754E87448597K088904K064288J905084J997351J870990J598179J540065J462400J425028
1772.4F03400886J084030M36961l159l18646p16686j285553j811385k032996k244115
1790.7E96509337k375781k016962j497209q94308l1948P91490J398325K017856K728820
$$ y = [452952027, 456725299, 460593343, 464770526, 468477875, 471924543, 475890189, 480979621, 485441417, 489152819, 493204236, 497166902, 501455784, 506160021, 510753632, 515845895, 519992530, 523406029, 527075171, 530523896, 533674002, 536615491, 539494276, 542714298, 545759141, 548104703, 550292194, 552664399, 555102825, 557553113, 559912324, 562641144, 565477371, 567737281, 570116282, 572716832, 575217724, 577697337, 580173492, 582722604, 585250437, 587448597, 589537501, 591601789, 593506873, 595504224, 597375214, 598973393, 600513458, 601975858, 603400886, 604484916, 604921877, 604918718, 604600072, 603883386, 602597833, 600786448, 598753452, 596509337, 594133556, 592116594, 590619385, 589725077, 589693129, 590484619, 591882944, 593900800, 596629620]
1809.1E96629620L350019L573179L606081L762126L801286L513575L258050L207624
1825.4F24701560K931118K749323K602637K189398K024412K012551J741946J477659
1841.7F42430604J653730J793564J523256J337826J298011J309633J331389J279712
1858F53957725J216888J186848J161515J105071J125037J170993J080155J047194J029432
1876.4F64080858R60946R58383J019955J007378Q95024R07957J002908R37402Q48949
1894.7F72619760Q41141Q43167Q88646Q78870Q13961Q02219Q41677Q37207P25389O53863
1915.1F80745900P60495Q56638P30872O82772P41720P55548P29323O16073N56112O39379
1935.5F87814832P10308O41883N97954O54637O81579O09220M86314M57763N38886N52833
$$ y = [596629620, 599979639, 603552818, 607158899, 610921025, 614722311, 618235886, 621493936, 624701560, 627632678, 630382001, 632984638, 635174036, 637198448, 639210999, 640952945, 642430604, 644084334, 645877898, 647401154, 648738980, 650036991, 651346624, 652678013, 653957725, 655174613, 656361461, 657522976, 658628047, 659753084, 660924077, 662004232, 663051426, 664080858, 665041804, 666000187, 667020142, 668027520, 668922544, 669830501, 670833409, 671770811, 672619760, 673460901, 674304068, 675192714, 676071584, 676885545, 677687764, 678529441, 679366648, 680092037, 680745900, 681506395, 682363033, 683093905, 683776677, 684518397, 685273945, 686003268, 686619341, 687175453, 687814832, 688525140, 689167023, 689764977, 690419614, 691101193, 691710413, 692196727, 692654490, 693193376, 693746209]
1955.9F93746209M58300M28021M92275N62429N55695N06997N23924O19293O48439N55098
1976.3F99096680M96089N37932N77390M85242M05728M59135N46098N21600L91007L79025
1996.7G03895926M75288M88043M07159L74794M26531M54783L83377L14773L66449M74334
2017.1G08061457M51326K96950K69473L85046M12703L15249K83360L59058M18961L89159
2037.5G11642742L20435L29375L90649L79264L03030L07262L61920L63886L27587L07620
2057.9G15033770L48270L95238L73006K94983K76387L48866L67165K78532K37942L14891
2078.3G18269050L85225L34799K52128K78592L41237L10897J97292J69515K84911L65316
2098.7G21188962K92957J90080K10404K84254K66731J70052J42455K23577K58685J66237
$$ y = [693746209, 694204509, 694632530, 695124805, 695687234, 696242929, 696749926, 697273850, 697893143, 698541582, 699096680, 699592769, 700130701, 700708091, 701193333, 701599061, 702058196, 702604294, 703125894, 703516901, 703895926, 704371214, 704859257, 705266416, 705641210, 706067741, 706522524, 706905901, 707220674, 707587123, 708061457, 708512783, 708809733, 709079206, 709464252, 709876955, 710192204, 710475564, 710834622, 711253583, 711642742, 711963177, 712292552, 712683201, 713062465, 713365495, 713672757, 714034677, 714398563, 714726150, 715033770, 715382040, 715777278, 716150284, 716445267, 716721654, 717070520, 717437685, 717716217, 717954159, 718269050, 718654275, 718989074, 719241202, 719519794, 719861031, 720171928, 720369220, 720538735, 720823646, 721188962, 721481919, 721671999, 721882403, 722166657, 722433388, 722603440, 722745895, 722969472, 723228157, 723394394]
2119.1G23394394R7632J66357K53260K20954J11521J01924K12907K44499J37627J09494
2139.5G25050569K13623K68280K23458J74880K17974L09944K95937K07067K41637L69489
2159.9G27572858M02689L12448K48015L20852M20451L71575K50876K89857M24624M30465
2180.3G31044710K98619K38478L49820M37081L59296K48731K76506L76761L61561K43724
2200.7G34235287K08854K78116L05831K39313J80542K35081L22759L03447K20418K09749
2221.1G36739397K65658K84970K14517J40786J52767J62899N1737p7307j0967J68025
2241.5G38092482K55227K49565K73585L80516M60267L69847K02477K21431L73304L56376
2261.9G41235077J81497J27911K50816L51608K85924J69694K00510K86043K62618J69218
$$ y = [723394394, 723492026, 723658383, 723911643, 724132597, 724244118, 724346042, 724558949, 724803448, 724941075, 725050569, 725264192, 725532472, 725755930, 725930810, 726148784, 726458728, 726754665, 726961732, 727203369, 727572858, 727975547, 728287995, 728536010, 728856862, 729277313, 729648888, 729899764, 730189621, 730614245, 731044710, 731343329, 731581807, 731931627, 732368708, 732728004, 732976735, 733253241, 733630002, 733991563, 734235287, 734444141, 734722257, 735028088, 735267401, 735447943, 735683024, 736005783, 736309230, 736529648, 736739397, 737005055, 737290025, 737504542, 737645328, 737798095, 737960994, 738012731, 737935424, 737924457, 738092482, 738347709, 738597274, 738870859, 739251375, 739711642, 740081489, 740283966, 740505397, 740878701, 741235077, 741416574, 741544485, 741795301, 742146909, 742432833, 742602527, 742803037, 743089080, 743351698, 743520916]
2282.3G43520916J04069J19567J43945L6478o8366K6047J22666J4365j25468j02341
2302.7G43791878l1233j11460k86401k92241r9421j8894k39492n06222m27067r2328
2323.1G41687119j252k35259k95758k027J74522M0532q1063p689J90258N36740R73702
2345.5G42979825O99222k97904j041472j115799q32200m14789J13368M60982O02782
2363.8G41154015Q00431J011312J080215J061737J065970J084447J021743Q49902O60241
2382.2G49790013N29766L71933J69635M4226M9830J08301R3580m77n5492M77Q3268
2404.6G51185060N7935m7862p6175n901M1783j0848r0301p3791k8193q0227j55449
2427.1G50716031j36316q7202j16825k02835k47061k24888k12968k80380l79622m03344
$$ y = [743520916, 743624985, 743744552, 743888497, 743924975, 743856609, 743882656, 744005322, 744019687, 743894219, 743791878, 743760645, 743649185, 743362784, 743070543, 742971122, 742952228, 742712736, 742206514, 741779447, 741687119, 741685867, 741450608, 741154850, 741152823, 741327345, 741367877, 741286814, 741279125, 741469383, 742006123, 742979825, 743679047, 743381143, 742339671, 741223872, 740391672, 739976883, 740090251, 740551233, 741154015, 741954446, 742965758, 744045973, 745107710, 746173680, 747258127, 748279870, 749129772, 749790013, 750319779, 750691712, 750861347, 750905573, 750955403, 751063704, 751157284, 751156807, 751101315, 751101792, 751185060, 751242995, 751195133, 751118958, 751113057, 751154840, 751143992, 751053691, 750979900, 750951707, 750871480, 750716031, 750579715, 750492513, 750375688, 750172853, 749925792, 749700904, 749487936, 749207556, 748827934, 748424590]
2447.5G48424590l81828m30822n62251o52909o35803o49929q19683j025557j100898
2465.8G42164910j108766j230895j464069j628816j686514j768231j970470k216041
2482.1G29091108k326012k302229k324999k426445k436578k289892k114653k027571
2498.5G10842729j978159j850665j677453j610935j624882j536847j373410j282751
2514.8F97907627j239896j082123p58588m22656j91629L2365L52740P23481J031816
2533.1F96353137J207769J316369J483679J649558J652182J590728J643539J739681
2549.4G08636642J678109J447320J230955J135647J107514J002312Q26418P25865O77348
2567.8G18468130N67674M53413M09782L68833L10064K58863K02417J69754J60456J20461
$$ y = [748424590, 748042762, 747611940, 747049689, 746396780, 745760977, 745111048, 744291365, 743265808, 742164910, 741056144, 739825249, 738361180, 736732364, 735045850, 733277619, 731307149, 729091108, 726765096, 724462867, 722137868, 719711423, 717274845, 714984953, 712870300, 710842729, 708864570, 707013905, 705336452, 703725517, 702100635, 700563788, 699190378, 697907627, 696667731, 695585608, 694827020, 694404364, 694212735, 694245100, 694597840, 695321321, 696353137, 697560906, 698877275, 700360954, 702010512, 703662694, 705253422, 706896961, 708636642, 710314751, 711762071, 712993026, 714128673, 715236187, 716238499, 717064917, 717790782, 718468130, 719035804, 719489217, 719898999, 720267832, 720577896, 720836759, 721039176, 721208930, 721369386, 721489847]
2588.2G21489847O0022M5895J16885J75476J53840J40786J62065K00689K45690K60770
2608.6G23051965K92540L94702M87804N07593N18084N59032O03020O23942O33418O55413
2629G28327513O78539O65486O12438N83708O12855O28829N63681M72665M22478L88503
2649.4G33956695L22759K25484J54197J50085J43230K9564j03355r3519k0564o3777
2669.8G34700799j57774j73807j47998j42097j72317j78159j65403j90615k05517k17617
2690.2G32949495k45809k27452k22921k79784k90454k66373k67446k73883k94924l08871
2710.6G30271578k77937k62081k99216l23355l27885l69131l96610l34680k68698k65181
2731G27146804l04460l59297l48449k90751k91646l61562m31776m20212l14057k62380
$$ y = [721489847, 721549869, 721595764, 721712649, 721888125, 722041965, 722182751, 722344816, 722545505, 722791195, 723051965, 723344505, 723739207, 724227011, 724734604, 725252688, 725811720, 726414740, 727038682, 727672100, 728327513, 729006052, 729671538, 730283976, 730867684, 731480539, 732109368, 732673049, 733145714, 733568192, 733956695, 734279454, 734504938, 734659135, 734809220, 734952450, 734982014, 734878659, 734785140, 734764576, 734700799, 734543025, 734369218, 734221220, 734079123, 733906806, 733728647, 733563244, 733372629, 733167112, 732949495, 732703686, 732476234, 732253313, 731973529, 731683075, 731416702, 731149256, 730875373, 730580449, 730271578, 729993641, 729731560, 729432344, 729108989, 728781104, 728411973, 728015363, 727680683, 727411985, 727146804, 726842344, 726483047, 726134598, 725843847, 725552201, 725190639, 724758863, 724338651, 724024594, 723762214]
2751.4G23762214l25262l69072l69847l92437m25041m29809m18723m08947m20988m89592
2771.8G19712496n41449m85599m51624n07295n31972n43415o13451o78301o64950o40452
2792.2G14053988o78062p26223p22408p08878p45595p82728q21471r10402r45270r05990
2812.5G06106961r38773j030505j091719j123130j144409j190007j278996j370967
2828.9F96938455j432180j522720j702726j905263k024233k183914k608717l198325
2845.2F80360377l494084l090382k175569j332045q96811q22366q80897r40322j085997
2863.5F65641904j329303j504958j589715j609027j411617j045347q49485q49843q27908
2881.9F54624701p99299q34465q99136r36448r34601r26256q66950p64430p85291r03964
$$ y = [723762214, 723436952, 723067880, 722698033, 722305596, 721880555, 721450746, 721032023, 720623076, 720202088, 719712496, 719171047, 718685448, 718233824, 717726529, 717194557, 716651142, 716037691, 715359390, 714694440, 714053988, 713375926, 712649703, 711927295, 711218417, 710472822, 709690094, 708868623, 707958221, 707012951, 706106961, 705168188, 704137683, 703045964, 701922834, 700778425, 699588418, 698309422, 696938455, 695506275, 693983555, 692280829, 690375566, 688351333, 686167419, 683558702, 680360377, 676866293, 673775911, 671600342, 670268297, 669371486, 668549120, 667668223, 666727901, 665641904, 664312601, 662807643, 661217928, 659608901, 658197284, 657151937, 656302452, 655452609, 654624701, 653825402, 652990937, 652091801, 651155353, 650220752, 649294496, 648427546, 647663116, 646877825, 645973861]
2902.3F45973861r63866j057387j354396j832366k273560k404392k135813j611709
2918.6F32340372j029313n72562k90752r2983J19269M25100P00593Q11518Q76724R52780
2939F34240746R25363Q23557P75754P10309M74811J36256p3374j20460j29641q2850
2959.4F37680471Q4460L51786O26862Q27849R61364J002550R64880R33647Q38995P08818
2979.8F44981682P02381P26164O18934M62950L42905K72334L03089L14057K23577J43052
3000.2F49091125J41203J78873J30475k4736j67847j63674q941Q8513K3663r5844k21491
3022.6F48971319l24070l87609m78983n67079o00636o11067o77764q10802q54850q01682
3043F42856777p83682p88510q21471q94308r55522r41277q39174q27849r35137r98974
$$ y = [645973861, 645009995, 643952608, 642598212, 640765846, 638492286, 636087894, 633952081, 632340372, 631311059, 630738497, 630447745, 630354762, 630474031, 630899131, 631599724, 632411242, 633287966, 634240746, 635166109, 635989666, 636765420, 637475729, 637950540, 638086796, 638013422, 637892962, 637763321, 637680471, 637764931, 638116717, 638743579, 639571428, 640532792, 641535342, 642500222, 643433869, 644272864, 644981682, 645684063, 646410227, 647029161, 647492111, 647835016, 648107350, 648410439, 648724496, 648948073, 649091125, 649232328, 649411201, 649541676, 649516940, 649349093, 649185419, 649176478, 649264991, 649288654, 649192810, 648971319, 648647249, 648259640, 647780657, 647213578, 646612942, 646001875, 645324111, 644513309, 643658459, 642856777, 642073095, 641284585, 640463114, 639568806, 638613284, 637672007, 636832833, 636004984, 635069847, 634070873]
3063.4F34070873r78708q76427p74264p77960q71420r71496r88364r35674q91805q55624
3083.8F25149131q21710q52048q98779q84771q80063r22024r76085j003623r71437
3102.2F16938591r55462j040698j114666j065969j052261j151502j204669j165271
3118.5F08188093j100242j096249j182616j257837j277327j288295j305401j331032
3134.8E98349094j364469j371503j353145j390278j465321j483142j503289j537978
3151.1E86879969j531244j546204j585066j616120j602114j572370j608193j634896
3167.4E74183762j636386j662433j710773j742661j717150j692176j702249j708507
3183.7E60611427j713157j711786j675427j661956j709819j759290j756192j710057
$$ y = [634070873, 633092165, 632215738, 631441474, 630663514, 629792094, 628820598, 627832234, 626896560, 626004755, 625149131, 624327421, 623475373, 622576594, 621691823, 620811760, 619889736, 618913651, 617910028, 616938591, 615983129, 614942431, 613827765, 612761796, 611709535, 610558033, 609353364, 608188093, 607087851, 605991602, 604808986, 603551149, 602273822, 600985527, 599680126, 598349094, 596984625, 595613122, 594259977, 592869699, 591404378, 589921236, 588417947, 586879969, 585348725, 583802521, 582217455, 580601335, 578999221, 577426851, 575818658, 574183762, 572547376, 570884943, 569174170, 567431509, 565714359, 564022183, 562319934, 560611427, 558898270, 557186484, 555511057, 553849101, 552139282, 550379992, 548623800, 546913743]
3200.1E46913743j678050j681089j675248j634121j612484j630962j654506j649261
3216.4E33698022j601040j579523j605570j633227j618386j578867j603782j640082
3232.7E20837545j611471j561999j532793j534820j552164j559317j560152j581430
3249E08343399j559318j492321j511335j616717j646995j560927j523703j558364j529336
3267.4D94344383j436650j399428j436204j437872j372487j310289j306980j323998
3283.7D83320475j289457j212568j144617j147151j209855j224310j165360j118600
3300D73808557j120210j121968j112282j146615j188576j205444j243949j271397j284212
3318.4D63113904j310527j332254j367121j420856j454860j453876j446844j423627
$$ y = [546913743, 545235693, 543554604, 541879356, 540245235, 538632751, 537001789, 535347283, 533698022, 532096982, 530517459, 528911889, 527278662, 525660276, 524081409, 522477627, 520837545, 519226074, 517664075, 516131282, 514596462, 513044298, 511484981, 509924829, 508343399, 506784081, 505291760, 503780425, 502163708, 500516713, 498955786, 497432083, 495873719, 494344383, 492907733, 491508305, 490072101, 488634229, 487261742, 485951453, 484644473, 483320475, 482031018, 480818450, 479673833, 478526682, 477316827, 476092517, 474927157, 473808557, 472688347, 471566379, 470454097, 469307482, 468118906, 466913462, 465669513, 464398116, 463113904, 461803377, 460471123, 459104002, 457683146, 456228286, 454774410, 453327566, 451903939]
3334.7D51903939j405805j439303j438797j374632j345396j316816j212239j161665
3351D41209286j233756j273126j179218j084804j122207j129865j007677r48309j006663
3369.3D31223661j061797j050890r78023q64178p75039p96407q26866p68572o53177
3387.7D23448712n22972n28186o66827o74248m89443l49731m08530n08159m60953l63767
3408.1D18475896l07172k22683j62244k01166j85311q1449k3395M8607J75447K53260
3428.5D17769790K39908K77013L88741L73751K45870K72065M23610N35757O37054O46532
3448.9D21810091O24448P00682P96556R09091R95934R60260R78410J109958J144260
3467.2D30029690J021445R23783J045048J231044J307756J338810J350760J301259
$$ y = [451903939, 450498134, 449058831, 447620034, 446245402, 444900006, 443583190, 442370951, 441209286, 439975530, 438702404, 437523186, 436438382, 435316175, 434186310, 433178633, 432230324, 431223661, 430161864, 429110974, 428132951, 427268773, 426493734, 425697327, 424870461, 424101889, 423448712, 422925740, 422397554, 421730727, 421056479, 420567036, 420217305, 419808775, 419300616, 418839663, 418475896, 418168724, 417946041, 417783797, 417582631, 417397320, 417315871, 417292476, 417341083, 417516530, 417769790, 418009698, 418286711, 418675452, 419049203, 419295073, 419567138, 419990748, 420526505, 421163559, 421810091, 422434539, 423135221, 423931777, 424840868, 425836802, 426797062, 427775472, 428885430, 430029690, 431051135, 431974918, 433019966, 434251010, 435558766, 436897576, 438248336, 439549595]
3483.6D39549595J295567J399725J464963J450956J474023J560479J579404J572550
3499.9D51347262J681745J694739J499563J531869J776904J862049J821697J774967
3516.2D64990795J762092J808584J920819J926482J887530K008795K098382K036214
3532.5D80439693K087861K246082K231687K195478K267539K395719K442956K288193
3548.8D98595208K271742K452313K411008K334893K524555K636313K401829K510846
3565.1E18138707L334820L348231K549827K407432K762437K984643L041804K913236
3581.5E41481137K644599K885341L679037L490747K588391K671599L222406L285587
3597.8E65948844L221869L149033K804339K803206L465116L549874L093362K895415
$$ y = [439549595, 440845162, 442244887, 443709850, 445160806, 446634829, 448195308, 449774712, 451347262, 453029007, 454723746, 456223309, 457755178, 459532082, 461394131, 463215828, 464990795, 466752887, 468561471, 470482290, 472408772, 474296302, 476305097, 478403479, 480439693, 482527554, 484773636, 487005323, 489200801, 491468340, 493864059, 496307015, 498595208, 500866950, 503319263, 505730271, 508065164, 510589719, 513226032, 515627861, 518138707, 521473527, 524821758, 527371585, 529779017, 532541454, 535526097, 538567901, 541481137, 544125736, 547011077, 550690114, 554180861, 556769252, 559440851, 562663257, 565948844, 569170713, 572319746, 575124085, 577927291, 581392407, 584942281, 588035643, 590931058]
3614.1E90931058K587140L029048L757477K958476J928330K232730M467845N095244
3630.4F16987348K874136K344667K708912K692461K685845K342820J814723K410174
3646.7F36861086M461169M352391J614630J176596K640664K447784J604915J504064
3663F56663299J175522J103819K344310K484262J094878K314091K762258P61747K58148
3681.4F70962334K71201J62482J152396K342940J269102j37031j79410J70290O58930
3699.8F76673234J426219J164198J70529K71380J443446K221882J017094l02017k91705
3718.1F83794260J82331M72545N27382M37379j35243m36842L52442J446307J580894
3736.5F88221455R1552j528918p93517J720667Q96096n11587J239777J293480o52194
$$ y = [590931058, 593518198, 596547246, 600304723, 603263199, 605191529, 607424259, 611892104, 616987348, 619861484, 622206151, 624915063, 627607524, 630293369, 632636189, 634450912, 636861086, 641322255, 645674646, 647289276, 648465872, 651106536, 653554320, 655159235, 656663299, 657838821, 658942640, 661286950, 663771212, 664866090, 667180181, 669942439, 670704186, 670962334, 671233535, 671396017, 672548413, 674891353, 676160455, 676023424, 675844014, 676014304, 676673234, 678099453, 679263651, 679434180, 679705560, 681149006, 683370888, 684387982, 684085965, 683794260, 683976591, 684449136, 684976518, 685413897, 685278654, 684841812, 685194254, 686640561, 688221455, 688313007, 686784089, 685990572, 687711239, 688607335, 688095748, 689335525, 690629005, 689976811]
3754.8F89976811p30216L94463M32253l32772j77861J75834M61698N91099j57952o02484
3775.2F90030873p2479O41644L18288k24650J1266M8220p8619j38342l18468j19507
3795.6F90098226j69039j2874J090347L42787l06547N66363j71363j228869o21259
3814F89587772P27773L24368J57714J052201r5964p66277m40419l42190r4116j85251
3834.4F89925611J04845R82046O03080j45674k63989p60496j545846j261890J638472
3852.7F89276159L098190k61248j764416r35018J95682L55661m60267j6928Q36074
3871.1F90323889J74463l94821p98106l57032L66092j14680J69456P2003n80013K46942
3891.5F89108193K65419r26137q44776J24931N79298P33018L77118n28633p53344m92990
$$ y = [689976811, 689246595, 689641058, 690073311, 689740539, 689562678, 689738512, 690200210, 690791309, 690633357, 690030873, 689958394, 690600038, 690918326, 690693676, 690704942, 690753162, 690674543, 690536201, 690217733, 690098226, 689929187, 689916313, 691006660, 691349447, 691042900, 691609263, 691437900, 690209031, 689587772, 690315545, 690639913, 690797627, 691849828, 691753864, 690987587, 690547168, 690204978, 690110862, 689925611, 690030456, 691012502, 691615582, 691469908, 691205919, 690445423, 688899577, 687637687, 689276159, 692374349, 692113101, 690348685, 689413667, 689609349, 689965010, 689504743, 689487815, 690323889, 690498352, 690103531, 689305425, 688948393, 689314485, 689199805, 689369261, 689441264, 688861251, 689108193, 689373612, 688447475, 687602699, 687727630, 688306928, 689039946, 689417064, 688888431, 688135087, 687642097]
3911.9F87642097m01973m7863L82662R7752l56853j47045L6240k97308k05338K71380
3932.3F86973751J13844l26693m07338k70128M0650O1512j72495k2114J2398k58982
3952.7F85744405k60473r9658o5506n782M0353j00434k07603j27673j5319L8684L5167
3975.1F84976161j10627k39551j44541k4319o6220j76132j71542n7340m113q404m0293
3997.5F83933079
$$ y = [687642097, 687240124, 687192261, 687574923, 687672675, 687315822, 687168777, 687205017, 686907709, 686702371, 686973751, 687087595, 686760902, 686353564, 686083436, 686124086, 686185598, 686013103, 685990989, 686003387, 685744405, 685483932, 685384274, 685318768, 685312986, 685353339, 685252905, 685045302, 684917629, 684902310, 684940994, 684976161, 684865534, 684625983, 684481442, 684457123, 684390903, 684214771, 684043229, 683985889, 683981776, 683973372, 683933079]
##END=$$ End of the data block
