##TITLE=$$ Begin of the data block
##JCAMP-DX=5.00 $$ ACD/SpecManager v 10.08
##SPECTROMETER/DATA SYSTEM=Alpha
##DATE=13 Jun 2014 08:26:00
##DATA TYPE=INFRARED SPECTRUM
##DATA CLASS=XYDATA
##ORIGIN=
##OWNER=
##NPOINTS=1765
##FIRSTX=399.75695801
##LASTX=3997.56933594
##MAXX=3997.56933594
##MINX=399.75695801
##MAXY=0.75320745
##MINY=0.07239345
##XFACTOR=1.0000000000
##YFACTOR=1.000000000000000e-9
##FIRSTY=0.39014539
##DELTAX=2.03957629
##XUNITS=1/CM
##YUNITS=ARBITRARY UNITS
##XYDATA=(X++(Y..Y))
399.8C90145391Q602649Q311004R775281J0400563R585589Q790136R035945R300977
416.1D63947535R444236Q510679P005304P308543P096887N688488N468190O208956
432.4E20678818O058753N001724M675745N144418M922628L751159L345847M025579
448.7E57604671M009902K891421K196670K760351L014505J927435J232088J946806
465E77583849K774239K405763J878559K420366L246546L167212K411306K194404K755642
483.4F00837886K884090K259791J790226J993358K378523K106011J396477J310528
499.7F16956890J806616J732350J099407Q56281J125336J065611N43595L66032N20050
518.1F26072168N78702M73678K98202L70443N90026N21779M59075P07329R89914J096069
$$ y = [390145391, 398748040, 407059044, 416834325, 427234888, 436820477, 445610613, 454646558, 463947535, 473391771, 481902450, 488907754, 496216297, 503313184, 509001672, 514469862, 520678818, 526737571, 531739295, 536415040, 541559458, 546482086, 550233245, 553579092, 557604671, 561614573, 564505994, 566702664, 569463015, 572477520, 574404955, 575637043, 577583849, 580358088, 582763851, 584642410, 587062776, 590309322, 593476534, 595887840, 598082244, 600837886, 603721976, 605981767, 607771993, 609765351, 612143874, 614249885, 615646362, 616956890, 618763506, 620495856, 621595263, 622451544, 623576880, 624642491, 625186086, 625552118, 626072168, 626650870, 627124548, 627422750, 627793193, 628383219, 628904998, 629364073, 630071402, 631061316, 632157385]
538.4F32157385J029194R02891P68363P05243P12096N06342J29521j5736O5744j0073
558.8F36950970q6844J48117L54767K42472L7789k7656q822L7015R5725J58906L40938
581.3F38243377O48141Q43644Q14200O89625N38350M33564M93228L75867k15769p22885
601.7F42141342p96079r75192j277387j005352k84672P7308J9252K76089R78291J339555
622.1F40493155J053333O99699Q82327J252175J158118Q92520J154721J643717J392007
640.4F50621772N63383L03626P17401P88630J30474m19259k30968l7491m67599q55326
660.8F51114643n14567j49966p98761j103282K61604P63417M18007o8963k67326j32561
681.2F49522245j77741p20024j402378j735747k058864l009379m378080n552411n912006
$$ y = [632157385, 633186579, 634089470, 634857833, 635563076, 636275172, 636781514, 636911035, 636895299, 636961043, 636950970, 636864126, 637012243, 637367010, 637609482, 637647271, 637619615, 637610793, 637647808, 637743533, 637902439, 638243377, 638891518, 639735162, 640549362, 641238987, 641777337, 642210901, 642704129, 643079996, 642864227, 642141342, 641345263, 640370071, 639092684, 638087332, 637802660, 637879968, 637899220, 638175309, 639153600, 640493155, 641546488, 642246187, 643128514, 644380689, 645538807, 646431327, 647586048, 649229765, 650621772, 651185155, 651488781, 652206182, 652994812, 653125286, 652706027, 652475059, 652437568, 651969969, 651114643, 650600076, 650450110, 649651349, 648548067, 648809671, 649573088, 649991095, 649922132, 649654806, 649522245, 649344504, 648624480, 647222102, 645486355, 643427491, 640418112, 636040032, 630487621, 624575615]
699.6F24575615o025374p414639r564519j0833144j0738731q909642n600095k605617
715.9E62883854m60625K475560O570697J0671377J3996363J5942335J5999496J4416516
732.2F42495573J2147188R854078P493019N232930L567219K641618K002955J238584
748.5F86673164O23346N11408O45458N10097N4955j95861L1353K52842J55747Q0109
768.9F89342618L55244O44624N05686K08497K19643M80592M60327J10090o3360P152
789.3F92271113K7240q0407k57373k57313r298N9366j34587k79189k74479k95162n40853
811.7F90229058r68456j177490j066565j120448j579523k035976k057969k058685k543450
830.1F75620496l266275l764033m069626m657984n825520p393300r750307j1993468
$$ y = [624575615, 618550241, 611135602, 601571083, 590737939, 579999208, 571089566, 565489471, 562883854, 562423229, 564898789, 571469486, 582140863, 596137226, 612079561, 628079057, 642495573, 654642761, 664496839, 671989858, 677222788, 680790007, 683431625, 685434580, 686673164, 687296510, 687807918, 688453376, 688963473, 689018428, 688822567, 688853920, 689106762, 689262509, 689342618, 689697862, 690342486, 690848172, 691056669, 691276312, 691756904, 692217231, 692327321, 692263961, 692271113, 692298353, 692217946, 691960573, 691703260, 691693962, 691753328, 691618741, 691339552, 691065073, 690769911, 690229058, 689260602, 688083112, 687016547, 685896099, 684316576, 682280600, 680222631, 678163946, 675620496, 672354221, 668590188, 664520562, 659862578, 654037058, 646643758, 636893451, 624899983]
846.4F24899983r812295m361808l158450o962419j1156142j4665544j8879235k5286793
862.7E30617297l6221087n4107011p1987450p0182264m4388592j5611276N541414K5887653
879.1B69548684M5823127N9695870O6309661O5762520N7015836M2683363K8513789
893.3F35352850J8359423J2617170R593368P335126N186201L719985L197789K843321
909.6F98205233J947820J015544Q33213R65953M68910l92258o69301l31104k59161
928G01784849p60197j036287n88834j29640l88921q51452o82235j84476l13520j079798
948.4F95769489j584947j506448j560569k212644k837181k789616k565623k999305
964.7F77713156l754735l991604l824234m131019n072773n820393o035686o323039
$$ y = [624899983, 615087688, 610725880, 607567430, 600605011, 589448869, 574783325, 555904090, 530617297, 494396210, 440289199, 368301749, 298119485, 253730893, 238119617, 243661031, 269548684, 315371811, 375067681, 441377342, 507139862, 564155698, 606839061, 635352850, 653712273, 666329443, 675922811, 683257937, 688444138, 692164123, 695361912, 698205233, 700153053, 701168597, 702001810, 702967763, 703436673, 703044415, 702375114, 702044010, 701784849, 701024652, 699988365, 699399531, 699269891, 698880970, 698029518, 697347283, 697162807, 696849287, 695769489, 694184542, 692678094, 691117525, 688904881, 686067700, 683278084, 680712461, 677713156, 673958421, 669966817, 666142583, 662011564, 656938791, 651118398, 645082712, 638759673]
981F38759673p042468p613301p409275o791115o567597o639481o246149n367875m868865
999.4E80213547n114377n450487n431652n501449o012797o409169o087482n271613
1015.7E34934521m576385m063547l235102k030909j096785p43925m64023J32859O76394
1034.1E19533098O40332K20597o2704k17080n99384j115263j251101q20756j10269
1052.4E16217470N76616J291930K127171K748131K617360J732945N72443o70731k156317
1070.8E25057018l557682m139364l796935l086150k283335r14156R49860K489865L462612
1089.1E14181733L993631L992795L392518K341628J145959L20613K35558O62088J049877
1107.5E31316400J230835J457394J735806J659453J083791M74632K55108L12269K46167
$$ y = [638759673, 631717205, 624103904, 616694629, 609903514, 603335917, 596696436, 590450287, 585082412, 580213547, 575099170, 569648683, 564217031, 558715582, 552702785, 546293616, 540206134, 534934521, 530358136, 526294589, 523059487, 521028578, 519931793, 519187868, 518723845, 518856704, 519533098, 520173430, 520394027, 520331323, 520114243, 519514859, 518399596, 517148495, 516327739, 516217470, 516794086, 518086016, 520213187, 522961318, 525578678, 527311623, 527884066, 527213335, 525057018, 521499336, 517359972, 513563037, 510476887, 508193552, 507279396, 508229256, 510719121, 514181733, 518175364, 522168159, 525560677, 527902305, 529048264, 529368877, 529604435, 530266523, 531316400, 532547235, 534004629, 535740435, 537399888, 538483679, 538958311, 539213419, 539525688, 539771855]
1125.8E39771855L0041j8359k0444m22716j173139j780569k007306k043605k067387
1144.2E30268371j921892j473069r56953o68526m62532M5419Q38518J584053K172470
1162.6E29425859K691031L070652L071428K616763K103686J944721J951456J694739
1178.9E48570335J156747O60539K53618l05713j015305j572251j844883k050042k320230
1197.2E41532815k463401k299666k032876j935482j979590k009451k056658k265871
1213.5E24489820k606332k894283k997040l042937l168344l305078l296673l137112
1229.9E00042021l009408k996922k962828k810239k702266k754569k846301k784401
1246.2D77175087k677620k720594k875865k984196k973824k988428l103554l199101
$$ y = [539771855, 539801896, 539783537, 539763093, 539340377, 538167238, 536386669, 534379363, 532335758, 530268371, 528346479, 526873410, 525916457, 525247931, 524785399, 524830818, 525669336, 527253389, 529425859, 532116890, 535187542, 538258970, 540875733, 542979419, 544924140, 546875596, 548570335, 549727082, 550387621, 550641239, 550335526, 549320221, 547747970, 545903087, 543853045, 541532815, 539069414, 536769748, 534736872, 532801390, 530821800, 528812349, 526755691, 524489820, 521883488, 518989205, 515992165, 512949228, 509780884, 506475806, 503179133, 500042021, 497032613, 494035691, 491072863, 488262624, 485560358, 482805789, 479959488, 477175087, 474497467, 471776873, 468901008, 465916812, 462942988, 459954560, 456851006, 453651905]
1262.5D53651905l135085l051311l147453l380775l486365l431321l468752l678143
1278.8D26872700l852874l838151l862351m060835m268110m319966m382670m575312
1295.1C93712431m806250m932135m931361m959345n059898n175382n137771n087823
1311.4C53622466n168259n208939n172253n208909n295962n450994n659461n771846
1327.8C10685843n902231o008386n964488n924731o245763o595373o404340o160229
1344.1B61480302o265819o471649o618098o702438o736070o730854o610617o703839
1360.4B08640918p107183o983876o484852o499737o452605o377936o620720o363526
1376.7A55750483n960226n855545n654305n359620n403117n313381m736386m700900
$$ y = [453651905, 450516820, 447465509, 444318056, 440937281, 437450916, 434019595, 430550843, 426872700, 423019826, 419181675, 415319324, 411258489, 406990379, 402670413, 398287743, 393712431, 388906181, 383974046, 379042685, 374083340, 369023442, 363848060, 358710289, 353622466, 348454207, 343245268, 338073015, 332864106, 327568144, 322117150, 316457689, 310685843, 304783612, 298775226, 292810738, 286886007, 280640244, 274044871, 267640531, 261480302, 255214483, 248742834, 242124736, 235422298, 228686228, 221955374, 215344757, 208640918, 201533735, 194549859, 188065007, 181565270, 175112665, 168734729, 162114009, 155750483, 149790257, 143934712, 138280407, 132920787, 127517670, 122204289, 117467903, 112767003]
1393A12767003n096182m928626m662014m312918l893539l782720l339767k759859k377704
1411.4G7613674j977369j512706j127452o02692J22889O04988R10587J117289J311675
1429.7G6460883J409166J361042J410715J498029J233384J002460Q87089Q10929P95021
1448.1H6868718P26566O20782N25810O13824Q68275R06043Q63523J021049J181543
1466.4I4196133J148768J173914J507394J846440J876875J898602K002716K199039
1482.8A07849881K318740K567887L138684L642395L494375L610685M478827M805222
1499.1A35906696M382819L850490M299492O066978N619287M530087M473046M660383
1515.4A73789278M868909M849673N327180N336091M783541M898488M611731M566237
$$ y = [112767003, 107670821, 102742195, 98080181, 93767263, 89873724, 86091004, 82751237, 79991378, 77613674, 75636305, 74123599, 72996147, 72393455, 72516344, 73121332, 74031919, 75149208, 76460883, 77870049, 79231091, 80641806, 82139835, 83373219, 84375679, 85262768, 86073697, 86868718, 87595284, 88216066, 88741876, 89355700, 90223975, 91130018, 91993541, 93014590, 94196133, 95344901, 96518815, 98026209, 99872649, 101749524, 103648126, 105650842, 107849881, 110168621, 112736508, 115875192, 119517587, 123011962, 126622647, 131101474, 135906696, 140289515, 144140005, 148439497, 154506475, 160125762, 164655849, 169128895, 173789278, 178658187, 183507860, 188835040, 194171131, 198954672, 203853160, 208464891, 213031128]
1531.7B13031128N135760M613682M090459N579114O415948N553409N394653N438924
1548B55253077N905419O194651O297350O258995Q226782J0225743P146567O314456
1564.3C11823040O835312P025748P193983O014854N455464O296545N515874M513651
1580.7C60674471M546702M463851M067004L725946L505438L268391K970964K619862
1597C89842629K415717K354533K259016J939684J636624J508832J370281J074821Q12024
1615.3D05214161P81864P35968N66751L86178L44098L99530M87476N12898O11782R55612
1635.7D10996318J162350J115352J183510J369804J858532K274573J830101K071649
1652D23862189L260106K816528K396792K722681L324151L636598L313721L497719M078806
$$ y = [213031128, 218166888, 222780570, 226871029, 232450143, 238866091, 244419500, 249814153, 255253077, 261158496, 267353147, 273650497, 279909492, 288136274, 298362017, 305508584, 311823040, 318658352, 325684100, 332878083, 338892937, 344348401, 350644946, 356160820, 360674471, 365221173, 369685024, 373752028, 377477974, 380983412, 384251803, 387222767, 389842629, 392258346, 394612879, 396871895, 398811579, 400448203, 401957035, 403327316, 404402137, 405214161, 405996025, 406731993, 407298744, 407684922, 408029020, 408428550, 408916026, 409428924, 410040706, 410996318, 412158668, 413274020, 414457530, 415827334, 417685866, 419960439, 421790540, 423862189, 427122295, 429938823, 432335615, 435058296, 438382447, 442019045, 445332766, 448830485, 452909291]
1670.4D52909291L818452L933072M268050L784597L459603L914893N052179M517048
1686.7D85657185L772259M093111L971815M229992M664302M615188N123913M199803
1703E20327568L481388L740847L495693L161073K929092K849161L212035L103912K408862
1721.4E48709631K229691K400934K432645K429783K321362K687395K911031K351284
1737.7E68473756K363265K549648K496183K507687K509176K561152K532602K215445
1754E88208914K096712K071381J923800K010941J878917J572788J489222J445830J451731
1772.4F04150236J142919N08070L9339l19898p33734j304805j824856k050101k293229
1790.7E97313941k421618k018988j478732q75175j7583Q02159J412928K038896K748609
$$ y = [452909291, 456727743, 460660815, 464928865, 468713462, 472173065, 476087958, 481140137, 485657185, 489429444, 493522555, 497494370, 501724362, 506388664, 511003852, 516127765, 520327568, 523808956, 527549803, 531045496, 534206569, 537135661, 539984822, 543196857, 546300769, 548709631, 550939322, 553340256, 555772901, 558202684, 560524046, 563211441, 566122472, 568473756, 570837021, 573386669, 575882852, 578390539, 580899715, 583460867, 585993469, 588208914, 590305626, 592377007, 594300807, 596311748, 598190665, 599763453, 601252675, 602698505, 604150236, 605293155, 605801225, 605840564, 605520666, 604786932, 603482127, 601657271, 599607170, 597313941, 594892323, 592873335, 591394603, 590519428, 590501845, 591304004, 592716932, 594755828, 597504437]
1809.1E97504437L383517L627062L627181L725648L778875L545284L272414L167510
1825.4F25631928K902091K774477K660573K226650K019465K015591J780867J480759
1841.7F43492401J603841J772285J534581J366139J330912J322567J341581J267314
1858F55031621J174570J176893J172781J070917J085043J207232J157225J093745J034260
1876.4F65204287R54449R54270J003921R86815Q94367R16362J012027R45092Q64148
1894.7F73735738Q83281Q68619Q62061Q42810Q00729P89344Q34525Q65638P63774O48677
1915.1F81895196P22826Q58486P69734O83785O98745P36356P52687O48379N74768O33776
1935.5F88974738O97136O31511N65768O16550O70314O13808N10097M99427N64456N60940
$$ y = [597504437, 600887954, 604515016, 608142197, 611867845, 615646720, 619192004, 622464418, 625631928, 628534019, 631308496, 633969069, 636195719, 638215184, 640230775, 642011642, 643492401, 645096242, 646868527, 648403108, 649769247, 651100159, 652422726, 653764307, 655031621, 656206191, 657383084, 658555865, 659626782, 660711825, 661919057, 663076282, 664170027, 665204287, 666158736, 667113006, 668116927, 669103742, 669998109, 670914471, 671926498, 672871590, 673735738, 674619019, 675487638, 676349699, 677192509, 677993238, 678782582, 679617107, 680482745, 681246519, 681895196, 682618022, 683476508, 684246242, 684930027, 685628772, 686365128, 687117815, 687766194, 688340962, 688974738, 689671874, 690303385, 690869153, 691485703, 692156017, 692769825, 693279922, 693779349, 694343805, 694904745]
1955.9F94904745M54366M14729M99368N66482N27859N00202N56052O44326O53803N47469
1976.3G00269401M95672N55754N86331M91977M08887M44353N35190N19812L85344L71337
1996.7G05064058M86434N04970M04656L71456M32730M58896L97921L27527L43025M51327
2017.1G09243000M64618L22103K65599L63111M24624L41594K89798L73005M37320L69072
2037.5G12893844K80261L19957M12226M00722L15249L07501L51667L65674L32416K94983
2057.9G16274500L52740M30942L87251K79904K65598L34918L64185L14116K78712L23236
2078.3G19606102L76641L32177K49326K85208L60430L16322K10046J92464K71439L31283
2098.7G22531438K70486J82867K24471L12090K58505J20163J32084K46227K58684J73926
$$ y = [694904745, 695359111, 695773840, 696273208, 696839690, 697367549, 697867751, 698423803, 699068129, 699721932, 700269401, 700765073, 701320827, 701907158, 702399135, 702808022, 703252375, 703787565, 704307377, 704692721, 705064058, 705550492, 706055462, 706460118, 706831574, 707264304, 707723200, 708121121, 708448648, 708791673, 709243000, 709707618, 710029721, 710295320, 710658431, 711083055, 711424649, 711714447, 712087452, 712524772, 712893844, 713174105, 713494062, 713906288, 714307010, 714622259, 714929760, 715281427, 715647101, 715979517, 716274500, 716627240, 717058182, 717445433, 717725337, 717990935, 718325853, 718690038, 719004154, 719282866, 719606102, 719982743, 720314920, 720564246, 720849454, 721209884, 721526206, 721736252, 721928716, 722200155, 722531438, 722801924, 722984791, 723209262, 723521352, 723779857, 723900020, 724032104, 724278331, 724537015, 724710941]
2119.1G24710941J24216J67787K40684K35915J42276J31846K29001K36928J40369J24336
2139.5G26484299K08795K62320K24054J66475K03729K97785L10600K42471K63811L75986
2159.9G29040325M00424L02612K39492L12090M07457L91305K93851K82466L95179M46439
2180.3G32511640L28421K50578L55303M37856L60310K62857L09288L94464L45170K17498
2200.7G35773385J79708K63631L29614K58147J68979K43903L64721L35156K07901J86742
2221.1G38311887K80320K91884J83404J24872J82032J89662N5134m3332L5941J63854
2241.5G39775658K22921K33173K82109L95596M42267L40759K11657K33352L45945L33488
2261.9G42816925J97709J54793K76029L68655K67327J41680K11477L20315K73049J44244
$$ y = [724710941, 724835157, 725002944, 725243628, 725479543, 725621819, 725753665, 725982666, 726219594, 726359963, 726484299, 726693094, 726955414, 727179468, 727345943, 727549672, 727847457, 728158057, 728400528, 728664339, 729040325, 729440749, 729743361, 729982853, 730294943, 730702400, 731093705, 731387556, 731670022, 732065201, 732511640, 732840061, 733090639, 733445942, 733883798, 734244108, 734506965, 734816253, 735210717, 735555887, 735773385, 735953093, 736216724, 736546338, 736804485, 736973464, 737217367, 737582088, 737917244, 738125145, 738311887, 738592207, 738884091, 739067495, 739192367, 739374399, 739564061, 739619195, 739575863, 739611804, 739775658, 739998579, 740231752, 740513861, 740909457, 741351724, 741692483, 741904140, 742137492, 742483437, 742816925, 743014634, 743169427, 743445456, 743814111, 744081438, 744223118, 744434595, 744754910, 745027959, 745172203]
2282.3G45172203Q8870J56283J89782M9829m9651L4869R7931K9862p7606j01566n6267
2304.7G45534539j11401k60830k41220m2915j9312k71201n07236m44829j22726J4007
2325.1G43526876k33650l33905K2113K35140J7166j14381M3035K77698N53667R07719
2345.5G44901478O69897k82943j040519j107394p34330k98500Q1897L58105N59628
2363.8G43107319P83741J002312J097858J071811J044333J054227J006544Q42333O33180
2382.2G51643658M86493L55243J88053N9486O4671J35362J11699N245n3763J9073J20223
2404.6G53135443P2002o6995q9825J610N1081k2590j37449j15633p271k8909j54197
2427.1G52637267j71959r2984j00493j98364k39134j98722j94907k92301m03345m02212
$$ y = [745172203, 745261073, 745417356, 745607138, 745656967, 745607316, 745642185, 745740116, 745769978, 745692372, 745590806, 745534539, 745423138, 745162308, 744921088, 744878173, 744858861, 744587660, 744080424, 743635595, 743512869, 743526876, 743293226, 742959321, 742981434, 743216574, 743233740, 743119359, 743162394, 743440092, 743993759, 744901478, 745571375, 745288432, 744247913, 743140519, 742406189, 742107689, 742189586, 742547691, 743107319, 743891060, 744893372, 745991230, 747063041, 748107374, 749161601, 750168145, 751010478, 751643658, 752130151, 752485394, 752673447, 752732933, 752797604, 752932966, 753044665, 753049910, 752996147, 753015220, 753135443, 753207445, 753140450, 753050625, 753052235, 753103316, 753080726, 752943277, 752827644, 752820373, 752791464, 752637267, 752465308, 752372324, 752271831, 752073467, 751834333, 751635611, 751440704, 751148403, 750745058, 750342846]
2447.5G50342846l53038m14133n62072o48976o55532p05480q48234j002908j071989
2465.8G44080484j080632j205027j456201j634479j701236j785278j976848k202332
2482.1G31038451k314746k322853k351105k428532k430319k300919k134859k045214
2498.5G12709904k005101j858890j639723j570344j621664j550317j375138j284957
2514.8F99803770j254142j092195p47681l94106j58548N7220L61622P11560J004279
2533.1F98291779J192867J342357J510679J618266J620293J604915J640439J701891
2549.4G10523486J654148J463771J285732J201868J149654J009703Q20577P22468O78659
2567.8G20510066N94496M76420L83377L52323L30210K54750J76788J64747J74642J37090
$$ y = [750342846, 749989808, 749575675, 749013603, 748364627, 747709095, 747003615, 746155381, 745152473, 744080484, 742999852, 741794825, 740338624, 738704145, 737002909, 735217631, 733240783, 731038451, 728723705, 726400852, 724049747, 721621215, 719190896, 716889977, 714755118, 712709904, 710704803, 708845913, 707206190, 705635846, 704014182, 702463865, 701088727, 699803770, 698549628, 697457433, 696709752, 696315646, 696157098, 696214318, 696575940, 697287500, 698291779, 699484646, 700827003, 702337682, 703955948, 705576241, 707181156, 708821595, 710523486, 712177634, 713641405, 714927137, 716129005, 717278659, 718288362, 719108939, 719831407, 720510066, 721104562, 721580982, 721964359, 722316682, 722646892, 722901642, 723078430, 723243177, 723417819, 723554909]
2588.2G23554909Q8155P5937J13964J58191J36017R8229J41382K42770K81691K66075
2608.6G25157320L12806M10974M78327N11050N53191N97834O10233O01470O11902O59048
2629G30504155P08521O85274N97120N53071N94497O23464N49913M74334M73499M50492
2649.4G36214340L33905J80542J04487J28627J30177K6643n9128l4988j3888r3042
2669.8G36917675j80603j84893j47641j36673j81020j97947j67906j69396j86086k04444
2690.2G35161066k42829k61963k53796k54691k47598k45213k64227k78652l03149l07024
2710.6G32501924k65121k57016k84850l19600l68774l99471l85165l23832k65539k64763
2731G29367793l08574l44872l37064l28780l44336l57031l77179l82065l20137k79665
$$ y = [723554909, 723643064, 723719001, 723832965, 723991156, 724127173, 724225402, 724366784, 724609554, 724891245, 725157320, 725470126, 725881100, 726359427, 726870477, 727423668, 728021502, 728631735, 729233205, 729845107, 730504155, 731212676, 731897950, 732495070, 733048141, 733642638, 734266102, 734816015, 735290349, 735763848, 736214340, 736548245, 736728787, 736833274, 736961901, 737092078, 737118721, 737059593, 737024605, 737010717, 736917675, 736737072, 736552179, 736404538, 736267865, 736086845, 735888898, 735720992, 735551596, 735365510, 735161066, 734918237, 734656274, 734402478, 734147787, 733900189, 733654976, 733390749, 733112097, 732808948, 732501924, 732236803, 731979787, 731694937, 731375337, 731006563, 730607092, 730221927, 729898095, 729632556, 729367793, 729059219, 728714347, 728377283, 728048503, 727704167, 727347136, 726969957, 726587892, 726267755, 725988090]
2751.4G25988090l20792l57330l62515l88980m25518m34995m41134m39882m28796m63187
2771.8G21924961n16951m99964m56631m67956n20051n84543o50048p05183p05361o51359
2792.2G16166914o38307o92725p23004p19309p50721p93516q43108r15229r32217q94487
2812.5G08264291r11593r94325j082241j131714j153528j211167j307487j386166j444817
2830.9F97641253j534402j706004j914263k030253k186299k605736l176033l473997
2847.2F79014266l087640k173960j357794r76622q92342q93116r19818j064361j327455
2865.6F66321158j512527j576722j577437j407861j077175q70884q61525q65460q48949
2883.9F55722618q41319q53181q87215r24290r34243q53896p58588q00193r07957r67562
$$ y = [725988090, 725667298, 725309968, 724947453, 724558473, 724132955, 723697960, 723256826, 722816944, 722388148, 721924961, 721408010, 720908046, 720451415, 719983459, 719463408, 718878865, 718228817, 717523634, 716818273, 716166914, 715528607, 714835882, 714112878, 713393569, 712642848, 711849332, 711006224, 710090995, 709158778, 708264291, 707352698, 706358373, 705276132, 704144418, 702990890, 701779723, 700472236, 699086070, 697641253, 696106851, 694400847, 692486584, 690456331, 688270032, 685664296, 682488263, 679014266, 675926626, 673752666, 672394872, 671418250, 670525908, 669632792, 668712974, 667648613, 666321158, 664808631, 663231909, 661654472, 660246611, 659169436, 658298552, 657437027, 656571567, 655722618, 654881299, 654028118, 653140903, 652216613, 651282370, 650428474, 649669886, 648869693, 647961736, 646994174]
2904.3F46994174j069665j357913j812041k227843k377868k167701j675904j077950
2920.6F33227289n70953k56241p9929J22964M63307P29978P93338Q76069R83000R40144
2941F37228966Q28802P62403O76811M56452J39654n0127p7725r3460p5757O2167L14057
2963.5F40172243O03616Q25763R70364J022458R77754R38118Q53896P11978O53445
2981.8F47729635O59645O29008N31196L69489K61188K93791L11017K44201J70290J26123
3002.2F51325583J38760J22786j8955j71601j47760J5080R3162J3232r3460k09808
3022.6F51067019l47496m49538n19514n61297o05225o22750o34968p64966q75652q19385
3043F44866228p55548q02994q79347r00567r19461r37522q73387q39829r21190j003861
$$ y = [646994174, 645924509, 644566596, 642754555, 640526712, 638148844, 635981143, 634305239, 633227289, 632656336, 632400095, 632320166, 632443130, 632906437, 633636415, 634429753, 635305822, 636288822, 637228966, 638057768, 638820171, 639496982, 639953434, 640093088, 640042961, 639965236, 639871776, 639796019, 639858186, 640172243, 640775859, 641601622, 642571986, 643594444, 644572198, 645510316, 646364212, 647076190, 647729635, 648389280, 649018288, 649549484, 649918973, 650180161, 650473952, 650784969, 651029170, 651199460, 651325583, 651464343, 651587129, 651568174, 651396573, 651248813, 651263893, 651357055, 651370287, 651276827, 651067019, 650719523, 650269985, 649750471, 649189174, 648583949, 647961199, 647326231, 646561265, 645685613, 644866228, 644110680, 643307686, 642428339, 641527772, 640608311, 639670789, 638797402, 637957573, 637036383, 636032522]
3063.4F36032522r76920q50499p89166q46982r08613r63151r79007r11235q87037q94785
3083.8F27025127q46088q53180q96991q76844q81314r47833j014292j034260r94444
3102.2F18679881r92954j081049j122713j045048j025320j142323j224398j194298
3118.5F09851778j121462j114130j208603j287461j283109j271128j302302j344860
3134.8E99918723j371622j387596j414478j451135j453995j454950j528024j590431
3151.1E88266492j544297j501798j570166j634955j620293j620352j649260j653255
3167.4E75472116j672685j703441j721024j737118j721799j696706j695872j726091
3183.7E61797380j765787j755715j723647j717388j715303j711786j731872j735568
$$ y = [636032522, 635055602, 634205103, 633415937, 632568955, 631660342, 630697191, 629718184, 628806949, 627919912, 627025127, 626179039, 625325859, 624428868, 623552024, 622670710, 621722877, 620708585, 619674325, 618679881, 617686927, 616605878, 615483165, 614438117, 613412797, 612270474, 611046076, 609851778, 608730316, 607616186, 606407583, 605120122, 603837013, 602565885, 601263583, 599918723, 598547101, 597159505, 595745027, 594293892, 592839897, 591384947, 589856923, 588266492, 586722195, 585220397, 583650231, 582015276, 580394983, 578774631, 577125371, 575472116, 573799431, 572095990, 570374966, 568637848, 566916049, 565219343, 563523471, 561797380, 560031593, 558275878, 556552231, 554834843, 553119540, 551407754, 549675882, 547940314]
3200.1E47940314j700461j699150j714647j692950j667202j653611j639486j617610
3216.4E34555197j617849j659870j683951j653909j590908j573861j634597j653314
3232.7E21486938j595557j553416j572430j595318j562536j523793j551449j624763
3249E08907676j612604j528859j545966j625955j606107j543909j559198j580536j536042
3267.4D94768500j476049j439571j428575j418680j364350j336217j375437j355618
3283.7D83574003j277477j241535j206845j150995j178712j251846j219839j147717
3300D73899037j144916j132846j114488j160323j208395j245380j258105j258492j335472
3318.4D63040620j378208j330495j355529j470834j548708j528441j466155j438976
$$ y = [547940314, 546239853, 544540703, 542826056, 541133106, 539465904, 537812293, 536172807, 534555197, 532937348, 531277478, 529593527, 527939618, 526348710, 524774849, 523140252, 521486938, 519891381, 518337965, 516765535, 515170217, 513607681, 512083888, 510532439, 508907676, 507295072, 505766213, 504220247, 502594292, 500988185, 499444276, 497885078, 496304542, 494768500, 493292451, 491852880, 490424305, 489005625, 487641275, 486305058, 484929621, 483574003, 482296526, 481054991, 479848146, 478697151, 477518439, 476266593, 475046754, 473899037, 472754121, 471621275, 470506787, 469346464, 468138069, 466892689, 465634584, 464376092, 463040620, 461662412, 460331917, 458976388, 457505554, 455956846, 454428405, 452962250, 451523274]
3334.7D51523274j431197j435607j478851j479328j394123j278132j205713j250118
3351D40570205j334339j336098j228243j102388j113176j166612j084208r97812j040429
3369.3D30166900j115501j104861j017660r18657q57383q55356q17746p45088o57856
3387.7D22076792n39810n42819o66291o91503n59211m16309m29541n43147n23925l98069
3408.1D16766167l03209k41518j85758j58966j62094j27644p5370Q673J75953K94923
3428.5D15991157K56360K76476L70979L20226K51025L24846M14818N08070O59555O56784
3448.9D20030296O09040P13140Q20726R19223R79870R29505R61036J128971J204759
3467.2D28296566J099288R80020J018286J153916J322448J422763J381040J308024
$$ y = [451523274, 450092077, 448656470, 447177619, 445698291, 444304168, 443026036, 441820323, 440570205, 439235866, 437899768, 436671525, 435569137, 434455961, 433289349, 432205141, 431207329, 430166900, 429051399, 427946538, 426928878, 426010221, 425152838, 424297482, 423479736, 422734648, 422076792, 421536982, 420994163, 420327872, 419636369, 419077158, 418660849, 418231308, 417688161, 417164236, 416766167, 416462958, 416221440, 416035682, 415876716, 415714622, 415586978, 415511608, 415520281, 415696234, 415991157, 416247517, 416523993, 416894972, 417215198, 417466223, 417791069, 418205887, 418713957, 419373512, 420030296, 420639336, 421352476, 422173202, 423092425, 424072295, 425001800, 425962836, 427091807, 428296566, 429395854, 430375874, 431394160, 432548076, 433870524, 435293287, 436674327, 437982351]
3483.6D37982351J323491J423329J496702J500875J506806J591652J632035J619637
3499.9D50076878J717478J732528J559258J579672J789629J887083J853735J796126
3516.2D63992387J804143J867861J984417J997203J928568K032250K159119K108067
3532.5D79874015K094656K222180K256602K221138K290249K484113K547145K346038
3548.8D98336136K339006K569198K536118K409220K517402K585292K411425K591133
3565.1E18294930L388167L389418K640426K527356K872408L047228L042578K917528
3581.5E42120039K704680K943993L723800L596783K773702K828240L247977L299772
3597.8E67238986L355206L329753K931953K848923L438056L562450L215849L019274
$$ y = [437982351, 439305842, 440729171, 442225873, 443726748, 445233554, 446825206, 448457241, 450076878, 451794356, 453526884, 455086142, 456665814, 458455443, 460342526, 462196261, 463992387, 465796530, 467664391, 469648808, 471646011, 473574579, 475606829, 477765948, 479874015, 481968671, 484190851, 486447453, 488668591, 490958840, 493442953, 495990098, 498336136, 500675142, 503244340, 505780458, 508189678, 510707080, 513292372, 515703797, 518294930, 521683097, 525072515, 527712941, 530240297, 533112705, 536159933, 539202511, 542120039, 544824719, 547768712, 551492512, 555089295, 557862997, 560691237, 563939214, 567238986, 570594192, 573923945, 576855898, 579704821, 583142877, 586705327, 589921176, 592940450]
3614.1E92940450K655446L128708L913760L080189K020419K292335M426360N102098
3630.4F19559765L029764K513885K841353K797902K775371K420962J836658K324879
3646.7F40100539M321813M379034J821936J368403K781212K601803J724779J573980
3663F60673499J224399J062691K248645K515316J146376K233386K768874Q87275L20554
3681.4F75081015K72452J36853J093566K311468J356066j8120j27793K02001O72519
3699.8F80980027J377821J170933K91884L53932J408577K230585J125514k44081k97784
3718.1F88397408J63555M40836M81248L91840j41143m49062K74599J440823J747966
3736.5F92748070K72274j466751q95262J563966R09805m58478J215517J350403n50509
$$ y = [592940450, 595595896, 598724604, 602638364, 605718553, 607738972, 610031307, 614457667, 619559765, 622589529, 625103414, 627944767, 630742669, 633518040, 635939002, 637775660, 640100539, 644422352, 648801386, 650623322, 651991725, 654772937, 657374740, 659099519, 660673499, 661897898, 662960589, 665209234, 667724550, 668870926, 671104312, 673873186, 674760461, 675081015, 675353467, 675490320, 676583886, 678895354, 680251420, 680233300, 680105507, 680307508, 680980027, 682357848, 683528781, 683820665, 684174597, 685583174, 687813759, 688939273, 688695192, 688397408, 688560963, 689001799, 689483047, 689874887, 689733744, 689284682, 689559281, 691000104, 692748070, 693020344, 691553593, 690658331, 692222297, 693132102, 692673624, 693889141, 695239544, 694689035]
3754.8F94689035p43031L38256M84109k67982k08319J33574M72367O49453p0334n52416
3775.2F94924712j05381N84066L19123k19166J3769J08778n1975j64628l17872j04189
3795.6F94987237j42574j3709J019657K94983k95818O21259j22845j245320o84559
3814F94418311O62685L63707K65122J067876j30057p64191m19378l59118j57059j93297
3834.4F94754601J80602J005292N31375j99497k47299o68347j450062j301646J478076
3852.7F94083095L031253j91032j648069q90255J37866L60906m08888p6056P51853
3871.1F95150673J91451l23833p35998l67701L63231J2517K77460L2305o71565J97351
3891.5F94125891L01957q61645q53896N2929N16415P23600M58419m07278o51598m15683
$$ y = [694689035, 693946004, 694284260, 694768369, 694500387, 694292068, 694425642, 694898009, 695547462, 695477128, 694924712, 694819331, 695403397, 695722520, 695503354, 695517123, 695625901, 695573926, 695409298, 695091426, 694987237, 694844663, 694830954, 695850611, 696145594, 695849776, 696471035, 696348190, 695102870, 694418311, 695080996, 695444703, 695709825, 696777701, 696647644, 695883453, 695464075, 695104957, 694947898, 694754601, 694935203, 695940495, 696471870, 696272373, 696025074, 695356727, 693906665, 692605019, 694083095, 697114348, 696923316, 695275247, 694384992, 694522858, 694883764, 694474876, 694398820, 695150673, 695342124, 695018291, 694282293, 693914592, 694277823, 694290340, 694567800, 694600105, 693928540, 694125891, 694427848, 693566203, 692712307, 692765236, 693281651, 694005251, 694463670, 694056392, 693404794, 692989111]
3911.9F92989111m05192j40906L42250J68622l11971k12014m8101l10957j95921K53320
3932.3F92128241J00792l26813l98934k48313N2333P2122j58250l9995K2769j50681
3952.7F91053271j65641j09613j34051q2612L696r0719j70052q8870m4108m4345J668
3975.1F90128624m0412j23560q2612k1040p2778j58250j27196o5804o3956j4066j8418
3997.5F89340532
$$ y = [692989111, 692583919, 692443013, 692785263, 692953885, 692641914, 692429900, 692381799, 692070842, 691874921, 692128241, 692229033, 691902220, 691503286, 691254973, 691307306, 691379428, 691221178, 691181183, 691203952, 691053271, 690887630, 690778017, 690643966, 690561354, 690565050, 690474331, 690304279, 690215409, 690171301, 690126956, 690128624, 690088212, 689964652, 689882040, 689861000, 689788222, 689629972, 689502776, 689436972, 689373016, 689358950, 689340532]
##END=$$ End of the data block
