##TITLE=$$ Begin of the data block
##JCAMP-DX=5.00 $$ ACD/SpecManager v 10.08
##SPECTROMETER/DATA SYSTEM=Alpha
##DATE=13 Jun 2014 08:26:00
##DATA TYPE=INFRARED SPECTRUM
##DATA CLASS=XYDATA
##ORIGIN=
##OWNER=
##NPOINTS=1765
##FIRSTX=399.75695801
##LASTX=3997.56933594
##MAXX=3997.56933594
##MINX=399.75695801
##MAXY=0.75618446
##MINY=0.07258227
##XFACTOR=1.0000000000
##YFACTOR=1.000000000000000e-9
##FIRSTY=0.39226356
##DELTAX=2.03957629
##XUNITS=1/CM
##YUNITS=ARBITRARY UNITS
##XYDATA=(X++(Y..Y))
399.8C92263561P940263P770658R594798J0591924R711265Q895457R030521R006679
$$ 392263561 400203824 407974482 417569280 428161204 437872469 446767926 455798447 464805126
416.1D64805126R170234Q421123P130266P250577O438345N177259N655110O403625
$$ 464805126 473975360 482396483 489526749 496777326 503215671 508392930 514048040 520451665
432.4E20451665N903900M937708M805565N254447M856050L608585L406942M338145
$$ 520451665 526355565 531293273 536098838 541353285 546209335 549817920 553224862 557563007
448.7E57563007M395485K946853J929164K679885L128707J961589J193047J760542
$$ 557563007 561958492 564905345 566834509 569514394 572643101 574604690 575797737 577558279
465E77558279K499700K292454J918137K458155L237605L130794K361953K209604K815306
$$ 577558279 580057979 582350433 584268570 586726725 589964330 593095124 595457077 597666681 600481987
483.4F00481987K854407K194583J805187K042830K212882J802444J431882J602650
$$ 600481987 603336394 605530977 607336164 609378994 611591876 613394320 614826202 616428852
499.7F16428852K006769J859308J131832O86228Q07465Q79824N94377L94583M36306
$$ 616428852 618435621 620294929 621426761 622112989 622920454 623800278 624394655 624789238 625225544
518.1F25225544N10335N23925M33683M05193N36739N96047N18560N51999R06825J213729
$$ 625225544 625735879 626259804 626693487 627098680 627635419 628231466 628750026 629302025 630208850 631422579
538.4F31422579J046956P42376Q60631J128912Q31902J90258j42336q0049K9981m6789
$$ 631422579 632469535 633211911 634072542 635201454 636033356 636223614 636081278 636001229 636031210 635984421
558.8F35984421q8930J26302L50833K86460Q6605l2425k2828K0683k4140P3552M28736
$$ 635984421 635895491 636021793 636372626 636659086 636745691 636713266 636690438 636711121 636686981 636760533 637189269
581.3F37189269P33256Q34227P75099O44028N37753M37915M08948L14832j22548o43670
$$ 637189269 637922525 638756752 639531851 640175879 640713632 641151547 641560495 641875327 641752779 641109109
601.7F41109109q25346r19401j148045j005888m19677J0550J24038M04238R84192J253903
$$ 641109109 640283763 639364362 638216317 637210429 636790752 636801302 636925340 637329578 638313770 639567673
622.1F39567673R64821O40928Q18014J236916J250327R94384J168430J554429J360178
$$ 639567673 640532494 641173422 641991436 643228352 644478679 645473063 646641493 648195922 649556100
640.4F49556100P02799M52876O89268N64277o1750l98159j23263L2723m08649q30651
$$ 649556100 650258899 650711775 651401043 651965320 651903570 651505411 651382148 651414871 651006222 650175571
660.8F50175571n21540r5070o94692j157880P6890O91951M63962l3259l24845k09272
$$ 650175571 649654031 649558961 648864269 647706389 647783279 648475230 648939192 648905933 648581088 648371816
681.2F48371816j62781o75618j379788j699746k039909l035307m438877n611837n918443
$$ 648371816 648209035 647533417 646153629 644453883 642413974 639378667 634939790 629327953 623409510
699.6F23409510n953312p285893r499908j0900557j0804891q868575n509913k534628
$$ 623409510 617456198 610170305 600670397 589769840 578964949 570096374 564586461 562051833
715.9E62051833m55678K393186O551564J0801077J4118016J5981793J6014636J4418006
$$ 562051833 561596155 563989341 570540905 581341982 595459998 611441791 627456427 641874433
732.2F41874433J2093484R759784P412374N200743L602326K685666K004385J210094
$$ 641874433 653967917 663727701 671140075 676340818 679943144 682628810 684633195 685843289
748.5F85843289N87106N20169O96838N22077J5438k12550M5121K66671J91807J33753
$$ 685843289 686430395 686950564 687647402 688169479 688184917 687972367 688017488 688284159 688475966 688609719
768.9F88609719L72887O11007M71652J99973K28286M87745M77075J68443k0265K7120
$$ 688609719 688982606 689593613 690065265 690265238 690493524 690981269 691458344 691626787 691606522 691633642
789.3F91633642L6239j39475l00407k26319L8564J43528n7756k84315k88665l09944
$$ 691633642 691669881 691530406 691229999 691003680 691042244 691185772 691128016 690843701 690555036 690245092
809.7F90245092o23524j034141j164496j049399j119912j514494j881421j954317k079606
$$ 690245092 689621568 688587427 687422931 686373532 685253620 683739126 681857705 679903388 677823782
828.1F77823782k591431l306747l814280m100203m671574n800724p293105r667754
$$ 677823782 675232351 671925604 668111324 664011121 659339547 653538823 646245718 636577964
844.4F36577964j2025714r919405m466117l202795o928921j1108279j4651835j8842638
$$ 636577964 624552250 614632845 610166728 606963933 600035012 588926733 574274898 555432260
860.7E55432260k5215805l6183476n4069638p1851015o9949508m4217587j5602991
$$ 555432260 530216455 494032979 439963341 368112326 298162818 253945231 238342240
875B38342240N480096K5859863M5884371N9814065O6354513O5701962N6941032M2657614
$$ 238342240 243822336 269682199 315566570 375380635 441735148 507437110 564378142 607035756
891.3F07035756K8507769J8312752J2549878R573519P364511N212844L683090L110945
$$ 607035756 635543525 653856277 666406155 675979674 683344185 688557029 692240119 695351064
907.6F95351064K803207J977741J077772Q72075R47297M52697l80456o75798l41952
$$ 695351064 698154271 700132012 701209784 702081859 703029156 703481853 703101397 702425599 702083647
926G02083647k49624p77245j085698o16610j24097l67642q38518o97374k27988l73900
$$ 702083647 701834023 701056778 699971080 699354470 699230373 698862731 698024213 697326839 697098851 696724951
946.4F96724951j112044j563370j480579j547277k187967k841652k857685k636254
$$ 696724951 695612907 694049537 692568958 691021681 688833714 685992062 683134377 680498123
962.7F80498123l023982l767788m001499l810822m079581m995703n808354o101012
$$ 680498123 677474141 673706353 669704854 665894032 661814451 656818748 651010394 644909382
979F44909382o371737p033884p553935p343173o781042o577551o609857o223083n361080
$$ 644909382 638537645 631503761 623949826 616606653 609825611 603248060 596638203 590415120 585054040
997.3E85054040m850328n119920n461991n420506n484938n973935o362498o053329
$$ 585054040 580203712 575083792 569621801 564201295 558716357 552742422 546379924 540326595
1013.7E40326595n250930m610539m123151l257334k020300j069546p10845m38571J17064
$$ 540326595 535075665 530465126 526341975 523084641 521064341 519994795 519283950 518845379 518962443
1032E18962443O37054O15895J67489j24693k28882n89430j091838j202762p66694p2182
$$ 518962443 519599497 520215392 520382881 520258188 520029306 519439876 518348038 517145276 516378582 516306400
1052.4E16306400N63145J235247K077281K739668K656519J774967N76854p01964k174199
$$ 516306400 516869545 518104792 520182073 522921741 525578260 527353227 527930081 527228117 525053918
1070.8E25053918l531634m110098l773630l092468k376497j022756R14514K498925
$$ 525053918 521522284 517412186 513638556 510546088 508169591 507146835 508061349 510560274
1087.1E10560274L480554L994941L984929L439903K436638J199782L04222K13921O56366
$$ 510560274 514040828 518035769 522020698 525460601 527897239 529097021 529401243 529615164 530271530
1105.4E30271530J059294J275003J468897J683533J627207J107096N12958K85625L15309
$$ 530271530 531330824 532605827 534074724 535758257 537385464 538492560 539005518 539291143 539606452
1123.8E39606452K14279j3113p1228p1287m36842j128197j714528j994133k063334
$$ 539606452 539820731 539807618 539736390 539665103 539228261 538100064 536385536 534391403 532328069
1142.2E32328069k056896j893938j468778r73999o72341m21702R0897Q30769J546025
$$ 532328069 530271173 528377235 526908457 525934458 525262117 524840415 524931312 525762081 527308106
1160.5E27308106K115369K635241L075123L107488K620518K069652J891613J910150
$$ 527308106 529423475 532058716 535133839 538241327 540861845 542931497 544823110 546733260
1176.8E46733260J685262J156688O60717K63870k78354r74178j559794j880884k087832
$$ 546733260 548418522 549575210 550235927 550499797 550221443 549247265 547687471 545806587 543718755
1195.2E43718755k319455k461493k330244k045631j912653j968265k012491k038300
$$ 543718755 541399300 538937807 536607563 534561932 532649279 530681014 528668523 526630223
1211.5E26630223k238751k611220k922415l005445l018797l138125l280818l272534
$$ 526630223 524391472 521780252 518857837 515852392 512833595 509695470 506414652 503142118
1227.8E03142118l134548l037095l025204k969414k807856k707392k753526k849370
$$ 503142118 500007570 496970475 493945271 490975857 488168001 485460609 482707083 479857713
1244.1D79857713k811730k696365k704620k848089k966970k963961k992004l120094
$$ 479857713 477045983 474349618 471644998 468796909 465829939 462865978 459873974 456753880
1260.4D56753880l192783l120303l069043l160000l365963l475011l438413l502220
$$ 456753880 453561097 450440794 447371751 444211751 440845788 437370777 433932364 430430144
1276.8D30430144l715545l857791l824652l854781m059762m278928m321694m361272
$$ 430430144 426714599 422856808 419032156 415177375 411117613 406838685 402516991 398155719
1293.1C98155719m578620m838765m938215m918873m963994n073458n187214n150914
$$ 398155719 393577099 388738334 383800119 378881246 373917252 368843794 363656580 358505666
1309.4C58505666n095154n159884n192549n142122n164444n284459n489707n705535
$$ 358505666 353410512 348250628 343058079 337915957 332751513 327467054 321977347 316271812
1325.7C16271812n802244n911052n982727n950302n945623o235361o552160o405950
$$ 316271812 310469568 304558516 298575789 292625487 286679864 280444503 273892343 267486393
1342B67486393o193041o278545o485254o626561o676942o712794o727532o620183o710932
$$ 267486393 261293352 255014807 248529553 241902992 235226050 228513256 221785724 215165541 208454609
1360.4B08454609p078499o959796o499365o488651o400749o342977o600440o339207
$$ 208454609 201376110 194416314 187916949 181428298 175027549 168684572 162084132 155744925
1376.7A55744925n972832n892888n663127n370944n447314n332298m709386m644431
$$ 155744925 149772093 143879205 138216078 132845134 127397820 122065522 117356136 112711705
1393A12711705n010545m872009m661389m319116l887713l779456l345996k774083k384640
$$ 112711705 107701160 102829151 98167762 93848646 89960933 86181477 82835481 80061398 77676758
1411.4G7676758j945503j452863j084507o11618Q5332N82270Q91805J118034J354836
$$ 77676758 75731255 74278392 73193885 72582267 72667599 73249869 74141674 75259708 76614544
1429.7G6614544J444906J370549J415193J474999J203544J005121R01595Q14393Q00870
$$ 76614544 78059450 79429999 80845192 82320191 83523735 84528856 85430451 86244844 87045714
1448.1H7045714P47271O53021N68144O48625Q62107Q96126Q66227J008116J148142
$$ 87045714 87792985 88446006 89014150 89662775 90524882 91421008 92287235 93295351 94443493
1466.4I4443493J122064J189530J566887J859203J826614J881734K036504K212525
$$ 94443493 95565557 96755087 98321974 100181177 102007791 103889525 105926029 108138554
1482.8A08138554K299905K545639L122323L666699L553100L662906M478559M762307
$$ 108138554 110438459 112984098 116106421 119773120 123326220 126989126 131467685 136229992
1499.1A36229992M380673L886387M326239O049663N599901M550666M508197M689857
$$ 136229992 140610665 144497052 148823291 154872954 160472855 165023521 169531718 174221575
1515.4A74221575M877314M834816N318120N323723M769191M929528M665539M591018
$$ 174221575 179098889 183933705 189251825 194575548 199344739 204274267 208939806 213530824
1531.7B13530824N143642M634082M117161N591467O407813N569100N443290N477100
$$ 213530824 218674466 223308548 227425709 233017176 239424989 244994089 250437379 255914479
1548B55914479N888373O144017O281257O282836Q255392J0249496P160514O314993
$$ 255914479 261802852 267946869 274228126 280510962 288766354 299015850 306176364 312491357
1564.3C12491357O822706P018625P218868O031573N421787O242395N502909M525364
$$ 312491357 319314063 326332688 333551556 339583129 345004916 351247311 356750220 361275584
1580.7C61275584M534661M448951M080683L732502L487706L237337K940148K592921
$$ 361275584 365810245 370259196 374339879 378072381 381560087 384797424 387737572 390330493
1597C90330493K382756K310574K195745J877785J601815J493037J346320J008213P10398
$$ 390330493 392713249 395023823 397219568 399097353 400699168 402192205 403538525 404546738 405257136
1615.3D05257136O88195O73324N22971L46720L01570L73602N02616N31971N71639Q88347
$$ 405257136 405945331 406618655 407141626 407488346 407789916 408163518 408666134 409198105 409769744 410658091
1635.7D10658091J182914J185685J252026J433223J900494K304197J879006K142877
$$ 410658091 411841005 413026690 414278716 415711939 417612433 419916630 421795636 423938513
1652D23938513L345996K877176K431303K757072L410876L752709L367215L514171M127711
$$ 423938513 427284509 430161685 432592988 435350060 438760936 442513645 445880860 449395031 453522742
1670.4D53522742L872245L947944M253119L802031L527373L973216N066693M533082
$$ 453522742 457394987 461342931 465596050 469398081 472925454 476898670 481965363 486498445
1686.7D86498445L821701M159153M020273M264415M681348M604817N135059M256845
$$ 486498445 490320146 494479299 498499572 502763987 507445335 512050152 517185211 521442056
1703E21442056L532946L768802L523349L182352K925753K846301L240705L149330K460540
$$ 521442056 524975002 528743804 532267153 535449505 538375258 541221559 544462264 547611594 550072134
1721.4E50072134K275466K418399K442420K438545K306283K679944K933740K358616
$$ 550072134 552347600 554765999 557208419 559646964 561953247 564633191 567566931 569925547
1737.7E69925547K374410K581835K516925K515555K515495K581179K568006K233804
$$ 569925547 572299957 574881792 577398717 579914272 582429767 585010946 587578952 589812756
1754E89812756K104282K066135J886905J988589J908541J616836J506328J421869J422644
$$ 589812756 591917038 593983173 595870078 597858667 599767208 601384044 602890372 604312241 605734885
1772.4F05734885J154661N24223K3901l29554p14600j284540j817166k052069k291680
$$ 605734885 606889546 607413769 607437670 607108116 606393516 605108976 603291810 601239741 598948061
1790.7E98948061k402424k000451j492858r03726k4796Q16882J447261K066791K735734
$$ 598948061 596545637 594545186 593052328 592148602 592123806 592940688 594387949 596454740 599190474
1809.1E99190474L351450L606081L645002L800035L843725L541529L249287L184736
$$ 599190474 602541924 606148005 609793007 613593042 617436767 620978296 624227583 627412319
1825.4F27412319K936304K777397K644062K218009K018153K018035J780152J483083
$$ 627412319 630348623 633126020 635770082 637988091 640006244 642024279 643804431 645287514
1841.7F45287514J625299J821220J578808J361370J301527J323223J372278J308322
$$ 645287514 646912813 648734033 650312841 651674211 652975738 654298961 655671239 656979561
1858F56979561J209497J154483J094281J027048J104176J218021J134515J103997J083434
$$ 656979561 658189058 659343541 660437822 661464870 662569046 663787067 664921582 666025579 667109013
1876.4F67109013R67204R31442J003265J011432R13083R16660J003683R53197Q78990
$$ 667109013 668076217 669007659 670010924 671022356 671935439 672852099 673855782 674808979 675687969
1894.7F75687969Q83221Q79884Q83699Q47101P98702P92623Q32021Q56876P54059O39677
$$ 675687969 676571190 677451074 678334773 679181874 679980576 680773199 681605220 682462096 683216155 683855832
1915.1F83855832P12394Q49486P77483P30574P59721P29382O83605O05822N81980O71744
$$ 683855832 684568226 685417712 686195195 686925769 687685490 688414872 689098477 689704299 690286279 690958023
1935.5F90958023P47860O53445N62191O20425O77466O31988N13554M51148N25891N77748
$$ 690958023 691705883 692359328 692921519 693541944 694219410 694851398 695364952 695816100 696341991 696919739
1955.9F96919739M81248M20571M86373N53608N36025N09679N57602O54101O63757N46396
$$ 696919739 697400987 697821558 698307931 698861539 699397564 699907243 700464845 701118946 701782703 702329099
1976.3G02329099M83513N40853N84125M95792M11987M52518N31972N15103M12881M08710
$$ 702329099 702812612 703353465 703937590 704433382 704845369 705297887 705829859 706344962 706757843 707166553
1996.7G07166553M95672M98950L96788L30031L78132M60506M26530L31998L59118M73082
$$ 707166553 707662225 708161175 708557963 708887994 709266126 709726632 710153162 710485160 710844278 711317360
2017.1G11317360M55559L10540K76863L94524M65095L71873K89381L36229L98636L72589
$$ 711317360 711772919 712083459 712360322 712754846 713219941 713591814 713881195 714217424 714616060 714988649
2037.5G14988649L15666L39508M04537L89457L06606K87175L35395L82483L61860L02017
$$ 714988649 715304315 715643823 716048360 716437817 716744423 717031598 717366993 717749476 718111336 718413353
2057.9G18413353L29137L99291L79324L06607L04997L52323L56793L00467K82288L43740
$$ 718413353 718742490 719141781 719521105 719827712 720132709 720485032 720841825 721142292 721424580 721768320
2078.3G21768320L91125L47317K56478K51413L16143L19063K45750K22087K81811L14117
$$ 721768320 722159445 722506762 722763240 723014653 723330796 723649859 723895609 724117696 724399507 724713624
2098.7G24713624K50577J94014K65538L39151K53677J27971J47045K38955K63870J94668
$$ 724713624 724964201 725158215 725423753 725762904 726016581 726144552 726291597 726530552 726794422 726989090
2119.1G26989090J25051J63913K41816K25544J44183J58489K40624K36035J50501J23918
$$ 726989090 727114141 727278054 727519870 727745414 727889597 728048086 728288710 728524745 728675246 728799164
2139.5G28799164J97769K48730K13563J84059K38121L11315L00527K40385K81274L90947
$$ 728799164 728996933 729245663 729459226 729643285 729881406 730192721 730493248 730733633 731014907 731405854
2159.9G31405854L98338K96712K51591L37661M22716L94225K97367K96057M07099M28439
$$ 731405854 731804192 732100904 732352495 732690156 733112872 733507097 733804464 734100521 734507620 734936059
2180.3G34936059L12149K68519L75271M42505L46541K41697L05414M06444L53456K28762
$$ 734936059 735248208 735516727 735891998 736334503 736681044 736922741 737228155 737634599 737988055 738216817
2200.7G38216817K21432L02851L29077K62380J85907K29358L31879L23713K19524J91927
$$ 738216817 738438249 738741100 739070177 739332557 739518464 739747822 740079701 740403414 740622938 740814865
2221.1G40814865K81870L20971K25663J40071J68324J98304R3580l7194R656J49966
$$ 740814865 741096735 741417706 741643369 741783440 741951764 742150068 742243648 742206454 742216110 742366076
2241.5G42366076K14278K16782K77579M13716M83632L84271K26736K46346L88682L67761
$$ 742366076 742580354 742797136 743074715 743488431 743972063 744356334 744583070 744829416 745218098 745585859
2261.9G45585859J75416J08064K54333L75330K95997J60336J99676L10421K80559J51038
$$ 745585859 745761275 745869339 746123672 746499002 746794999 746955335 747155011 747465432 747745991 747897029
2282.3G47897029Q0347J33693J99318J13726O020O0856J07587J609j18494j08481k9981
$$ 747897029 747977376 748111069 748310387 748424113 748430133 748490989 748598576 748600185 748481691 748373210 748343229
2304.7G48343229n6863k08735k45988n9188K4617k26080n07355m10021m3094M3154
$$ 748343229 748286366 748077631 747831643 747772455 747797072 747570992 747063637 746653616 746610522 746653676
2325.1G46653676k18570k51591N8829J70231k9981j11759R4474L44932N25355Q03352
$$ 746653676 746435106 746183515 746242344 746412575 746382594 746270835 746365309 746710241 747235596 748038948
2345.5G48038948O25372k32578r52899j053095p08342k33292J32382L26633N00381
$$ 748038948 748664320 748431742 747478843 746425748 745717406 745484114 745616496 745943129 746443510
2363.8G46443510P53820R93431J058161J009762R96113J004338R33588P75516O19471
$$ 746443510 747197330 748190761 749248922 750258684 751254797 752259135 753192723 753968239 754587710
2382.2G54587710N13673L76343J90199O0201N5909R1731P6473L9935N305L2484J01626
$$ 754587710 755101383 755477726 755667925 755728126 755784035 755875766 755952239 755992174 755997479 756029963 756131589
2404.6G56131589N2870o5804o1154K5630N3823j9670j17659j04964l0518n1975j44005
$$ 756131589 756184459 756118655 756057501 756083131 756136954 756117284 755999625 755894661 755864143 755812168 755668163
2427.1G55668163j61707j05083q8692j62422k34187k18392k04861k91168l99650l96668
$$ 755668163 755506456 755401373 755312681 755150259 754916072 754697680 754492819 754201651 753802001 753405333
2447.5G53405333l54946m27783n70654o50287o54280o92964q45134j013756j065314
$$ 753405333 753050387 752622604 752051950 751401663 750747383 750054419 749209285 748195529 747130215
2465.8G47130215j069426j213253j479924j658558j718760j791775j980543k219141
$$ 747130215 746060789 744847536 743367612 741709054 739990294 738198519 736217976 733998835
2482.1G33998835k314567k287865k332926k453387k449035k288580k136469k060294
$$ 733998835 731684268 729396403 727063477 724610090 722161055 719872475 717736006 715675712
2498.5G15675712j967252j797497j658857j636565j644015j563668j408875j296282
$$ 715675712 713708460 711910963 710252106 708615541 706971526 705407858 703998983 702702701
2514.8G02702701j235783j067460p40289m02868j56522O4612L71694P39932J037598
$$ 702702701 701466918 700399458 699659169 699256301 699099779 699164391 699536085 700276017 701313615
2533.1G01313615J209497J354933J536429J654029J654208J613974J630485J708567
$$ 701313615 702523112 703878045 705414474 707068503 708722711 710336685 711967170 713675737
2549.4G13675737J690746J508295J300574J179516J118541R98616Q21829P31885P06971
$$ 713675737 715366483 716874778 718175352 719354868 720473409 721472025 722293854 723025739 723732710
2567.8G23732710O03258M59135L83437L54409L18170K59339J85430J54317J81615J54257
$$ 723732710 724335968 724795103 725178540 725532949 725851119 726110458 726295888 726450205 726631820 726786077
2588.2G26786077O5863M3273J17004J89364J79827J57833J99616K56241K63810K49326
$$ 726786077 726851940 726895213 727012217 727201581 727381408 727539241 727738857 727995098 728258908 728508234
2608.6G28508234K94864M02093M91083N26905N51820N95510O34670O26445O07371O40512
$$ 728508234 728803098 729205191 729696274 730223179 730774999 731370509 732005179 732631624 733238995 733879507
2629G33879507O92129O95705O33955N70655N88059O42121N86748M52221M11630M38451
$$ 733879507 734571636 735267341 735901296 736471951 737060010 737702131 738288879 738741100 739152730 739591181
2649.4G39591181L58999J99318J28329J52290J41501L9339n9783q3268p0930q4996
$$ 739591181 739950180 740149498 740277827 740430117 740571618 740610957 740551174 740467906 740396976 740311980
2669.8G40311980j06871j15633j51455j88709j95562j71483j56343j83463k05517k06828
$$ 740311980 740205109 740089476 739938021 739749312 739553750 739382267 739225924 739042461 738836944 738630116
2690.2G38630116k14934k32458k61248k76446k34604k13444k59876l07501l29375l12328
$$ 738630116 738415182 738182724 737921476 737645030 737410426 737196982 736937106 736629605 736300230 735987902
2710.6G35987902k74539k74301k89082l00169l64721m32432l90530k69055k17616k75612
$$ 735987902 735713363 735439062 735149980 734849811 734485090 734052658 733662128 733393073 733175457 732899845
2731G32899845l27230l35157l42369l40104l22103l30925l69966l83199l36349l01897
$$ 732899845 732572615 732237458 731895089 731554985 731232882 730901957 730531991 730148792 729812443 729510546
2751.4G29510546l40581l75927l62277l54230l93331m41075m42445m25458m37856m76300
$$ 729510546 729169965 728794038 728431761 728077531 727684200 727243125 726800680 726375222 725937366 725461066
2771.8G25461066n06461m72128m41909m94659n51224n81741o40571p06852o95109o29902
$$ 725461066 724954605 724482477 724040568 723545909 722994685 722412944 721772373 721065521 720370412 719740510
2792.2G19740510o40154p21514p33078p01785p46250q05318q56281r27925r31918q92103
$$ 719740510 719100356 718378842 717645764 716943979 716197729 715392411 714536130 713608205 712676287 711784184
2812.5G11784184r33588j019120j083612j128376j151442j186550j277208j393020
$$ 711784184 710850596 709831476 708747864 707619488 706468046 705281496 704004288 702611268
2828.9G02611268j466990j546323j709223j908422k053201k230584k629161l183306
$$ 702611268 701144278 699597955 697888732 695980310 693927109 691696525 689067364 685884058
2845.2F85884058l486454l108919k198636j382232r74655q69691q73864r10223j060962
$$ 685884058 682397604 679288685 677090049 675707817 674733162 673863471 672989607 672079384 671018422
2863.5F71018422j298964j478017j597583j651049j467406j086236q38518q12709q45373
$$ 671018422 669719458 668241441 666643858 664992809 663525403 662439167 661600649 660787940 659942567
2881.9F59942567q73565q73983q37982q48770r24289r56834q78691p69377p87258q99792
$$ 659942567 659069002 658195019 657357037 656508267 655583978 654627144 653748453 652979076 652191818 651292026
2902.3F51292026r63449j066089j374364j839399k242446k377212k152384j651227
$$ 651292026 650328577 649262488 647888124 646048725 643806279 641429067 639276683 637625456
2918.6F37625456j067639n85854k82585q1897J53542M57048O92725Q08776R03725R81808
$$ 637625456 636557817 635971963 635689378 635607481 635761023 636218071 636910796 637719572 638623297 639605105
2939F39605105R43363Q29696P74205P03812M68850J40130o9976j27077j31249n1498
$$ 639605105 640548468 641378164 642152369 642856181 643325031 643465161 643395185 643268108 643136859 643085361
2959.4F43085361J36971L62396N90265P95722R69827J056552J008451R34959Q38577
$$ 643085361 643222332 643584728 644174993 644970715 645940542 646997094 648005545 648940504 649779081
2977.8F49779081P05898O83963P34866O56605M60863K93374K49863L16262L18706K45154
$$ 649779081 650484979 651168942 651903808 652560413 653021276 653314650 653564513 653880775 654199481 654444635
2998.1F54444635J91271J44541J35184J10626k2531j43528r2983L4333M6610l8564
$$ 654444635 654635906 654780447 654915631 655026257 655003726 654860198 654767215 654801548 654848158 654809594
3018.5F54809594j04964j89364l04639m19855n44071n89133n83410o25908p01189p90298
$$ 654809594 654704630 654515266 654210627 653790772 653246701 652657568 652074158 651448250 650747061 649956763
3038.9F49956763q49068q42929q08835q17418q69990r07719r38356r41515q74936q41856
$$ 649956763 649107695 648264766 647455931 646638513 645768523 644860804 643922448 642980933 642105997 641264141
3059.3F41264141r16779r95279r75728q83996q43704q78513r05394r50099r84311r32455
$$ 641264141 640347362 639352083 638376355 637492359 636648655 635770142 634864748 633914649 632930338 631997883
3079.7F31997883r07957r32098q78036q33928q81851q91685q65639r38236j073063
$$ 631997883 631089926 630157828 629279792 628445864 627564013 626672328 625806689 624868453 623795390
3098.1F23795390j082122r72390r62615j089216j156687j082480j060605j171649j241565
$$ 623795390 622713268 621740878 620778263 619689047 618532360 617449880 616389275 615217626 613976061
3116.4F13976061j193046j100004j092017j203537j314818j336992j296222j302004
$$ 613976061 612783015 611683011 610590994 609387457 608072639 606735647 605439425 604137421
3132.8F04137421j372099j410902j424968j428068j431048j472592j528800j590669
$$ 604137421 602765322 601354420 599929452 598501384 597070336 595597744 594068944 592478275
3149.1E92478275j607239j558900j544535j598775j658976j654268j614332j610219
$$ 592478275 590871036 589312136 587767601 586168826 584509850 582855582 581241250 579631031
3165.4E79631031j650870j703799j711667j709222j755119j795530j780093j735210
$$ 579631031 577980161 576276362 574564695 572855473 571100354 569304824 567524731 565789521
3181.7E65789521j715601j736402j755178j734317j712322j772761j848757j809299
$$ 565789521 564073920 562337518 560582340 558848023 557135701 555362940 553514183 551704884
3198E51704884j749218j742840j716315j695455j696586j701176j731754j737714j681506
$$ 551704884 549955666 548212826 546496511 544801056 543104470 541403294 539671540 537933826 536252320
3216.4E36252320j649141j672686j664698j641094j645327j643419j652956j632512
$$ 536252320 534603179 532930493 531265795 529624701 527979374 526335955 524682999 523050487
3232.7E23050487j585126j592159j598895j572668j571358j593947j613796j629591
$$ 523050487 521465361 519873202 518274307 516701639 515130281 513536334 511922538 510292947
3249E10292947j611650j573145j572490j617968j646161j617134j580625j551539j513809
$$ 510292947 508681297 507108152 505535662 503917694 502271533 500654399 499073774 497522235 496008426
3267.4D96008426j479417j478762j499503j462132j378894j353621j355976j311899
$$ 496008426 494529009 493050247 491550744 490088612 488709718 487356097 486000121 484688222
3283.7D84688222j279950j270294j231223j200885j237035j273870j238972j189023
$$ 484688222 483408272 482137978 480906755 479705870 478468835 477194965 475955993 474766970
3300D74766970j183689j182586j163900j191199j259297j298427j302749j323134j368314
$$ 474766970 473583281 472400695 471236795 470045596 468786299 467487872 466185123 464861989 463493675
3318.4D63493675j382500j357734j378864j491845j582831j582921j562207j522661
$$ 463493675 462111175 460753441 459374577 457882732 456299901 454716980 453154773 451632112
3334.7D51632112j459181j465738j541167j535416j437515j369059j327783j305491
$$ 451632112 450172931 448707193 447166026 445630610 444193095 442824036 441496253 440190762
3351D40190762j338511j358599j289159j190156j196205j237274j142084j031965j077145
$$ 440190762 438852251 437493652 436204493 435014337 433818132 432580858 431438774 430406809 429329664
3369.3D29329664j199574j185953j037866r47625r29534r42648r12547p88688o56009
$$ 429329664 428130090 426944137 425906271 424958646 424029112 423086464 422173917 421385229 420729220
3387.7D20729220n64158n73963p06226p48068n72890m06921m62889n86748n11915l49909
$$ 420729220 420165062 419591099 418884873 418136805 417563915 417156994 416694105 416107357 415595442 415245533
3408.1D15245533l07620l16858k85029k50250j88202j00285o1333j5646J11937K58923
$$ 415245533 414937913 414621055 414336026 414085776 413897574 413797289 413735956 413720310 413832247 414091170
3428.5D14091170K80112K97695L54290K83927K15709K96623M01944N11020O78629O85513
$$ 414091170 414371282 414668977 415023267 415307194 415522903 415819526 416221470 416732490 417411119 418096632
3448.9D18096632O01530O80804Q41439R89914J079768J042336J008421J106501J198143
$$ 418096632 418698162 419378966 420220405 421210319 422290087 423332423 424340844 425447345 426645488
3467.2D26645488J135468J022249J074106J221299J327723J384587J378864J334518
$$ 426645488 427780956 428803205 429877311 431098610 432426333 433810920 435189784 436524302
3483.6D36524302J361400J454442J517356J574933J622856J653791J628965J604437
$$ 436524302 437885702 439340144 440857500 442432433 444055289 445709080 447338045 448942482
3499.9D48942482J709134J759231J642048J682401J854301J896291J868845J851558
$$ 448942482 450651616 452410847 454052895 455735296 457589597 459485888 461354733 463206291
3516.2D63206291J855195J893639K036810K109528K025932K057969K180577K195835
$$ 463206291 465061486 466955125 468991935 471101463 473127395 475185364 477365941 479561776
3532.5D79561776K236605K334654K294153K252370K361238K545148K579898K412021
$$ 479561776 481798381 484133035 486427188 488679558 491040796 493585944 496165842 498577863
3548.8D98577863K420396K612471K591849K494990K596677K704143K560437K700090
$$ 498577863 500998259 503610730 506202579 508697569 511294246 513998389 516558826 519258916
3565.1E19258916L500164L521919K740205K596735K926887L113448L171265L103197
$$ 519258916 522759080 526280999 529021204 531617939 534544826 537658274 540829539 543932736
3581.5E43932736K878129L070176L812611L663778K838552K958179L469825L465533
$$ 543932736 546810865 549881041 553693652 557357430 560195982 563154161 566623986 570089519
3597.8E70089519L365517L300786K997994K988696L580213L708362L358782L155291
$$ 570089519 573455036 576755822 579753816 582742512 586322725 590031087 593389869 596545160
3614.1E96545160K785504L208756M004300L246724K192676K421856M545331N218745
$$ 596545160 599330664 602539420 606543720 609790444 611983120 614404976 618950307 624169052
3630.4F24169052L096997K601207K993881K932549K856910K503693J946152K398312
$$ 624169052 627266049 629867256 632861137 635793686 638650596 641154289 643100441 645498753
3646.7F45498753M326343M482091K035796J507521K807796K637088J836419J695931
$$ 645498753 649825096 654307187 656342983 657850504 660658300 663295388 665131807 666827738
3663F66827738J289308J060307K178669K454222J155912K304078K913952J066923M76002
$$ 666827738 668117046 669177353 671356022 673810244 674966156 677270234 680184186 681251109 681727111
3681.4F81727111L38197J34885J088381K269030J330018Q1062J0550K43485O59466
$$ 681727111 682065308 682200193 683288574 685557604 686887622 686968684 686979234 687222719 687882185
3699.8F87882185J408339J206398K60770K98917J393736K194881J111686j57773k15590
$$ 687882185 689290524 690496922 690757692 691056609 692450345 694645226 695756912 695599139 695383549
3718.1F95383549J73747M48525N54860N21302k0265m10498K18571J306593J597047
$$ 695383549 695557296 696005821 696560681 697081983 697061718 696651220 696869791 698176384 699773431
3736.5F99773431K25782j432478q94368J540840R76145m02629J157462J326204m66884
$$ 699773431 699999213 698566735 697672367 699213207 700189352 699786723 700944185 702270389 701803505
3754.8G01803505o23703M42148N09321l16977k31743J81019N17190O31928j30176n81622
$$ 701803505 701179802 701621950 702131271 701814294 701582551 701763570 702280760 702912688 702782512 702200890
3775.2G02200890p9751O14762L37541k23815j1981J18613J6332r7215l10004j21474
$$ 702200890 702121139 702735901 703073442 702849627 702837646 702956259 702972591 702875376 702565372 702443898
3795.6G02443898j46568j00136R04739L48628k31684O08743q1778j176119o70910O23524
$$ 702443898 702297330 702197194 703101933 703450561 703218877 703827620 703745842 702569723 701898813 702522337
3816G02522337L19958K01404J052261o4373p20919l98516l15964q4103j59621R5129
$$ 702522337 702842295 703043699 704095960 704031587 703310668 702912152 702596188 702512085 702352464 702447593
3836.4G02447593R39608O40631o2228k28524p25984j485885j327037J363754K971470
$$ 702447593 703387201 704027832 703965604 703737080 703011096 701525211 700198174 701561928 704533398
3854.8G04533398n1617j568795r62317Q7858L80337l93927o0737P62581J88291l12149
$$ 704533398 704481781 702912986 701950669 702038527 702418864 702024937 701964200 702726781 702915072 702602923
3875.2G02602923o94513l39687L65376j9431K25723N4836o20782K23577L36289q67665
$$ 702602923 701908410 701568723 701934099 701914668 702140391 702195227 701574445 701798022 702134311 701266646
3895.5G01266646r22739j9848N25772P94947N05388l63409o14405m40955m63844j43528
$$ 701266646 700343907 700324059 700849831 701644778 702150166 701786757 701172352 700731397 700267553 700124025
3915.9G00124025L64066J30355l07024q0466O5506l41714k61247K69115J37746l21567
$$ 700124025 700488091 700618446 700311422 700230956 700296462 699954748 699693501 699962616 700100362 699778795
3936.3F99778795l92079k19584N3466L4332j50502K9147P2718j70410k12431j27435
$$ 699778795 699386716 699167132 699220598 699254930 699104428 699133575 699206293 699035883 698823452 698696017
3956.7F98696017j22428p0154k8611j48952j78098m0353K6167p630m5836j04427j40667
$$ 698696017 698573589 698503435 698474824 698325872 698147774 698107421 698133588 698125958 698080122 697975695 697835028
3979.2F97835028j03593p7784r3519r8289n9902j1325L695K4379J8835
$$ 697835028 697731435 697653651 697560132 697461843 697401941 697390616 697394311 697418690 697437525
3997.5F97437525
$$ 697437525
##END=$$ End of the data block
