##TITLE=$$ Begin of the data block
##JCAMP-DX=5.00 $$ ACD/SpecManager v 10.08
##SPECTROMETER/DATA SYSTEM=Alpha
##DATE=13 Jun 2014 08:26:00
##DATA TYPE=INFRARED SPECTRUM
##DATA CLASS=XYDATA
##ORIGIN=
##OWNER=
##NPOINTS=1765
##FIRSTX=399.75695801
##LASTX=3997.56933594
##MAXX=3997.56933594
##MINX=399.75695801
##MAXY=0.76095217
##MINY=0.07244449
##XFACTOR=1.0000000000
##YFACTOR=1.000000000000000e-9
##FIRSTY=0.38709867
##DELTAX=2.03957629
##XUNITS=1/CM
##YUNITS=ARBITRARY UNITS
##XYDATA=(X++(Y..Y))
399.8 387098670 395986378 404769659 414693207 424744993 433717340 442223638 451078385 459833443
416.1 459833443 468917757 477849603 485154569 492075861 498661101 504287004 510057688 516362488
432.4 516362488 522094607 526888251 531692684 536925197 541807711 545556307 548917890 552939653
448.7 552939653 556940377 559776068 562016726 565100372 568349957 570081890 570977688 572737575 575570643
467.1 575570643 578136504 580008686 582318485 585529864 588705659 591151714 593357265 596117139
483.4 596117139 599178851 601588130 603348434 605478823 607999086 609918118 611207366 612665057
499.7 612665057 614566982 616302311 617398441 618166864 619048178 619891822 620356917 620691061 621311724
518.1 621311724 622082651 622568786 622789383 623143196 623725712 624314010 624801219 625297546 626091242 627276301
538.4 627276301 628418624 629183710 629851103 630716920 631587386 632104218 632288575 632420659 632521331 632439673
558.8 632439673 632304490 632463694 632891953 633113682 632917166 632690072 632804871 633103609 633257806 633375227
579.2 633375227 633789837 634480476 635252833 636014462 636679113 637169421 637490511 637800992 638089418 638061464
599.6 638061464 637633324 636935055 635893881 634522796 633425832 633139729 633322358 633448660 633769751
618 633769751 634759843 636136174 637257457 638058543 639002442 640204251 641289890 642155826 643318951
636.3 643318951 645034015 646599114 647369802 647800207 648483217 649055600 648969531 648538113 648407340 648413718
656.7 648413718 647948146 647095859 646558106 646361470 645591080 644619882 644959152 645759523 646182835 646064937
677.1 646064937 645725489 645574450 645476878 644834101 643442035 641696870 639643371 636628985 632238925
695.5 632238925 626752198 620967388 615050614 607713044 598165512 587309480 576585412 567728579
711.8 567728579 562262297 559857309 559479356 561906874 568432271 579098105 593095422 609005451
728.1 609005451 624964297 639388919 651566386 661404014 668834150 673992455 677527666 680211008
744.4 680211008 682283461 683577180 684217155 684740901 685423732 685931802 685979307 685825944 685871422 686104834
764.8 686104834 686273932 686390698 686733544 687353492 687927186 688220739 688436151 688874364 689393640 689631939
785.2 689631939 689572692 689484715 689441562 689344227 689176798 689068973 689138949 689220309 689088583 688784778 688521326
807.7 688521326 688282013 687745690 686771274 685649455 684595883 683432043 681917250 680032015 678014696
826 678014696 675909460 673355162 670105100 666353643 662294090 657656431 651879609 644549489 634845257
844.4 634845257 622870445 613006055 608506799 605215728 598208010 587095499 572496176 553663373
860.7 553663373 528455019 492383212 438500434 366911799 297277272 253304213 237877831
875 237877831 243544698 269576341 315516442 375277519 441569358 507229507 564124525 606701374
891.3 606701374 635107875 653379202 665965855 675565183 682870388 687971711 691622019 694818616
907.6 694818616 697704852 699695289 700748503 701582491 702484608 702873111 702431500 701760948 701481104
926 701481104 701287746 700525999 699430346 698806286 698685646 698303699 697429419 696725249 696500063 696107507
946.4 696107507 694947422 693300962 691745520 690158665 687948346 685078382 682194710 679559767
962.7 679559767 676554441 672779918 668759644 664960623 660888195 655871034 650057077 643976808
979 643976808 637624145 630597353 623015165 615628898 608872175 602361917 595798790 589628518 584303677
997.3 584303677 579447985 574349999 568953276 563618541 558246970 552380919 546091497 540081501
1013.7 540081501 534850061 530266404 526176572 522924840 520882726 519767880 518971086 518426239 518509626
1032 518509626 519180715 519806445 519970477 519836962 519574583 518948972 517810047 516582191 515835881 515780687
1052.4 515780687 516359925 517589927 519626856 522332847 524968326 526749730 527362049 526690423 524531424
1070.8 524531424 520999372 516883731 513100982 509967387 507522464 506437838 507321417 509796143
1087.1 509796143 513230622 517224789 521299422 524819851 527247012 528442323 528825343 529100597 529753625
1105.4 529753625 530815363 532113135 533609629 535301566 536909938 538001120 538496077 538752317 539037824
1123.8 539037824 539227784 539208829 539165676 539138258 538729966 537598610 535867453 533901572 531909347
1142.2 531909347 529899120 528016090 526568532 525635242 525004566 524603724 524680495 525478363 526988149
1160.5 526988149 529069543 531658769 534656644 537662864 540206730 542271256 544207394 546157122
1176.8 546157122 547840476 548964083 549580753 549813330 549540699 548574567 546979070 545056641 542975962
1195.2 542975962 540676773 538228452 535917103 533863127 531926572 529969692 527976394 525923491
1211.5 525923491 523679376 521090806 518183291 515188038 512201786 509099185 505814552 502513230
1227.8 502513230 499363571 496338218 493344247 490386188 487558335 484836817 482064396 479198366
1244.1 479198366 476413548 473749369 471033901 468146980 465161502 462214857 459252417 456147373
1260.4 456147373 452934295 449775904 446686357 443532944 440177232 436694264 433233887 429712594
1276.8 429712594 426000178 422167540 418363631 414500386 410414606 406104207 401732892 397344172
1293.1 397344172 392798752 387991935 383047909 378134102 373182505 368084759 362867564 357729197
1309.4 357729197 352668464 347532362 342333913 337151378 331954479 326688349 321248800 315562606
1325.7 315562606 309736520 303803027 297811568 291866332 285935879 279695123 273125917 266729683
1342 266729683 260549694 254267484 247802511 241206735 234525949 227804303 221082315 214485735 207806766
1360.4 207806766 200731695 193775192 187306926 180844679 174442396 168098420 161526650 155222386
1376.7 155222386 149273723 143398270 137752146 132406965 127004504 121721342 117024563 112345159
1393 112345159 107285954 102402717 97782008 93530834 89693666 85932836 82598701 79858631 77525131
1411.4 77525131 75612962 74162930 73067375 72444491 72521359 73109090 74013285 75135194 76509759
1429.7 76509759 77985808 79355858 80753379 82259111 83523549 84551379 85449927 86263165 87045059
1448.1 87045059 87767228 88412695 88977709 89625522 90524107 91452256 92302211 93303479 94506256
1466.4 94506256 95682919 96877865 98424502 100303464 102165662 104028165 106030636 108270943
1482.8 108270943 110639445 113231137 116350770 120007627 123581067 127265677 131770968 136580169
1499.1 136580169 140987575 144851193 149114385 155155614 160835758 165456891 169996753 174687237
1515.4 174687237 179589093 184472129 189803079 195127219 199922547 204884514 209562883 214154482
1531.7 214154482 219316632 223957404 228025243 233578041 240057096 245708078 251175970 256656080
1548 256656080 262572914 268756002 275038123 281274498 289457142 299709111 306940049 313302696
1564.3 313302696 320136011 327133894 334333420 340365469 345784545 352030843 357545078 362063468
1580.7 362063468 366577357 370989263 375006765 378667831 382088482 385261536 388158500 390741557
1597 390741557 393119127 395386994 397495031 399280727 400794089 402178079 403429776 404374868 404989779
1615.3 404989779 405536562 406112939 406570435 406846076 407107592 407456249 407921672 408431739 408988714 409891516
1635.7 409891516 411164522 412436515 413735092 415207565 417189926 419644594 421630710 423800588
1652 423800588 427273721 430349439 432911366 435753912 439234048 443081051 446559459 450162739 454352051
1670.4 454352051 458268493 462270230 466631323 470545411 474114090 478072047 483197629 487867773
1686.7 487867773 491733611 495882601 499928772 504231274 508943081 513590038 518804729 523133636
1703 523133636 526687443 530500352 534127712 537397504 540353715 543187857 546428084 549648881 552186430
1721.4 552186430 554505765 556957662 559416473 561850190 564147711 566818833 569782138 572201014
1737.7 572201014 574604094 577191472 579728186 582254231 584753692 587321579 589915991 592189968
1754 592189968 594315767 596414089 598354697 600381911 602290332 603874326 605345905 606748343 608184099
1772.4 608184099 609397292 609962940 609993756 609655976 608919144 607615709 605812728 603792131 601489544
1790.7 601489544 599043727 597042382 595584750 594701827 594675004 595509946 596979141 599045157 601796746
1809.1 601796746 605203092 608861327 612512410 616288781 620115340 623660088 626928866 630138457
1825.4 630138457 633098900 635905445 638580859 640815318 642840683 644869208 646654546 648110569
1841.7 648110569 649685264 651514173 653173029 654604435 655920088 657236934 658623099 659952879
1858 659952879 661156237 662283838 663376808 664432824 665556729 666785598 667927444 669003963 670053542
1876.4 670053542 671044230 672039926 673082530 674092114 674982488 675867796 676861525 677830935 678706288
1894.7 678706288 679563701 680435956 681353509 682255626 683070838 683845818 684678078 685534418 686274230 686919510
1915.1 686919510 687645316 688494682 689265192 689961016 690692604 691463590 692223310 692866862 693428755 694067240
1935.5 694067240 694801927 695443451 695980549 696584404 697263002 697891533 698418200 698916554 699466288 700023949
1955.9 700023949 700491250 700924754 701442301 702024758 702571154 703090608 703649342 704284370 704938054 705494225
1976.3 705494225 705993891 706536353 707098603 707575142 707986832 708455443 709005773 709514260 709911287 710329294
1996.7 710329294 710845590 711350977 711756110 712120116 712528348 712989271 713408709 713723540 714043021 714502454
2017.1 714502454 714989841 715328634 715622365 716020882 716457725 716808140 717117131 717483938 717900276 718281627
2037.5 718281627 718599737 718951583 719376206 719771862 720087886 720394433 720737934 721114218 721462727 721766949
2057.9 721766949 722124398 722547770 722930133 723231912 723534167 723886669 724253833 724573731 724857628 725178659
2078.3 725178659 725548744 725885749 726154923 726449907 726802766 727136493 727391601 727620542 727919459 728262842
2098.7 728262842 728538215 728740454 728991568 729329705 729623020 729789734 729945600 730181098 730426252 730599105
2119.1 730599105 730746686 730951190 731205523 731433153 731572092 731709778 731938660 732176542 732332408 732474446
2139.5 732474446 732697904 732976258 733201981 733367264 733603418 733948052 734279633 734528959 734814763 735213041
2159.9 735213041 735611737 735915422 736175895 736518145 736961186 737360418 737644374 737963974 738406777 738852084
2180.3 738852084 739177227 739447653 739814579 740246117 740604937 740882218 741195560 741598547 741979778 742237329
2200.7 742237329 742459834 742759347 743091881 743366301 743580222 743828475 744162440 744484365 744709313 744921088
2221.1 744921088 745201528 745491564 745701075 745853126 746053100 746272981 746354759 746298730 746304274 746472895
2241.5 746472895 746728122 746984124 747276723 747688651 748162985 748535037 748759925 748997569 749359906 749727190
2261.9 749727190 749966979 750148177 750399888 750732541 751020133 751211166 751448572 751776338 752061069 752233565
2282.3 752233565 752361298 752536297 752712965 752751470 752716899 752809227 752986968 753053665 752987206 752926588 752944708
2304.7 752944708 752914846 752685785 752418697 752356827 752374113 752182543 751746237 751334548 751217186 751218140 750996828
2327.1 750996828 750728488 750779808 751020074 751064062 750929713 750980079 751320183 751873076 752735972 753389716
2347.5 753389716 753161788 752242386 751210332 750467479 750191689 750302434 750635386 751192808 751992285
2365.9 751992285 752978981 754053473 755071580 756051838 757066131 758008778 758785307 759391665 759854138
2384.2 759854138 760180652 760363817 760440469 760514140 760644078 760769069 760808051 760774434 760787129 760885417 760939598
2406.7 760939598 760882676 760831535 760876536 760952175 760926485 760785937 760697782 760715902 760691345 760558665 760393143
2429.1 760393143 760274291 760182321 759995401 759732187 759540200 759377420 759092569 758685470 758265734 757896304
2449.5 757896304 757511079 756980777 756326914 755677223 755000532 754152298 753115356 752012670 750911593
2467.9 750911593 749697566 748221993 746540189 744830489 743080080 741091311 738834918 736494541
2484.2 736494541 734184563 731840909 729387164 726927519 724630058 722497344 720417917 718391240
2500.5 718391240 716553390 714924157 713334382 711699903 710132897 708744705 707477093 706246376
2516.8 706246376 705165327 704405308 703992724 703834951 703899980 704289258 705062926 706135452 707371414
2535.2 707371414 708729684 710258603 711920381 713582158 715218186 716912925 718677819 720364034
2551.5 720364034 721851170 723183036 724418700 725566924 726579130 727417052 728151262 728851616 729472280
2569.8 729472280 729949117 730315685 730653107 730990350 731285095 731508911 731693149 731863916 731986403 732053220
2590.2 732053220 732143521 732304275 732495248 732665718 732813954 732981920 733213961 733482718 733760774 734103084
2610.6 734103084 734546542 735053658 735570312 736120284 736724675 737347841 737988293 738650739 739335418 740026891
2631 740026891 740687430 741313994 741919816 742528260 743166089 743768036 744252384 744662464 745064497 745416939
2651.4 745416939 745656371 745819867 745984554 746143997 746197760 746122599 746049643 746039927 745977163 745818913 745662987
2673.9 745662987 745531201 745384693 745216429 745048165 744893193 744728386 744532704 744308889 744076967 743837774
2694.3 743837774 743572295 743297696 743039012 742772341 742502987 742251694 741984487 741714716 741461158 741162002
2714.6 741162002 740827143 740503788 740154147 739766419 739407063 739115119 738851070 738574862 738269031 737938106
2735 737938106 737610221 737302303 737013698 736697912 736297965 735868752 735535026 735266864 734941065 734554231
2755.4 734554231 734175503 733811855 733412981 732989550 732585430 732181251 731732666 731222332 730693161 730223119
2775.8 730223119 729783177 729290724 728744447 728171527 727550030 726842344 726119399 725465834 724823177 724119186
2796.2 724119186 723386824 722659707 721898913 721078098 720194519 719257534 718329906 717422247 716477454 715470970
2816.6 715470970 714387417 713246644 712083220 710889101 709632099 708266139 706776619 705176175
2832.9 705176175 703438699 701524675 699472010 697248399 694627404 691436708 687921524 684760511
2849.3 684760511 682515562 681135774 680155993 679229617 678310275 677397013 676340520 675029337 673530817
2867.6 673530817 671920240 670280039 668848455 667764902 666861057 665997744 665168941 664327621 663473606
2886 663473606 662638068 661789894 660898089 659961879 659057021 658245981 657436728 656568468 655648232 654571652
2906.4 654571652 653192580 651424646 649238288 646821618 644607186 642921209 641829193 641237915
2922.7 641237915 640976667 640891016 641008615 641484380 642249584 643097699 644009292 645008326 645973384 646816373
2943.1 646816373 647583485 648286939 648773789 648912132 648842633 648743331 648627043 648551583 648655593 649020314
2963.5 649020314 649654150 650507748 651483059 652472734 653449893 654446661 655367017 656120241 656813800 657531977
2983.9 657531977 658190727 658691883 659018040 659285128 659625471 659936368 660120010 660278261 660456777 660606563
3004.3 660606563 660691082 660661399 660519361 660407364 660450101 660555363 660558701 660443425 660228074 659905493
3024.7 659905493 659463823 658898592 658297598 657713056 657118201 656441867 655600727 654683292 653831542 653040171
3045.1 653040171 652240574 651380956 650454104 649482787 648526907 647652686 646793962 645844817 644819498
3063.4 644819498 643819809 642916143 642060637 641192138 640284598 639298797 638277590 637317657 636409998
3081.8 636409998 635503769 634605229 633690178 632742882 631823242 630926788 629967690 628914595 627858758
3100.1 627858758 626870751 625845909 624718308 623581707 622481525 621343851 620112777 618866265
3116.4 618866265 617706835 616600692 615454912 614231527 612923741 611541748 610145092 608771086
3132.8 608771086 607386351 605979800 604570746 603150308 601687074 600185096 598666310 597106278
3149.1 597106278 595496237 593858957 592205048 590545356 588884711 587240934 585597694 583902299
3165.4 583902299 582174063 580437839 578681350 576899946 575103879 573316574 571543753 569794416
3181.7 569794416 568038583 566214323 564361036 562545776 560751677 558944881 557134330 555335641
3198 555335641 553539455 551750302 549957693 548159182 546412528 544709861 542981625 541218877 539446115
3216.4 539446115 537695110 535989821 534307420 532623887 530960739 529277861 527534187 525830388
3232.7 525830388 524179161 522500634 520819306 519169450 517551482 515959799 514367163 512736559
3249 512736559 511102319 509517968 507927179 506257236 504554570 502920032 501337767 499736369 498147398
3267.4 498147398 496639550 495190114 493725002 492253244 490819246 489395201 487961352 486549765
3283.7 486549765 485185325 483865768 482604712 481397450 480171740 478900135 477624178 476372331
3300 476372331 475136787 473891288 472623467 471346349 470055640 468697578 467282444 465880811 464481145
3318.4 464481145 463025063 461513132 459982306 458420604 456799120 455160081 453545094 451927125
3334.7 451927125 450309962 448687941 447015047 445355982 443782866 442300826 440906763 439508289
3351 439508289 438046724 436579883 435173690 433844239 432535350 431225240 429976195 428819418 427674383
3369.3 427674383 426421136 425112337 423892826 422803432 421821386 420857847 419867635 418932408 418145716
3387.7 418145716 417511135 416886955 416136712 415345788 414693445 414186090 413653553 413022399 412462771 412071288
3408.1 412071288 411713570 411318779 410987973 410736084 410516649 410365462 410270065 410233587 410338312 410564661
3428.5 410564661 410795271 411069721 411422163 411722958 411945075 412244707 412713170 413281739 413916707 414577335
3448.9 414577335 415253043 416012526 416854918 417798251 418880701 419961184 420997858 422154456 423425853
3467.2 423425853 424652576 425757706 426878124 428135782 429502964 430928379 432346880 433733642
3483.6 433733642 435163140 436696172 438307971 439970136 441674441 443395257 445083797 446792364
3499.9 446792364 448597193 450379968 452043056 453803092 455786288 457860470 459902883 461866587
3516.2 461866587 463815153 465851009 468030065 470186502 472260475 474479675 476834178 479143471
3532.5 479143471 481485039 483950704 486382812 488772243 491285473 493975610 496678501 499226540
3548.8 499226540 501789153 504515946 507211685 509863138 512654722 515498221 518170476 520979643
3565.1 520979643 524563313 528308749 531394124 534214616 537243128 540481687 543818414 547140121
3581.5 547140121 550289094 553568363 557512224 561363459 564445972 567605376 571218371 574872911
3597.8 574872911 578528523 582157195 585437894 588620961 592338383 596221685 599812090 603202939
3614.1 603202939 606239498 609690785 613883495 617323935 619726717 622314513 626969039 632386267
3630.4 632386267 635782838 638601422 641756177 644889653 647918046 650568962 652683258 655229807
3646.7 655229807 659700096 664368153 666606963 668248832 671118379 673838377 675759971 677511454
3663 677511454 678878367 680034339 682256460 684780717 686064839 688368678 691258132 692430556 693030834
3681.4 693030834 693487287 693710327 694800854 697078586 698514342 698712766 698813736 699148834 699832499
3699.8 699832499 701168716 702395856 702790618 703127384 704406202 706555307 707801819 707762063 707552671
3718.1 707552671 707701087 708158314 708740354 709272206 709239662 708815753 708991468 710212827 711820304
3736.5 711820304 712213218 710949004 710052848 711457312 712414443 712049007 713180542 714550197 714166999
3754.8 714166999 713521898 713879704 714401841 714179754 714001060 714188397 714691222 715347409 715316176 714779496
3775.2 714779496 714642227 715221465 715596080 715408504 715411186 715526819 715508819 715374589 715074122 714978576
3795.6 714978576 714811563 714689970 715647042 716095865 715906322 716491282 716434181 715326369 714651167 715210676
3816 715210676 715533793 715713799 716693997 716641724 715964794 715623200 715336382 715192497 714996576 715071678
3836.4 715071678 715944290 716596961 716623604 716489851 715883076 714515090 713183999 714338839 717185915
3854.8 717185915 717252493 715818882 714940012 715021968 715373576 715025067 714918673 715568602 715795577 715601921
3875.2 715601921 714984536 714619458 714898050 714858830 715113163 715213478 714603364 714767039 715137780 714427292
3895.5 714427292 713612914 713585377 714005768 714670181 715160608 714880705 714314878 713913202 713515639 713347077
3915.9 713347077 713633537 713794589 713541031 713425696 713490903 713259339 713069975 713320494 713443339 713118732
3936.3 713118732 712722600 712521970 712629497 712708831 712493539 712394655 712472796 712430656 712280691 712143540
3956.7 712143540 712046504 711985171 711947739 711879432 711773694 711696744 711686015 711727262 711774170 711727858 711585343
3979.2 711585343 711477816 711421847 711341381 711269140 711253047 711219013 711125255 711104751 711161137
3997.5 711161137
##END=$$ End of the data block
