##TITLE=$$ Begin of the data block
##JCAMP-DX=5.00 $$ ACD/SpecManager v 10.08
##SPECTROMETER/DATA SYSTEM=Alpha
##DATE=13 Jun 2014 08:26:00
##DATA TYPE=INFRARED SPECTRUM
##DATA CLASS=XYDATA
##ORIGIN=
##OWNER=
##NPOINTS=1765
##FIRSTX=399.75695801
##LASTX=3997.56933594
##MAXX=3997.56933594
##MINX=399.75695801
##MAXY=0.69890982
##MINY=0.24538901
##XFACTOR=1.0000000000
##YFACTOR=1.000000000000000e-9
##FIRSTY=0.56137770
##DELTAX=2.03957629
##XUNITS=1/CM
##YUNITS=ARBITRARY UNITS
##XYDATA=(X++(Y..Y))
$$ plain form
399.8 561377704 571826458 582298160 589331150 591245234 591678321 593969226 596662581 597742796
416.1 597742796 598432422 600295901 602163017 602960825 602750838 602744401 604135752 606056869 606674433
434.4 606674433 606236696 606811941 608704209 609835565 608928382 607342362 606789768 607057989 606427193
452.8 606427193 604662895 603763700 604875922 606722295 607957900 608531058 609537899 611771286 614103079
471.1 614103079 615167439 616067290 618428946 621675491 624250472 625746489 627322674 629936516 632870853
489.5 632870853 634941459 636102557 637462258 639590323 641650319 642643988 642730892 642995238 643835127
507.9 643835127 644473970 644361734 644217014 644938231 646236420 647226810 647800267 648600876 650010586
526.2 650010586 651664615 653028905 653988481 654994667 656572223 658464432 659975171 661072612 662344873
$$ packed form
399.8E61377704J0448754J0471702P032990J914084M33087K290905K693355J080215
416.1E97742796O89626J863479J867116P97808k09987o437J391351J921117O17564
434.4F06674433m37737N75245J892268J131356r07183j586020n52594K68221o30796
452.8F06427193j764298q99195J112222J846373J235605N73158J006841K233387K331793
471.1F14103079J064360Q99851K361656L246545K574981J496017J576185K613842K934337
489.5F32870853K070606J161098J359701K128065K059996R93669Q6904K64346Q39889
507.9F43835127O38843j12236j44720P21217J298189R90390N73457Q00609J409710
526.2F50010586J654029J364290R59576J006186J577556J892209J510739J097441J272261
$$ plain form
544.6 662344873 664036930 665630817 666572273 667065501 667693794 668645859 669595599 670329511 671129584
562.9 671129584 672257125 673610330 674885750 675755918 676254630 676875532 677887380 678899407 679519534
581.3 679519534 679993927 680790603 681856573 682790458 683437586 683919013 684391379 684853315 685123861 684991539
601.7 684991539 684542179 684077799 683622062 683132529 682664692 682385564 682603419 683078468 683281422 683321953
622.1 683321953 683580160 684144795 684800625 685320318 685720921 686204314 686906815 687651873 688230932 688639820
642.5 688639820 689004898 689598083 690204978 690110862 689384460 688659072 687967539 686907351 685394168 683944881
662.9 683944881 684043288 686699152 687505722 684116542 681714892 680950165 680518329 679869413 678965330
681.2 678965330 677762628 676183939 674155593 671480536 668230832 664933622 661878228 658939719
$$ packed form
544.6F62344873J692057J593887R41456M93228O28293R52065R49740P33912Q00073
562.9F71129584J127541J353205J275420Q70168M98712O20902J011848J012027O20127
581.3F79519534M74393P96676J065970R33885O47128M81427M72366M61936K70546j32322
601.7F84991539m49360m64380m55737m89533m67837k79128K17855M75049K02954M0531
622.1F83321953K58207N64635O55830N19693M00603M83393P02501P45058N79059M08888
642.5F88639820L65078N93185O06895r4116p26402p25388o91533j060188j513183j449287
662.9F83944881R8407K655864Q06570l389180k401650p64727m31836o48916r04083
681.2F78965330j202702j578689k028346k675057l249704l297210l055394k938509
$$ plain form
697.5 658939719 657803595 659617126 660595238 656940460 648304999 635259867 623457313 622343719
713.8 622343719 630856216 639702499 645853341 651207089 657014012 663666010 670657158 676938355
730.2 676938355 681742609 684880078 686698914 687769175 688353837 688480139 688222408 687784791 687358260
748.5 687358260 686982691 686509371 685781419 684870839 683971405 683160782 682199895 680872440 679364502
766.9 679364502 677979529 676706433 675226212 673542857 672367334 672339261 673275650 674413323 675171316
785.2 675171316 675585508 675836444 675718665 675062060 674365282 674485207 675882578 678227901 680850923
803.6 680850923 683444202 686101139 688867390 691463351 693494976 694934547 696202159 697511613
819.9 697511613 698542118 698909819 698595107 697788537 696535707 694551110 691484571 687449753 682837784
$$ packed form
697.5F58939719j136124J813531R78112l654778q635461j3045132j1802554j113594
713.8F22343719Q512497Q846283O150842N353748N806923O651998O991148O281197
730.2F76938355M804254L137469J818836J070261N84662J26302k57731m37617m26531
748.5F87358260l75569m73320p27952r10580q99434q10623r60887j327455j507938
766.9F79364502j384973j273096j480221j683355j175523k8073R36389J137673P57993
785.2F75171316M14192K50936j17779o56605o96778J19925J397371K345323K623022
803.6F80850923K593279K656937K766251K595961K031625J439571J267612J309454
819.9F97511613J030505L67701l14712q06570j252830j984597l066539m034818m611969
$$ plain form
838.3 682837784 677337110 670837343 664112449 656812787 648529649 638503432 624299109 607555926
854.6 607555926 594381273 587604582 585169852 583630323 578887045 565404177 539811015 508043289
870.9 508043289 482820839 472378254 479060799 502755225 537582517 573538244 604634345 629616022
887.2 629616022 648022592 660004020 667075098 671350360 674509108 677220643 679239810 680326700
903.5 680326700 680877149 681540966 682414949 682845950 682444811 681712449 681146860 680500984 679341912 677701890
923.9 677701890 676073194 674803138 673653662 672290564 670849085 669753671 669099808 668464541 667468131
942.3 667468131 666232705 665122330 664219022 663157642 661643505 659858465 658078849 656205416 653956294
960.6 653956294 651338577 648658752 646180749 643759370 640981257 637737870 634339631 630928636
$$ packed form
838.3F82837784n500674o499767o724894p299662q283138j0026217j4204323j6743183
854.6F07555926j3174653o776691k434730j539529m743278j3482868k5593162l1767726
870.9E08043289k5222450j0442585O682545K3694426L4827292L5955727L1096101K4981677
887.2F29616022J8406570J1981428P071078M275262L158748K711535K019167J086890
903.5F80326700N50449O63817Q73983M31001m01139p32362n65589o45876j159072j640022
923.9F77701890j628696j270056j149476j363098j441479j095414o53863o35267r96410
942.3F67468131j235426j110375r03308j061380j514137j785040j779616j873433k249122
960.6F53956294k617717k679825k478003k421379k778113l243387l398239l410995
$$ plain form
977 630928636 627227128 622985065 618375719 613912404 609838426 605855048 601741076 597799659 594376266
995.3 594376266 591353297 588306963 585016012 581686974 578560472 575494409 572204709 568767369
1011.6 568767369 565547228 562680066 559875667 556905746 553917527 551211178 548897207 546756446
1027.9 546756446 544598222 542631090 541325867 540889859 541001141 541173697 541220248 541081309 540515304
1046.3 540515304 539345205 537782431 536249459 534977078 533912957 533042848 532640934 532825708 533199251
1064.7 533199251 533083439 532027841 530129313 527817428 525417864 522868037 519589424 516022801
1081 516022801 515181184 518319011 522411346 525380850 527809024 530173957 532224953 533676505 534590065
1099.3 534590065 535293102 536072254 536919177 537640154 538205624 538869500 539933145 541362762 542750657
$$ packed form
977F30928636l701508m242063m609346m463315m073978l983378m113972l941417l423393
995.3E94376266l022969l046334l290951l329038l126502l066063l289700l437340
1011.6E68767369l220141k867162k804399k969921k988219k706349k313971k140761
1027.9E46756446k158224j967132j305223m36008J11282J72556M6551j38939n66005
1046.3E40515304j170099j562774j532972j272381j064121q70109m01914J84774L73543
1064.7E33199251j15812j055598j898528k311885k399564k549827l278613l566623
1081E16022801q41617L137827M092335K969504K428174K364933K050996J451552R13560
1099.3E34590065P03037P79152Q46923P20977N65470O63876J063645J429617J387895
$$ plain form
1117.7 542750657 543832779 544743121 545660377 546607435 547578573 548635781 549824834 551015496 551959336
1136 551959336 552466869 552524447 552316844 552000999 551540971 550859988 550068319 549430370 549055934 548712611
1156.4 548712611 548060775 547181606 546687603 547091305 548263609 549778700 551484525 553420484 555503428
1174.8 555503428 557511449 559305847 560943127 562481642 563815415 564777732 565284729 565428495 565380752
1193.1 565380752 565159142 564680696 563969135 563229322 562636673 562144518 561619997 561041594 560497165 560000360
1213.5 560000360 559396684 558517516 557390094 556192935 555041790 553814232 552355170 550768852 549289882
1231.9 549289882 547984540 546730340 545436263 544132948 542939723 541858375 540745676 539525807
1248.2 539525807 538315892 537241399 536239862 535164297 533948243 532703102 531553626 530510247
$$ packed form
1117.7E42750657J082122R10342R17256R47058R71138J057208J189053J190662R43840
1136E51959336N07533N7578k07603l15845m60028o80983p91669o37949l74436l43323
1156.4E48712611o51836q79169m94003M03702J172304J515091J705825J935959K082944
1174.8E55503428K008021J794398J637280J538515J333773R62317N06997J43766m7743
1193.1E65380752k21610m78446p11561p39813n92649m92155n24521n78403n44429m96805
1213.5E60000360o03676q79168j127422j197159j151145j227558j459062j586318j478970
1231.9E49289882j305342j254200j294077j303315j193225j081348j112699j219869
1248.2E39525807j209915j074493j001537j075565j216054j245141j149476j043379
$$ plain form
1264.5 530510247 529467523 528363228 527237117 526121318 524959385 523661852 522257447 520878553
1280.8 520878553 519645751 518490493 517244875 515838027 514352024 512808442 511136711 509281099
1297.2 509281099 507246137 505121052 502957940 500745714 498424858 496026307 493577778 491087824
1313.5 491087824 488634944 486324310 484134376 481977135 479786485 477450311 474916875 472161740
1329.8 472161740 469291627 466444254 463647157 460779965 457805574 454871595 452008337 449098378
1346.1 449098378 446040303 442798525 439309090 435611397 431773931 427909404 423979908 419809341
1362.4 419809341 415507436 411246866 406878561 402463764 398093224 393474609 388710916 383901834
1378.7 383901834 378879547 373715013 368705124 363682270 358374298 353042156 347349912 340898722
$$ packed form
1264.5E30510247j042724j104295j126111j115799j161933j297533j404405j378894
1280.8E20878553j232802j155258j245618j406848j486003j543582j671731j855612
1297.2E09281099k034962k125085k163112k212226k320856k398551k448529k489954
1313.5D91087824k452880k310634k189934k157241k190650k336174k533436k755135
1329.8D72161740k870113k847373k797097k867192k974391k933979k863258k909959
1346.1D49098378l058075l241778l489435l697693l837466l864527l929496m170567
1362.4D19809341m301905m260570m368305m414797m370540m618615m763693m809082
1378.7C83901834n022287n164534n009889n022854n307972n332142n692244o451190
$$ plain form
1395.1 340898722 334122062 327082455 319953740 312901288 305366963 297797620 290647417 283722103
1411.4 283722103 277213514 271438003 266187310 261352867 257908523 255872965 254740626 254373640
1427.7 254373640 254645050 255175650 255766094 256563306 257202566 257177472 256752968 256108612 255320162 254449397
1448.1 254449397 253525794 252699763 252160192 252255738 252694607 252614975 252147585 251260608 249686807 247872785
1468.5 247872785 246374160 245475292 245389014 246025607 247269541 249126241 251539528 254327118 257685274
1486.8 257685274 261916161 266470492 270370245 274449080 279786170 285280973 289886951 293865889
1503.2 293865889 298987567 306664497 312797517 317165852 321735054 326913804 332555711 338198930
1519.5 338198930 344478577 350415170 355506569 360746562 365520805 370483488 376324177 381115317
$$ packed form
1395.1C40898722o776660p039607p128715p052452p534325p569343p150203o925314
1411.4B83722103o508589n775511n250693m834443l444344k035558j132339l66986
1427.7B54373640K71410N30600N90444P97212O39260k5094m24504o44356p88450q70765
1448.1B54449397r23603q26031n39571R5546M38869p9632m67390q86977j573801j814022
1468.5B47872785j498625q98868q6278O36593J243934J856700K413287K787590L358156
1486.8B57685274M230887M554331L899753M078835N337090N494803M605978L978938
1503.2B93865889N121678P676930O133020M368335M569202N178750N641907N643219
1519.5C38198930O279647N936593N091399N239993M774243M962683N840689M791140
$$ plain form
1535.8 381115317 385411680 392203629 399282217 404213935 408549577 412805468 417426884 422058463
1552.1 422058463 426450312 430706978 436699480 443024755 445786268 447962195 450710088 453879982
1568.4 453879982 457167566 459379792 461475551 464361280 466271818 467325300 468455434 469549626
1584.7 469549626 470435947 471139073 471603274 471879244 472058624 472093344 472023666 471893609 471666962 471309125
1605.1 471309125 470961392 470605999 470042855 469336510 468964219 468743861 467951268 467179596 466795981 466353655
1625.5 466353655 465851873 465425819 465016842 465187937 466265023 466888994 466876924 467086732 467834204 469603866
1645.9 469603866 471373945 471941262 473624647 476896346 478086293 478691876 480246961 482755989 485204309
1664.3 485204309 487061709 489670008 493008882 495472610 498062611 501064658 503346384 505373716
$$ packed form
1535.8C81115317M296363O791949P078588M931718M335642M255891M621416M631579
1552.1D22058463M391849M256666N992502O325275K761513K175927K747893L169894
1568.4D53879982L287584K212226K095759K885729J910538J053482J130134J094192
1584.7D69549626Q86321P03126M64201K75970J79380L4720o9678j30057k26647l57837
1605.1D71309125l47733l55393n63144p06345l72291k20358p92593p71672l83615m42326
1625.5D66353655n01782m26054m08977J71095J077086O23971j2070K09808P47472J769662
1645.9D69603866J770079N67317J683385L271699J189947O05583J555085K509028K448320
1664.3D85204309J857400K608299L338874K463728K590001L002047K281726K027332
$$ plain form
1680.6 505373716 508476794 513140321 516412318 518587828 521095395 523568690 527034640 531290352
1696.9 531290352 535402179 539901555 542843342 545259476 548154712 550477505 552413046 554403067
1713.2 554403067 556890547 560124815 562420964 563407481 564527571 566002369 567447722 568857253
1729.5 568857253 570376277 572854817 574987650 575912714 577333629 579161644 580805659 582639039
1745.9 582639039 584856510 587477684 589782059 591319621 593014061 594898522 596553385 598309994
1762.2 598309994 599624455 600645483 601923287 603302300 604682624 605129123 604449570 603588939 602866888
1780.5 602866888 602081180 601236761 600337625 599503517 599203527 599274933 598911941 598471999 598723531 599735796
1800.9 599735796 600985825 602239490 603701055 605423033 607196927 608757317 610290051 611994207
$$ packed form
1680.6E05373716L103078M663527L271997K175510K507567K473295L465950M255712
1696.9E31290352M111827M499376K941787K416134K895236K322793J935541J990021
1713.2E54403067K487480L234268K296149R86517J120090J474798J445353J409531
1729.5E68857253J519024K478540K132833R25064J420915J828015J644015J833380
1745.9E82639039K217471K621174K304375J537562J694440J884461J654863J756609
1762.2E98309994J314461J021028J277804J379013J380324M46499o79553q60631p22051
1780.5F02866888p85708q44419q99136q34108k99990P1406l62992m39942K51532J012265
1800.9E99735796J250029J253665J461565J721978J773894J560390J532734J704156
$$ plain form
1817.2 611994207 613579750 614853740 616183579 617686033 618962944 620230019 621265650 621785104
1833.6 621785104 622412205 623225510 623719692 624130964 625206411 626323640 626678050 626768827 626908779
1851.9 626908779 627159417 627543747 627928495 628171921 628278494 628381312 628722250 629440486 629943728 629905105
1872.3 629905105 629946232 630292833 630650461 630880475 631076276 631339550 631683946 632169783 632561982 632697403
1892.7 632697403 632967949 633394539 633696795 633915961 634164393 634495080 634921193 635366976 635670125 635801435
1913.1 635801435 636009812 636522710 636970103 637097061 637294948 637525558 637621105 637693048 637782693 637914836
1933.5 637914836 638068318 638153672 638194025 638414621 638694406 638736546 638666630 638640881 638685107 638810396 638936460
1955.9 638936460 638974726 638973296 638963997 638982832 639105678 639212787 639163375 639109254 639173090 639251947 639270604
$$ packed form
1817.2F11994207J585543J273990J329839J502454J276911J267075J035631N19454
1833.6F21785104O27101Q13305M94182M11272J075447J117229L54410R0777J39952
1851.9F26908779K50638L84330L84748K43426J06573J02818L40938P18236N03242l8623
1872.3F29905105M1127L46601L57628K30014J95801K63274L44396M85837L92199J35421
1892.7F32697403K70546M26590L02256K19166K48432L30687M26113M45783L03149J31310
1913.1F35801435K08377N12898M47393J26958J97887K30610R5547P1943Q9645J32143
1933.5F37914836J53482Q5354M0353K20596K79785M2140o9916k5749M4226J25289J26064
1955.9F38936460L8266j430r299J8835J22846J07109m9412n4121O3836P8857J8657
$$ plain form
1978.4 639270604 639249980 639231741 639217615 639202654 639185250 639237583 639346480 639317393 639181972 639077485 639010489
2000.8 639010489 638985097 638995886 639002264 638988018 638974011 638975799 639018416 639091372 639082074 638978243 638894737 638848722
2025.3 638848722 638794303 638718188 638645947 638613403 638621449 638625443 638583839 638531327 638517916 638525307 638513327 638500929
2049.8 638500929 638494372 638467133 638448119 638432562 638339996 638217866 638216674 638280809 638239145 638095438 637967587
2072.2 637967587 637924373 637934983 637890935 637762725 637655556 637623787 637595177 637496173 637356162 637258470 637228727
2094.6 637228727 637188375 637043536 636813879 636627972 636552453 636489153 636308312 636062443 635933161 635915041
2115 635915041 635835290 635634243 635412216 635272801 635199726 635072768 634829283 634594262 634490550 634442210
2135.4 634442210 634300232 634057641 633853257 633784294 633776665 633680284 633484483 633335531 633317351 633333921 633269608
$$ packed form
1978.4F39270604k0624j8239j4126j4961j7404N2333J08897k9087j35421j04487o6996
2000.8F39010489k5392J0789O378j4246j4007J788M2617P2956r298j03831q3506m6015
2025.3F38848722n4419p6115p2241l2544Q046L994m1604n2512j3411P391j1980j2398
2049.8F38500929o557k7239j9014j5557r2566j22130j192O4135m1664j43707j27851
2072.2F37967587m3214J0610m4048j28210j07169l1769k8610r9004j40011r7692k9743
2094.6F37228727m0352j44839k29657j85907p5519o3300j80841k45869j29282j8120
2115F35915041p9751k01047k22027j39415p3075j26958k43485k35021j03712m8340
2135.4F34442210j41978k42591k04384o8963p629r6381j95801j48952j8180J6570o4313
$$ plain form
2157.9 633269608 633138299 633050203 633059025 633065879 632975936 632861555 632839680 632891953 632920802 632861435 632738471
2180.3 632738471 632649660 632636786 632636905 632581890 632486284 632410944 632378101 632341862 632234037 632087111 632002413
2202.7 632002413 631959319 631869972 631730556 631590128 631474972 631384015 631268382 631095886 630933046 630809247
2223.1 630809247 630676925 630528986 630384922 630262733 630179822 630106390 630010903 629895747 629757583 629614294
2243.5 629614294 629518628 629475415 629405200 629298747 629226744 629190445 629149199 629096806 629055262 629011571 628918767
2265.9 628918767 628795028 628705323 628646672 628529012 628303647 628040969 627784669 627569795 627491415 627561986
2286.3 627561986 627719343 627928197 628172100 628400087 628604293 628874958 629223466 629606247 630104363 630828500
2306.7 630828500 631745994 632675111 633398712 633945525 634791195 636290133 638078690 639498591 640388608
$$ packed form
2157.9F33269608j31309q8096Q822O854q9943j14381k1875N2273K8849n9367j22964
2180.3F32738471q8811j2874J19n5015r5606p5340l2843l6239j07825j46926q4698
2202.7F32002413m3094q9347j39416j40428j15156r0957j15633j72496j62840j23799
2223.1F30809247j32322j47939j44064j22189q2911p3432r5487j15156j38164j43289
2243.5F29614294r5666m3213p0215j06453p2003l6299m1246n2393m1544m3691r2804
2265.9F28918767j23739q9705n8651j17660k25365k62678k56300k14874p8380P0571
2286.3F27561986J57357K08854K43903K27987K04206K70665L48508L82781M98116P24137
2306.7F30828500R17494R29117P23601N46813Q45670J498938J788557J419901Q90017
$$ plain form
2325.1 640388608 641199410 642253220 643178523 643525302 643631160 643985510 644561470 645064771 644919217
2343.5 644919217 642778277 638940334 636589229 637936175 642128229 646460891 649548173 651052415
2359.8 651052415 651082873 649882555 647679329 644760489 641371906 637810111 634307086 630894780 627585053
2378.1 627585053 624458373 621684134 619487762 617985189 617108405 616658628 616395712 616121948 615798414
2396.5 615798414 615515709 615282536 615009964 614674568 614336610 614062846 613846183 613585413 613237262 612871945
2416.9 612871945 612551212 612264872 611961067 611606419 611238539 610910356 610605061 610282481 609916627 609528363
2437.3 609528363 609180868 608860493 608473122 607984006 607480466 607057035 606674790 606204331 605597675 604953766
2457.7 604953766 604378104 603841364 603239059 602499425 601652801 600800097 599943399 598966300 597801626
$$ packed form
2325.1F40388608Q10802J053810R25303L46779J05858L54350N75960N03301j45554
2343.5F44919217k140940l837943k351105J346946M192054M332662L087282J504242
2359.8F51052415L0458j200318k203226k918840l388583l561795l503025l412306l309727
2378.1F27585053l126680k774239k196372j502573q76784m49777k62916k73764l23534
2396.5F15798414k82705k33173k72572l35396l37958k73764k16663k60770l48151l65317
2416.9F12871945l20733k86340l03805l54648l67880l28183l05295l22580l65854l88264
2437.3F09528363l47495l20375l87371m89116n03540m23431l82245m70459o06656o43909
2457.7F04953766n75662n36740o02305p39634q46624q52704q56698r77099j164674
$$ plain form
2476 597801626 596542478 595327795 594148695 592854261 591391921 589927793 588592112 587310135 585961580
2494.4 585961580 584584951 583328247 582250357 581280828 580305159 579298556 578350723 577489138 576569319
2512.7 576569319 575486362 574374378 573478997 572934389 572664976 572524428 572499573 572681367 573080838
2531.1 573080838 573594689 574106514 574553370 574931622 575227320 575415730 575536013 575708091 576047540 576508939
2551.5 576508939 576889396 577072620 577165782 577295959 577410102 577410161 577329695 577244043 577182651 577128053 576997340
2573.9 576997340 576745868 576462090 576245487 576061487 575819254 575510740 575190365 574902534 574645102 574351609
2594.3 574351609 574003756 573684931 573428035 573178887 572894096 572609484 572372377 572168887 571974576 571770012
2614.7 571770012 571557224 571366072 571200967 571053207 570903420 570723295 570530593 570365727 570228696 570085466
$$ packed form
2476E97801626j259148j214683j179100j294434j462340j464128j335681j281977j348555
2494.4E85961580j376629j256704j077890r69529r75669j006603r47833q61585r19819
2512.7E76569319j082957j111984q95381n44608k69413j40548k4855J81794L99471
2531.1E73080838N13851N11825M46856L78252K95698J88410J20283J72078L39449M61399
2551.5E76508939L80457J83224R3162J30177J14143N9q0466q5652o1392n4598j30713
2573.9E76997340k51472k83778k16603j84000k42233l08514l20375k87831k57432k93493
2594.3E74351609l47853l18825k56896k49148k84791k84612k37107k03490j94311k04564
2614.7E71770012k12788j91152j65105j47760j49787j80125j92702j64866j37031j43230
$$ plain form
2635.1 570085466 569928765 569765806 569591105 569414020 569236577 569046795 568808496 568503261 568188369 567886710
2655.5 567886710 567565739 567226231 566866159 566485882 566107392 565732479 565349638 564952672 564553380 564142823
2675.9 564142823 563701212 563241303 562772512 562309384 561870039 561450064 561023414 560553312 560067415 559630275
2696.3 559630275 559222758 558797598 558338165 557859361 557389259 556899369 556380391 555880964 555408418 554956913
2716.7 554956913 554521441 554059803 553583860 553161979 552793682 552413344 551973164 551488936 551020086 550588787
2737.1 550588787 550167918 549763143 549380362 548980176 548550367 548111677 547678411 547265649 546876431 546466529
2757.5 546466529 545992672 545486867 545004308 544538498 544062674 543588161 543116748 542653382 542195022 541696846
2777.9 541696846 541143239 540567756 540019274 539476931 538889766 538280964 537674963 537061334 536432147 535793841
$$ packed form
2635.1E70085466j56701j62959j74701j77085j77443j89782k38299l05235l14892l01659
2655.5E67886710l20971l39508l60072l80277l78490l74913l82841l96966l99292m10557
2675.9E64142823m41611m59909m68791m63128m39345m19975m26650m70102m85897m37140
2696.3E59630275m07517m25160m59433m78804m70102m89890n18978m99427m72546m51505
2716.7E54956913m35472m61638m75943m21881l68297l80338m40180m84228m68850m31299
2737.1E50588787m20869m04775l82781m00186m29809m38690m33266m12762l89218m09902
2757.5E46466529m73857n05805m82559m65810m75824m74513m71413m63366m58360m98176
2777.9E41696846n53607n75483n48482n42343n87165o08802o06001o13629o29187o38306
$$ plain form
2798.3 535793841 535134435 534438133 533748806 533074319 532328546 531504691 530691564 529907584 529116571 528297603
2818.7 528297603 527410984 526438355 525453150 524466753 523384690 522191882 520928085 519570768 518047154
2837 518047154 516319156 514387667 512251437 509915650 507452548 505157292 503437817 502415478 501859605
2855.4 501859605 501485765 501133442 500712633 500134826 499359369 498422801 497413039 496496171 495836735
2873.7 495836735 495378852 494912714 494399786 493897736 493332118 492614865 491754889 490829378 489937603 489114553
2894.1 489114553 488300234 487444580 486577868 485725135 484825730 483778566 482515961 481019735 479321003
2912.5 479321003 477522790 475783885 474270731 473109573 472331822 471912354 471792877 471886814 472189337
2930.8 472189337 472701252 473308384 473914474 474505335 475066453 475561142 475936979 476148069 476157814 475984484
$$ packed form
2798.3E35793841o59406o96302o89327o74487p45773q23855q13127p83980p91013q18968
2818.7E28297603q86619r72629r85205r86397j082063j192808j263797j357317j523614
2837E18047154j727998j931489k136230k335787k463102k295256j719475j022339n55873
2855.4E01859605l73840l52323m20809n77807p75457r36568j009762r16868o59436
2873.7D95836735m57883m66138n12928n02050n65618p17253q59976r25511q91775q23050
2894.1D89114553q14319q55654q66712q52733q99405j047164j262605j496226j698732
2912.5D79321003j798213j738905j513154j161158p77751m19468j19477R3937L02523
2930.8D72189337N11915O07132O06090N90861N61118M94689L75837K11090R745j73330
$$ plain form
2951.2 475984484 475714833 475390285 475082397 474940419 475037694 475337148 475764841 476264626 476803929 477374464
2971.6 477374464 477961838 478513569 478979796 479382873 479767859 480119705 480436713 480724037 480940133 481115848
2992 481115848 481322140 481495410 481553793 481510758 481408268 481294572 481129974 480860442 480576694 480327636
3012.4 480327636 480070233 479791045 479456633 479034215 478522152 477957338 477371544 476779312 476217151 475639075
3032.8 475639075 475001663 474334389 473646224 472948223 472232759 471507937 470825553 470163375 469435662 468635410
3053.2 468635410 467866540 467163622 466436952 465679437 464966238 464301348 463641286 462965459 462272942 461560518
3073.6 461560518 460833609 460150808 459534526 458879173 458132863 457374305 456683487 456057400 455400348 454686701
3094 454686701 453992039 453318954 452643812 451957315 451224446 450474113 449765027 449052691 448298633 447560191
$$ packed form
2951.2D75984484k69651l24548l07888j41978R7275K99454M27693M99785N39303N70535
2971.6D77374464N87374N51731M66227M03077L84986L51846L17008K87324K16096J75715
2992D81115848K06292J73270N8383m3035j02490j13696j64598k69532k83748k49058
3012.4D80327636k57403k79188l34412m22418n12063n64814n85794n92232n62161n78076
3032.8D75639075o37412o67274o88165o98001p15464p24822o82384o62178p27713q00252
3053.2D68635410p68870p02918p26670p57515p13199o64890o60062o75827o92517p12424
3073.6D61560518p26909o82801o16282o55353p46310p58558o90818o26087o57052p13647
3094D54686701o94662o73085o75142o86497p32869p50333p09086p12336p54058p38442
$$ plain form
3114.4 447560191 446831763 446067721 445257634 444393247 443514317 442673028 441849589 441018015 440207124 439386547
3134.8 439386547 438521624 437659264 436799288 435883582 434909999 433968514 433114022 432273865 431340128 430324525
3155.2 430324525 429337651 428401202 427458495 426479876 425454468 424423754 423454821 422524065 421526283
3173.5 421526283 420458972 419460475 418514043 417509466 416491121 415484756 414474040 413525730 412602872
3191.9 412602872 411581457 410521537 409510791 408529252 407573372 406623632 405641407 404646754 403682083
3210.3 403682083 402740330 401795387 400830716 399879396 398966938 398032546 397059053 396114409 395234317 394380003
3230.7 394380003 393499553 392544478 391568065 390688062 389849812 388988465 388167053 387362748 386490017 385578066
3251.1 385578066 384723336 383926988 383097529 382194102 381263882 380395621 379624456 378904402 378176928 377403378
$$ packed form
3114.4D47560191p28428p64042q10087q64387q78930q41289q23439q31574q10891q20577
3134.8D39386547q64923q62360q59976r15706r73583r41485q54492q40157r33737j015603
3155.2D30324525r86874r36449r42707r78619j025408j030714r68933r30756r97782
3173.5D21526283j067311r98497r46432j004577j018345j006365j010716r48310r22858
3191.9D12602872j021415j059920j010746r81539r55880r49740r82225r94653r64671
3210.3D03682083r41753r44943r64671r51320r12458r34392r73493r44644q80092q54314
3230.7C94380003q80450r55075r76413q80003q38250q61347q21412q04305q72731r11951
3251.1C85578066q54730p96348q29459r03427r30220q68261p71165p20054p27474p73550
$$ plain form
3271.4 377403378 376625478 375861466 375042945 374206245 373439878 372709572 371943504 371193111 370556712 369984806
3291.8 369984806 369330525 368560553 367752552 366971612 366298348 365735620 365127325 364372253 363477498 362531751
3312.2 362531751 361675739 360876411 360013008 359111249 358271182 357483923 356602311 355585665 354560196
3330.6 354560196 353594661 352712214 351912200 351029754 350011617 349026322 348094761 347192049 346403182
3348.9 346403182 345657408 344765395 343799174 342955023 342220873 341470748 340675861 339988410 339421958 338726819
3369.3 338726819 337808609 336882919 336106330 335401416 334694475 333994985 333350629 332790405 332271934 331785709
3389.7 331785709 331295162 330652207 329961836 329502910 329185873 328697979 328003973 327368647 326951057 326648176
3410.1 326648176 326285273 325807571 325302333 324935317 324755073 324565679 324281961 324097604 324066877 324016035
$$ packed form
3271.4C77403378p77900p64012q18521q36700p66367p30306p66068p50393o36399n71906
3291.8C69984806o54281p69972q08001p80940o73264n62728o08295p55072q94755r45747
3312.2C62531751q56012p99328q63403r01759q40067p87259q81612j016646j025469
3330.6C54560196r65535q82447q00014q82446j018137r85295r31561r02712p88867
3348.9C46403182p45774q92013r66221q44151p34150p50125p94887o87451n66452o95139
3369.3C38726819r18210r25690p76589p04914p06941o99490o44356n60224n18471m86225
3389.7C31785709m90547o42955o90371m58926l17037m87894o94006o35326m17590l02881
3410.1C26648176l62903m77702n05238l67016j80244j89394k83718j84357l0727n0842
$$ plain form
3430.5 324016035 323951125 323964655 323904246 323629588 323370188 323306143 323402405 323663175 323818415 323732078 323715329
3453 323715329 323888242 324178934 324546278 324894786 325214177 325620294 326094240 326404274 326513559 326696008
3473.4 326696008 327048331 327468336 327971071 328543067 329025447 329463989 329979271 330440909 330816507 331313491
3493.8 331313491 331975698 332531780 332968831 333695948 334506989 334872037 335276842 336141437 336995482 337548733
3514.2 337548733 337987274 338462621 339031816 339882165 340873092 341720223 342582285 343383729 343957335 344685733
3534.5 344685733 345670253 346426338 346937358 347731233 349130005 350552499 351234525 351848781 352958530
3552.9 352958530 353861243 354479253 355318785 356081754 356380731 357499838 360494554 362777799 363033712
3571.3 363033712 363232046 364207655 365458041 366708070 367601663 367998660 369320154 372517854 374677956
$$ packed form
3430.5C24016035o4910J3530o0409k74658k59400o4045R6262K60770J55240q6337j6749
3453C23715329J72913K90692L67344L48508L19391M06117M73946L10034J09285J82449
3473.4C26696008L52323M20005N02735N71996M82380M38542N15282M61638L75598M96984
3493.8C31313491O62207N56082M37051P27117Q11041L65048M04805Q64595Q54045N53251
3514.2C37548733M38541M75347N69195Q50349R90927Q47131Q62062Q01444N73606P28398
3534.5C44685733R84520P56085N11020P93875J398772J422494O82026O14256J109749
3552.9C52958530R02713O18010Q39532P62969K98977J119107K994716K283245K55913
3571.3C63033712J98334R75609J250386J250029Q93593L96997J321494L197700K160102
$$ plain form
3589.6 374677956 374780774 375499338 377254546 378722042 380121469 381406814 381756693 382174700 384056062
3608 384056062 386226803 387721986 388750404 389289111 391313046 394553542 395321190 393810779 393568754
3626.3 393568754 398379147 403633714 404115319 403914183 404599428 405373305 406129599 406099796 405224234
3644.7 405224234 406309277 412128448 417202741 416525781 415612012 417713821 419101655 419025272 418959528
3663 418959528 418174416 417608142 420146912 422731459 422783673 426147640 429838508 428972423 427203208
3681.4 427203208 425338149 423540503 424819201 429339528 431297332 429920703 428365260 427542329
3697.7 427542329 427966356 430057734 431047231 429537028 428368598 430241257 434038073 434640706 432316393
3716.1 432316393 430629820 430447489 430935681 431539834 431770205 430160224 427692950 427550972 430663139
$$ packed form
3589.6C74677956J02818P18564J755208J467496J399427J285345L49879M18007J881362
3608C84056062K170741J495183J028418N38707K023935L240496P67648j510411k42025
3626.3C93568754M810393N254567M81605k01136O85245P73877P56294k9803q75562
3644.7D05224234J085043N819171N074293o76960r13769K101809J387834p6383o5744
3663D18959528p85112n66274K538770K584547N2214L363967L690868q66085j769215
3681.4D27203208j865059j797646J278698M520327J957804j376629j555443q22931
3697.7D27542329M24027K091378R89497j510203j168430J872659L796816O02633k324313
3716.1D32316393j686573j82331M88192O04153K30371j609981k467274j41978L112167
$$ plain form
3734.4 430663139 433841318 432727307 428123295 426461130 430824190 432284087 430943012 434209198
3750.7 434209198 437008917 434896559 432701975 433286428 433826864 432496667 431708127 432073027 433327794
3769.1 433327794 434525788 433596641 431719393 431297183 432647526 433216870 432574064 432490051 432423145
3787.5 432423145 431896180 431040853 430041522 429827690 429433852 429630041 432251930 432560921 431727797
3805.8 431727797 432969183 431933522 428526521 427079439 428769261 429339290 430111378 432683140 431932598
3824.2 431932598 429785550 428571314 427670121 427202642 426615655 427299291 429940075 431083441 430520952
3842.5 430520952 429579407 427079082 422889292 420290381 425553560 433299124 431849122 427089363
3858.8 427089363 424579650 424873024 425629884 424696714 425038278 427035272 427229583 425983846 423868775
$$ packed form
3734.4D30663139L178179j114011m604012j662165M363060J459897j341075L266186
3750.7D34209198K799719k112358k194584N84453N40436j330197p88540L64900J254767
3769.1D33327794J197994r29147j877248m22210J350343N69344o42806q4013o6906
3787.5D32423145n26965q55327r99331k13832l93838J96189K621889L08991q33124
3805.8D31727797J241386j035661l407001j447082J689822N70029P72088K571762p50542
3824.2D31932598k147048j214236r01193m67479n86987O83636K640784J143366n62489
3842.5D30520952r41545k500325m189790k598911N263179P745564j450002m759759
3858.8D27089363k509713K93374P56860r33170L41564J996994J94311j245737k115071
$$ plain form
3877.2 423868775 423148692 424005628 423877954 424632102 424710929 423301458 423947960 424209177 421696216
3895.5 421696216 419787705 420381010 422231108 424312711 425015867 423479557 421613932 420389593 419428408
3913.9 419428408 419518739 420642793 420875877 420098573 419890195 419851214 419004887 418649435 419408858 419609219
3934.3 419609219 418711394 417667925 417201430 417586833 417761445 417274863 417196482 417299271 416907281 416414827
3954.7 416414827 416147590 415916532 415715665 415580928 415279299 414915502 414726317 414609045 414476752 414416015
3975.1 414416015 414284289 413977593 413737506 413598061 413337886 413029045 412878573 412757427 412536502 412326962
3995.5 412326962 412127018
3997.5 412127018
$$ packed form
3877.2D23868775p20083Q56936j27674P54148P8827j409471O46502K61217k512961
3895.5D21696216j908511N93305J850098K081603P03156j536310j865625j224339r61185
3913.9D19428408R0331J124054K33084p77304k08378l8981q46327l55452P59423K00361
3934.3D19609219q97825j043469m66495L85403J74612m86582p8381J02789l91990m92454
3954.7D16414827k67237k31058k00867j34737l01629l63797j89185j17272j32293o0737
3975.1D14416015j31726l06696k40087j39445k60175l08841j50472j21146k20925k09540
3995.5D12326962j99944
3997.5D12127018
##END=$$ End of the data block
