##TITLE=$$ Begin of the data block
##JCAMP-DX=5.00 $$ ACD/SpecManager v 10.08
##SPECTROMETER/DATA SYSTEM=Alpha
##DATE=13 Jun 2014 08:26:00
##DATA TYPE=INFRARED SPECTRUM
##DATA CLASS=XYDATA
##ORIGIN=
##OWNER=
##NPOINTS=1765
##FIRSTX=399.75695801
##LASTX=3997.56933594
##MAXX=3997.56933594
##MINX=399.75695801
##MAXY=0.69853437
##MINY=0.24544036
##XFACTOR=1.0000000000
##YFACTOR=1.000000000000000e-9
##FIRSTY=0.56087583
##DELTAX=2.03957629
##XUNITS=1/CM
##YUNITS=ARBITRARY UNITS
##XYDATA=(X++(Y..Y))
399.8E60875833J0103107J0311722P386506K589166Q57115K128303K319991P39575
416.1E97311318J2755J336992K164722J391828R6261l3259J358449J955033O33478
434.4F06227577n54502K42650J533211J095592m75406j076996m14908j550r90808j898527
454.8F03686333r43005J054644J950443J306891N00024J034915K278149K288521J200258
473.2F14357173J079619K295852L099144K434015J420379J768231K873301K907396
489.5F32235110J887083J127183J384676K078295J955509Q25584r835L34978R66609
507.9F42785192P78794M2498j52052N18621J196384J070023O36279Q14676J454831
526.2F49145246J746058J392305Q70049R62257J561463J806557J486957J108647J156568
$$ y = [560875833, 570978940, 581290662, 588677168, 591266334, 592123449, 594251752, 596571743, 597311318, 597324073, 598661065, 600825787, 602217615, 602313876, 602280617, 603639066, 605594099, 606227577, 605673075, 605915725, 607448936, 608544528, 608069122, 606992126, 606577218, 606575668, 605584860, 603686333, 602743328, 603797972, 605748415, 607055306, 607555330, 608590245, 610868394, 613156915, 614357173, 615436792, 617732644, 620831788, 623265803, 624686182, 626454413, 629327714, 632235110, 634122193, 635249376, 636634052, 638712347, 640667856, 641493440, 641483605, 641818583, 642785192, 643563986, 643606484, 643454432, 643973053, 645169437, 646239460, 646875739, 647690415, 649145246, 650891304, 652283609, 653153658, 654115915, 655677378, 657483935, 658970892, 660079539, 661236107]
544.6F61236107J527369J616180J200915P14481O00993Q64744R79662P90716P48157
562.9F70279324J002491J257538J129091P25567O16968R33826J123488Q67725M88579
581.3F78424597M05848P54058J155019J128256O69599K92897L95477O09338L99769
599.6F84234858j35899n09977n69940n01692m40121m30822k58923J72079L28839J70409
620F82058811K33293M41074N62370N69165M41193K94566L62099O72340Q45432O25968
640.4F87106311K74122K51055N93960N78821j29819o11663n65469o74665j075149j485944
660.8F84261560j438617O3657K559424P32303l430427k392590n97119k05457n50449
679.2F79002285j018345j412332j663924j991868k625942l174007l133476k915978
$$ y = [661236107, 662763476, 664379656, 665580571, 666295052, 666896045, 667760789, 668740451, 669531167, 670279324, 671281815, 672539353, 673668444, 674394011, 675010979, 675944805, 677068293, 677936018, 678424597, 678830445, 679584503, 680739522, 681867778, 682537377, 682830274, 683225751, 683835089, 684234858, 684098959, 683588982, 683019042, 682517350, 682077229, 681646407, 681387484, 681559563, 681888402, 682058811, 682292104, 682733178, 683295548, 683864713, 684305906, 684600472, 684962571, 685634911, 686480343, 687106311, 687380433, 687631488, 688225448, 688804269, 688674450, 688062787, 687497318, 686822653, 685747504, 684261560, 682822943, 682886600, 685446024, 686178327, 682747900, 680355310, 679758191, 679552734, 679002285, 677983940, 676571608, 674907684, 672915816, 670289874, 667115867, 663982391, 661066413]
695.5F61066413k924621j123607J848340R22203l768385q643686j2923122j1686504
711.8F22767031j095891Q432388Q760691O115258N295992N758881O705881P061541
728.1F69801772O290793M816294L214419J898586J054109N04970O7413k46823l92258
746.5F87009275m12107l60727m45843p44819r39608q55803p64966r89676j333952j484930
766.9F78676844j404703j305521j484155j632333j142323p1406R43601J271903Q75592
785.2F74727499L74139J27137j89722o21617o03557K07067J452744K341390K607941
803.6F80423021K611339K695918K793909K568662K028346J536846J323700J233637
819.9F97215378R64344L54647l79681q78573j233398j923144l006637l987909m614711
$$ y = [661066413, 658141792, 657018185, 658866525, 659788728, 656020343, 647376657, 634453535, 622767031, 621671140, 630103528, 638864219, 644979477, 650275469, 656034350, 662740231, 669801772, 676092565, 680908859, 684123278, 686021864, 687075973, 687580943, 687648356, 687401533, 687009275, 686597168, 686236441, 685790598, 685045779, 684106171, 683250368, 682485402, 681495726, 680161774, 678676844, 677272141, 675966620, 674482465, 672850132, 671707809, 671636403, 672580004, 673851907, 674727499, 675101638, 675228775, 675039053, 674417436, 673813879, 674020946, 675473690, 677815080, 680423021, 683034360, 685730278, 688524187, 691092849, 693121195, 694658041, 695981741, 697215378, 698179722, 698534369, 698154688, 697276115, 696042717, 694119573, 691112936, 687125027, 682510316]
838.3F82510316n523741o476641o644249p227122q296192j0104299j4267742j6729713
854.6F07240617j3081312o698251k440929j595318m790724j3504743k5598884l1723380
870.9E07807076k5096774j0294229O766230K3670495L4720122L5859585L1068027K4970710
887.2F29471242J8379808J1997282P130504M299283L128171K668798K000988J099288
903.5F80175364N73993O66141Q41439L99590l96073p18415n52952o04213j134157j658201
923.9F77592516j658976j301408j129508j290143j403391j108944o63281o58333j087546
942.3F67290986j311303j091361q58605j045107j486898j736164j762629j882731k254487
960.6F53861701k637267k700626k464235k395928k794564l291607l419399l368378
$$ y = [682510316, 676986575, 670509934, 663865685, 656638563, 648342371, 638238072, 623970330, 607240617, 594159305, 587461054, 585020125, 583424807, 578634083, 565129340, 539530456, 507807076, 482710302, 472416073, 479182303, 502852798, 537572920, 573432505, 604500532, 629471242, 647851050, 659848332, 666978836, 671278119, 674406290, 677075088, 679076076, 680175364, 680749357, 681415498, 682256937, 682656527, 682260454, 681542039, 680989087, 680384874, 679250717, 677592516, 675933540, 674632132, 673502624, 672212481, 670809090, 669700146, 669036865, 668378532, 667290986, 665979683, 664888322, 664029717, 662984610, 661497712, 659761548, 657998919, 656116188, 653861701, 651224434, 648523808, 646059573, 643663645, 640869081, 637577474, 634158075, 630789697]
977F30789697l654361m257738m626095m457236m079580l965616m058540l872454l380120
995.3E94437957l053069l113985l318787l331184l155351l101766l302157l406823
1011.6E68654835l160059k848149k830028k991974k963186k641201k292156k174556
1027.9E46753526k187133j970232j295924m37677Q8692J56283L7372j48534n48899
1046.3E40447474j152993j570821j534700j258075j024366q29041m17590J54257L82543
1064.7E33196688j05441j082480j933098k311647k386391k543986l272533l566086
1081E15995026q58903L116667M096448K981246K424896K374589K107501J504362Q95440
1099.3E34637272O58989P78377Q49665O64651N07355O78181J118362J456261J395881
$$ y = [630789697, 627135336, 622877598, 618251503, 613794267, 609714687, 605749071, 601690531, 597818077, 594437957, 591384888, 588270903, 584952116, 581620932, 578465581, 575363815, 572061658, 568654835, 565494776, 562646627, 559816599, 556824625, 553861439, 551220238, 548928082, 546753526, 544566393, 542596161, 541300237, 540862560, 540951252, 541107535, 541144907, 540996373, 540447474, 539294481, 537723660, 536188960, 534930885, 533906519, 533077478, 532659888, 532814145, 533196688, 533091247, 532008767, 530075669, 527764022, 525377631, 522833645, 519561112, 515995026, 515136123, 518252790, 522349238, 525330484, 527755380, 530129969, 532237470, 533741832, 534637272, 535296261, 536074638, 536924303, 537588954, 538096309, 538774490, 539892852, 541349113, 542744994]
1117.7E42744994J102209R25064R15468R33528R61661J053989J171053J184523R66430
1136E51958919N09798N7399j95741l43323m85659o59525p75695o45697l77655l29912
1156.4E48712909o22868q65698n03719L86655J165152J531780J705825J918435K099753
1174.8E55528224K054929J821578J611173J485884J293719R20355M76480J75714J4425
1193.1E65382481j93000m78327p22111p47800n93185n01692n17726n53668n34355m92633
1213.5E60047984o09100r04917j148403j175225j120150j244187j487792j580477j465678
1231.9E49312055j305759j249373j294195j321197j213849j088619j100421j187086
1248.2E39551556j183391j072764j009405j093328j218259j216829j116931j040936
$$ y = [542744994, 543847203, 544772267, 545687735, 546621263, 547582924, 548636913, 549807966, 550992489, 551958919, 552468717, 552526116, 552330375, 551987052, 551501393, 550841868, 550066173, 549420476, 549042821, 548712909, 548090041, 547224343, 546720624, 547107279, 548272431, 549804211, 551510036, 553428471, 555528224, 557583153, 559404731, 561015904, 562501788, 563795507, 564715862, 565192342, 565368056, 565382481, 565189481, 564711154, 563989043, 563241243, 562648058, 562146366, 561628640, 561074972, 560540617, 560047984, 559438884, 558533967, 557385564, 556210339, 555090189, 553846002, 552358210, 550777733, 549312055, 548006296, 546756923, 545462728, 544141531, 542927682, 541839063, 540738642, 539551556, 538368165, 537295401, 536285996, 535192668, 533974409, 532757580, 531640649, 530599713]
1264.5E30599713j080870j144469j126826j077354j142680j309932j409769j382768
1280.8E20925045j250148j180410j259029j404286j472294j522124j666963j856804
1297.2E09312987k009213k089738k151073k226114k352208k435237k450198k460271
1313.5D91138935k461135k348662k190381k122164k157420k322256k548874k780020
1329.8D72208023k874732k842575k801121k881884k993256k937227k839238k891004
1346.1D49146986l079623l259748l463447l674180l851235l890484l930062m156679
1362.4D19841528m319102m297047m390598m432082m390806m615515m721731m754246
1378.7C83920401m984110n132616m990816n058616n365819n327046n641639o452710
$$ y = [530599713, 529518843, 528374374, 527247548, 526170194, 525027514, 523717582, 522307813, 520925045, 519674897, 518494487, 517235458, 515831172, 514358878, 512836754, 511169791, 509312987, 507303774, 505214036, 503062963, 500836849, 498484641, 496049404, 493599206, 491138935, 488677800, 486329138, 484138757, 482016593, 479859173, 477536917, 474988043, 472208023, 469333291, 466490716, 463689595, 460807711, 457814455, 454877228, 452037990, 449146986, 446067363, 442807615, 439344168, 435669988, 431818753, 427928269, 423998207, 419841528, 415522426, 411225379, 406834781, 402402699, 398011893, 393396378, 388674647, 383920401, 378936291, 373803675, 368812859, 363754243, 358388424, 353061378, 347419739, 340967029]
1395.1C40967029o831705p065356p125348p030338p483750p541299p160813o927669
1411.4B83800751o508142n797177n271525m832446l450841k042264j104503l39985
1427.7B54453868K78949N43476N96404P97391O49303k6942m33832o51926q08090q82268
1448.1B54516333r13798q22962n46366P6175M34607n5104m62234q91000j574383j827970
1468.5B47933298j511454q96201q5279O28739J253546J904160K456396K766759L302574
1486.8B57752538M201293M571050L947050M119336N347133N493939M617154L991872
1503.2B94041365N100519P618546O149054M431784M601151N186349N652428N642831
1519.5C38424027O283998N956233N098432N251497M777551M926205N825102M820705
$$ y = [340967029, 334135324, 327069968, 319944620, 312914282, 305430532, 297889233, 290728420, 283800751, 277292609, 271495432, 266223907, 261391461, 257940620, 255898356, 254793853, 254453868, 254732817, 255276293, 255872697, 256670088, 257319391, 257292449, 256858617, 256206691, 255398601, 254516333, 253602535, 252779573, 252233207, 252309382, 252743989, 252688885, 252226651, 251335651, 249761268, 247933298, 246421844, 245525643, 245440364, 246069103, 247322649, 249226809, 251683205, 254449964, 257752538, 261953831, 266524881, 270471931, 274591267, 279938400, 285432339, 290049493, 294041365, 299141884, 306760430, 312909484, 317341268, 321942419, 327128768, 332781196, 338424027, 344708025, 350664258, 355762690, 361014187, 365791738, 370717943, 376543045, 381363750]
1535.8C81363750M274696O735682P107675M991383M372835M259467M594207M601866
1552.1D22301561M370480M224092N973101O373942K769619K150893K751589L190488
1568.4D54105765L310531K224416K077698K866984J923084J048177J105071J102477
1584.7D69764203Q97258O80596M54754K72780J53095K414r6888j46359k35259l71218
1605.1D71375376l88503m23431o17832p64519m61728k59399p55549p64250m29064m82649
1625.5D66028452n06520m22329m37349J30504J074821O54995K6316K23338O91504J679778
1645.9D69143510J768052O12796J714855L370673J292258O67930J612365K547652K478152
1664.3D85208243J900584K631396L343731K486050K609342L023655K301573K023101
$$ y = [381363750, 385638446, 392374128, 399481803, 404473186, 408846021, 413105488, 417699695, 422301561, 426672041, 430896133, 436869234, 443243176, 446012795, 448163688, 450915277, 454105765, 457416296, 459640712, 461718410, 464585394, 466508478, 467556655, 468661726, 469764203, 470661461, 471342057, 471796811, 472069591, 472222686, 472225100, 472128212, 471981853, 471746594, 471375376, 470986873, 470563442, 469945610, 469181091, 468719363, 468459964, 467704415, 466940165, 466511101, 466028452, 465521932, 465099603, 464662254, 464792758, 465867579, 466522574, 466548890, 466772228, 467463732, 469143510, 470911562, 471524358, 473239213, 476609886, 477902144, 478570074, 480182439, 482730091, 485208243, 487108827, 489740223, 493083954, 495570004, 498179346, 501203001, 503504574, 505527675]
1680.6E05527675L114283M720688L301740K198338K572537K515197L429353M196405
1696.9E31576216M107177M556299K979994K420246K940834K392649J968861J986802
1713.2E54929078K467751L249347K353013J009703J117646J485110J456439J395583
1729.5E69463670J487553K471924K163172R35614J426876J867234J670540J816213
1745.9E83302796K197802K637505K342284J557112J711309J924157J680434J745224
1762.2E99098623J293123R91404J229763J355588J411021M77671o69419q38578o90520
1780.5F03658676p64489q30412r01818q82864l62277Q7857k99811m32074K23159J021624
1800.9F00517571J290858J268267J456201J718998J767159J559794J556992J742185
$$ y = [505527675, 508641958, 513362646, 516664386, 518862724, 521435261, 523950458, 527379811, 531576216, 535683393, 540239692, 543219686, 545639932, 548580766, 550973415, 552942276, 554929078, 557396829, 560646176, 562999189, 564008892, 565126538, 566611648, 568068087, 569463670, 570951223, 573423147, 575586319, 576521933, 577948809, 579816043, 581486583, 583302796, 585500598, 588138103, 590480387, 592037499, 593748808, 595672965, 597353399, 599098623, 600391746, 601383150, 602612913, 603968501, 605379522, 605857193, 605187774, 604349196, 603658676, 602894187, 602063775, 601161957, 600279093, 599916816, 600004673, 599704862, 599272788, 599495947, 600517571, 601808429, 603076696, 604532897, 606251895, 608019054, 609578848, 611135840, 612878025]
1817.2F12878025J609802J273393J316727J489341J261413J254916J045287N51522
1833.6F22680426O53922Q04007M60267L82364J059175J118123L76821J34229J91033
1851.9F27860367K66433L61145L78251K69770J31965Q2493K74420O70611N20111J1980
1872.3F30827546P7367L58701L64780K35856K00271K77698L46065M61817L91662J63257
1892.7F33705020K80559M09305K79546K14457K45154L11375M08232M47154L38853J72794
1913.1F36812449K09212M79638M18425J15335J92106K46286J40846J19865J20580J40190
1933.5F38994932J49906Q4996L0875K04921K96891R2983l7730l8564K682P7784J01209
1955.9F39960885L5822j967m231K8193J35600J23382n0724p2837O2287J05560L6836
$$ y = [612878025, 614487827, 615761220, 617077947, 618567288, 619828701, 621083617, 622128904, 622680426, 623334348, 624138355, 624598622, 624980986, 626040161, 627158284, 627535105, 627669334, 627860367, 628126800, 628487945, 628866196, 629135966, 629267931, 629350424, 629624844, 630295455, 630815566, 630827546, 630904913, 631263614, 631628394, 631864250, 632064521, 632342219, 632688284, 633150101, 633541763, 633705020, 633985579, 634394884, 634674430, 634888887, 635134041, 635445416, 635853648, 636300802, 636639655, 636812449, 637021661, 637501299, 637919724, 638035059, 638227165, 638473451, 638614297, 638734162, 638854742, 638994932, 639144838, 639229834, 639260709, 639465630, 639762521, 639855504, 639817774, 639779210, 639781892, 639859676, 639960885, 639996707, 639994740, 639990509, 640018702, 640154302, 640277684, 640226960, 640154123, 640216410, 640321970, 640358806]
1978.4F40358806k8491k1398k623k1994m6373K7180R8050j6034r4473n8711o4254o8903
2002.8F40060782j9908J2458J2100J6093J8477L3379N6982K503p1168p2777p0631o3062
2027.3F39915228m7445m8757l2783k0861m1723n5492m1485j0789K2948M17m1902l5464
2051.8F39561892N841L3974j3172j14620j29819j0013N5372l0279j21355j00195k0802
2074.2F39116824m411o5863j15931r3043k7180j6093r6262j40070p7963q464m3035
2096.7F38428509j66178k26140j46210n7578q7976j84715k21074j42455n5611p2122
2117.1F37068450j60455k03133j39952q1479j51396k62797k28643r7394n2273j26362
2137.5F35564566k11537j69695l2365r358j54138k54154j66118n364M5955k7955j15931
$$ y = [640358806, 640330315, 640308917, 640306294, 640284300, 640237927, 640265107, 640363157, 640347123, 640252650, 640193939, 640129685, 640060782, 640040874, 640053332, 640065432, 640081525, 640100002, 640133381, 640190363, 640192866, 640121698, 640048921, 639978290, 639915228, 639867783, 639819026, 639786243, 639765382, 639723659, 639668167, 639626682, 639615893, 639638841, 639639258, 639597356, 639561892, 639567733, 639601707, 639588535, 639473915, 639344096, 639334083, 639389455, 639359176, 639237821, 639137626, 639116824, 639112413, 639046550, 638930619, 638837576, 638810396, 638794303, 638698041, 638557971, 638480008, 638471544, 638428509, 638262331, 638036191, 637889981, 637832403, 637744427, 637559712, 637338638, 637196183, 637140572, 637068450, 636907995, 636704862, 636564910, 636483431, 636332035, 636069238, 635840595, 635743201, 635690928, 635564566, 635353029, 635183334, 635150969, 635141611, 634987473, 634733319, 634567201, 634561837, 634607792, 634579837, 634463906]
2159.9F34463906r0778K1279K6465q2851j12414k3782L7670J2159n7757j10447p2658
2182.3F34010792J2219J2755p0095j14441p1406j2696k1935j04308j47342p9811l4213
2204.8F33379519r0837j50443j43349j02818r2745j33693j68800j46806j09137j05738
2225.2F32135153j33932j74224j66834q0049k7179o5565j02997j21713j39177r4414
2245.6F31029069l1232o2406r8050o2883n6326p7486o0916l6955n3525r1315j06215
2268F30291760q6308o8366j23918k25902k69174k60473k15172q9288P2479J71483K05934
2290.4F29403055K27868K29895K15352K39491K87295L21865M57644P31409R31144R11772
2310.8F33956790P00593N14507P58946J366854J691818J401544R16660Q32200J061558
$$ y = [634463906, 634373128, 634394407, 634420872, 634338021, 634225607, 634201825, 634239495, 634251654, 634193897, 634083450, 634010792, 634023011, 634035766, 633965671, 633851230, 633779824, 633767128, 633745193, 633640885, 633493543, 633413732, 633379519, 633288682, 633138239, 632994890, 632892072, 632799327, 632665634, 632496834, 632350028, 632240891, 632135153, 632001221, 631826997, 631660163, 631580114, 631552935, 631487370, 631384373, 631262660, 631123483, 631029069, 630997837, 630935431, 630837381, 630774498, 630718172, 630640686, 630579770, 630542815, 630489290, 630397975, 630291760, 630205452, 630137086, 630013168, 629787266, 629518092, 629257619, 629042447, 628953159, 629025638, 629197121, 629403055, 629630923, 629860818, 630076170, 630315661, 630602956, 630924821, 631382465, 632113874, 633045018, 633956790, 634657383, 635171890, 635930836, 637297690, 638989508, 640391052, 641307712, 642139912, 643201470]
2329.2F43201470Q79407K40326O4194L86060O06298N12123j59204k092898l754079
2347.5F39883697k383351J179397M011929M212916L041625J547158M0352j183033k067328
2365.9F48283362k765715l258824l429592l397763l324151l220975l027141k657950
2382.2F23201251k094507j447916q71599m70340k86758k83659l06904k50816j94669
2400.6F16994083k41041l28183l31462k66790k29478k58446l33488l72112l05950k45512
2421F14081621l01122l83497l80337l08394k77877l23475l84330m05491l64244l20196
2441.3F10632658l84688n04136n08368m14074l78132m83215o23583o31929n47290n26309
2461.7F05630934o16252p58410q30233q13722q49665r95814j171828j252174j216412
$$ y = [643201470, 644080877, 644321203, 644385397, 644771457, 645377755, 645889878, 645730674, 643637776, 639883697, 637500346, 638679743, 642691672, 646904588, 649946213, 651493371, 651533723, 650350690, 648283362, 645517647, 642258823, 638829231, 635431468, 632107317, 628886342, 625859201, 623201251, 621106744, 619658828, 618787229, 618316889, 618030131, 617746472, 617439568, 617188752, 616994083, 616753042, 616424859, 616093397, 615826607, 615597129, 615338683, 615005195, 614633083, 614327133, 614081621, 613780499, 613397002, 613016665, 612708271, 612430394, 612106919, 611722589, 611317098, 610952854, 610632658, 610247970, 609743834, 609235466, 608821392, 608443260, 607960045, 607336462, 606704533, 606157243, 605630934, 605014682, 604256272, 603426039, 602612317, 601762652, 600766838, 599595010, 598342836, 597126424]
2480.1E97126424j196325j303434j443267j456558j374186j312673j348137j390398
2496.4E86301446j264513j031339r12666r57608j021028r96947r28819r37999j031100
2514.8E77219427j058698q69989n41270k92242j54674j3471K00153M26412N29706M94122
2535.2E75939476M36008M06147L31580K03610J19984J56998K96891M26412M07815K24709
2555.6E78949630Q1003J08242J26004L3140p0452j15276o7949k8849j21891k54989
2576E78638613k88009k25366j77025k22266l05057l25381k87652k66612k93493l15368
2596.4E75932384l02852k76923k49266k61069k91049k73347k26736j91152j88232j99020
2616.8E73472738j76251j24454j15812j86205k22266j66118j29759j44839j63377j68562
$$ y = [597126424, 595930099, 594626665, 593183398, 591726840, 590352654, 589039981, 587691844, 586301446, 585036933, 584005594, 583092928, 582135320, 581114292, 580117345, 579188526, 578250527, 577219427, 576160729, 575290740, 574749470, 574457228, 574302554, 574289083, 574489236, 574915648, 575445354, 575939476, 576375484, 576781631, 577113211, 577316821, 577436805, 577593803, 577890694, 578317106, 578724921, 578949630, 579030633, 579138875, 579264879, 579298019, 579227567, 579112291, 579044342, 579015493, 578893602, 578638613, 578350604, 578125238, 577948213, 577725947, 577420890, 577095509, 576807857, 576541245, 576247752, 575932384, 575629532, 575352609, 575103343, 574842274, 574551225, 574277878, 574051142, 573859990, 573671758, 573472738, 573296487, 573172033, 573056221, 572870016, 572647750, 572481632, 572351873, 572207034, 572043657, 571875095]
2637.1E71875095j47164j25825j53184j90735k02715k49863l02911k81870k62916l07560
2657.5E69650352l40700l64781m02808l87609l55065l95357m38690m10855l92974m29809
2677.9E65731704m71949m77434m35471m00663m11212m30226m54009m78744m73142m57823
2698.3E61241031m49062m56690m68493m53055m44949m74155m88638m68910m55737m61221
2718.7E56620121m89175m93348m39167l97086m00961m09603m17649m34518m42326m36724
2739.1E52259564m37319m45425m12941l66629l85999m31061m18663l83377m18663m82738
2759.5E48076749m91917m71056m62472m59671m65513m85718m84407m76718m96208n21839
2779.9E43261230n49078n70118n86868o08504n99622n63145n69105o27756o67930o79076
$$ y = [571875095, 571727931, 571602106, 571448922, 571258187, 571055472, 570805609, 570502698, 570220828, 569957912, 569650352, 569309652, 568944871, 568542063, 568154454, 567799389, 567404032, 566965342, 566554487, 566161513, 565731704, 565259755, 564782321, 564346850, 563946187, 563534975, 563104749, 562650740, 562171996, 561698854, 561241031, 560791969, 560335279, 559866786, 559413731, 558968782, 558494627, 558005989, 557537079, 557081342, 556620121, 556130946, 555637598, 555198431, 554801345, 554400384, 553990781, 553573132, 553138614, 552696288, 552259564, 551822245, 551376820, 550963879, 550597250, 550211251, 549780190, 549361527, 548978150, 548559487, 548076749, 547584832, 547113776, 546651304, 546191633, 545726120, 545240402, 544755995, 544279277, 543783069, 543261230, 542712152, 542142034, 541555166, 540946662, 540347040, 539783895, 539214790, 538587034, 537919104, 537240028]
2800.3E37240028o84321o73413p04825p92980q20816p82191p59423p73013q38816r06467
2820.7E29503763r42409r77278j014292j084745j180589j260341j352667j519382j726389
2839.1E18445671j914680k123595k375304k524734k303243j715719j056791n67138
2855.4E03864467l74198l80933m29154n48005p44879r22203r90659q96364o74189m95851
2875.8D97408032m73857m96327m97014n60641o98686q31395q98123r09388q94487q58664
2896.2D90289450q29637q25853q42183r04560j035452j259178j538098j749992j824201
2914.5D79480296j727253j452625j085460p41780m33445j56253N8919K79278N07712
2932.9D74729389O25551O28173O01620N66095M89682L57359J99169J7911j63197k73138
$$ y = [537240028, 536555707, 535882294, 535177469, 534384489, 533563673, 532781482, 532022059, 531249046, 530410230, 529503763, 528561354, 527584076, 526569784, 525485039, 524304450, 523044109, 521691442, 520172060, 518445671, 516530991, 514407396, 512032092, 509507358, 507204115, 505488396, 504431605, 503864467, 503490269, 503109336, 502680182, 502132177, 501387298, 500465095, 499474436, 498578072, 497903883, 497408032, 496934175, 496437848, 495940834, 495380193, 494681507, 493850112, 492951989, 492042601, 491148114, 490289450, 489459813, 488633960, 487791777, 486887217, 485851765, 484592587, 483054489, 481304497, 479480296, 477753043, 476300418, 475214958, 474473178, 474039733, 473883480, 473942399, 474221677, 474729389, 475354940, 475983113, 476584733, 477150828, 477640510, 477997869, 478197038, 478214949, 478051752, 477778614]
2953.3D77778614l18349k75791j30295O1094K57791M21971N30898N72413N83411N81950
2973.7D80063707N23358M23521L71277L98726M11301L57211L05027K58058K12550K02895
2994.1D83527631J49071M5955k5570r2090j63316k05398k30431k53082k95579l29316
3014.5D82127875l04371l02434l67939m61996n43207n87285n97953n78583o09159o63430
3034.9D77111518o69747o83189p01368p11381p15941o80775o72668p52926p99477p42018
3055.3D69982028p01398p47859p67052o99967o45370o56336p04050p29174p19905p20054
3075.6D62890863o86258o05970o29634p47174p66635p04288o81013o94216o93053o88761
3096D55993861o97911o77168o90371p57188p47144o99490p29770p66962p43181p42674
$$ y = [477778614, 477460265, 477184474, 477054179, 477115273, 477373064, 477795035, 478325933, 478898346, 479481757, 480063707, 480587065, 481010586, 481381863, 481780589, 482191890, 482549101, 482854128, 483112186, 483324736, 483527631, 483676702, 483722657, 483697087, 483604997, 483441681, 483236283, 483005852, 482752770, 482457191, 482127875, 481823504, 481521070, 481153131, 480691135, 480147928, 479560643, 478962690, 478384107, 477774948, 477111518, 476441771, 475758582, 475057214, 474345833, 473629892, 472949117, 472276449, 471523523, 470724046, 469982028, 469280630, 468532771, 467765719, 467065752, 466420382, 465764046, 465059996, 464330822, 463610917, 462890863, 462204605, 461598635, 460969001, 460221827, 459455192, 458750904, 458069891, 457375675, 456682622, 455993861, 455295950, 454618782, 453928411, 453171223, 452424079, 451724589, 450994819, 450227857, 449484676, 448742002]
3116.4D48742002q00669q35448q27820q36968q61853q90971q84205q18342q08835q45194
3136.8D40331697q68737r28521r77934r59903r12279q64774q29458q89420j019568
3155.2D32081103j056581r85235r16362r47327j049488j057595r68278r47207j005173
3173.5D23147857j037240j004606j003415j058876j031071r65715r61780r53555r62407
3191.9D14169192j029193j062334j043349j027465r89616r60201r94474j026481j016378
3210.3D05019701r64016r29564r82613r88602r33260r61930r93997r36836q69155q34375
3230.7C95625353q50022r47505j002312r45002r03874q57413p76708q30263r74119
3249C87538135r58025q02100p56353q53449q99673q80092q71718q27700p44343p06792
$$ y = [448742002, 447941333, 447105885, 446278065, 445441097, 444579244, 443688273, 442804068, 441985726, 441176891, 440331697, 439462960, 438534439, 437556505, 436596602, 435684323, 434819549, 433990091, 433100671, 432081103, 431024522, 430039287, 429122925, 428175598, 427126110, 426068515, 425100237, 424153030, 423147857, 422110617, 421106011, 420102596, 419043720, 418012649, 417046934, 416085154, 415131599, 414169192, 413139999, 412077665, 411034316, 410006851, 409017235, 408057034, 407062560, 406036079, 405019701, 404055685, 403126121, 402143508, 401154906, 400221646, 399259716, 398265719, 397328883, 396459728, 395625353, 394775331, 393827826, 392825514, 391880512, 390976638, 390119225, 389342517, 388512254, 387538135, 386580110, 385778010, 385021657, 384168208, 383268535, 382388443, 381516725, 380689025, 379944682, 379237890]
3269.4C79237890p64012q43823q35240p72148p46131p67261q19802q33601p60645o52522
3289.8C71442705n86539o52820p78913q20995p96437p12961o31154o81936q04127q80628
3310.2C64096195q84712q47310q41081q82626r18805q89719q22335q53688r94861j051128
3330.6C55109930r67801q65399q24184r04649j010537j025856j013636r35585p79807
3348.9C46782476p84308r58890r85175q59112p91132p94977p85381o82890o29991p76649
3369.3C38733971r52721r59485q35181p17043o84500p02828o62297o19263o13540m93288
3389.7C31493825l92795n79625p38263n43625l54230m99904p13945o60270m79549l65883
3410.1C26165736l14385l87430n09709m16398k09660k06500k67714j77652p5489n0604
$$ y = [379237890, 378473878, 377630055, 376794815, 376022667, 375276536, 374509275, 373689473, 372855872, 372095227, 371442705, 370856166, 370203346, 369424433, 368603438, 367807001, 367094040, 366462886, 365780950, 364976823, 364096195, 363211483, 362364173, 361523092, 360640466, 359721661, 358831942, 358009607, 357155919, 356161058, 355109930, 354142129, 353276730, 352452546, 351547897, 350537360, 349511504, 348497868, 347562283, 346782476, 345998168, 345039278, 344054103, 343194991, 342403859, 341608882, 340823501, 340140611, 339510620, 338733971, 337781250, 336821765, 335986584, 335269541, 334585041, 333882213, 333219916, 332600653, 331987113, 331493825, 331101030, 330521405, 329783142, 329239517, 328885287, 328385383, 327671438, 327011168, 326531619, 326165736, 325851351, 325463921, 324954212, 324537814, 324328154, 324121654, 323853940, 323676288, 323600799, 323550195]
3430.5C23550195p689J6838j09255k92182k52277o8605Q7142K47627J67370j4990M2438
3453C23366612J29521J91659L02493L50655L62634M55588N40465L82424J35422J46716
3473.4C26364189L09170M02212N28633O17207M54962M02599N83291N60791M04089M80146
3493.8C31107289O67929O01143M90457P41094Q03262M00096M39823Q56519Q67277O02037
3514.2C37576926M51624M38035N74410R37134J070380Q61168Q46356Q12799O18100
3532.5C44186932P43389R75102P97481N74767Q29071J445889J499683P08938N83380
3550.9C52344632J103014R22620O38753Q72702P98017L50087J221508L079802K275407
3569.2C63606542K28078K19792J020491J285940J285553R33081M51505J382739L239721
$$ y = [323550195, 323542506, 323559344, 323450089, 323157907, 322905630, 322837025, 322924167, 323171794, 323339164, 323324174, 323366612, 323496133, 323687792, 323990285, 324340940, 324703574, 325159162, 325699627, 326082051, 326217473, 326364189, 326673359, 327075571, 327604204, 328221411, 328676373, 329078972, 329662263, 330223054, 330627143, 331107289, 331775218, 332376361, 332866818, 333607912, 334411174, 334811270, 335251093, 336107612, 336974889, 337576926, 338028550, 338466585, 339040995, 339978129, 341048509, 341909677, 342756033, 343568832, 344186932, 344930321, 345905423, 346702904, 347277671, 348106742, 349552631, 351052314, 351761252, 352344632, 353447646, 354370266, 355009019, 355881721, 356679738, 357029825, 358251333, 361331135, 363606542, 363834620, 364054412, 365074903, 366360843, 367646396, 368579477, 369030982, 370413721, 373653442]
3587.6C73653442K189904J35958P64013J837015J563728J428544J264155L68536N02884
3605.9C83708179J993358K231062J504868J050442N50062K041071L332586Q69184j477033
3624.3C95803779k60144M832059N342156N26577j91391P22081Q26985P91549J6660
3642.6D08410311q22485J094818N863607N181760o24240q56608K181113J414746r5069
3661D21747953j02163p91549n55814K505571K541512K9505L409892L847241p67290
3679.4D31864858j748830j812637j779288J175016M465997K065420j312315j583487
3695.7D31334734q38906M29899K131343J061022j505792j204640J888514L870249O69986
3714D37836409k355904j807600k47031N38915O83397K80648j659005k620876k48581
$$ y = [373653442, 375843346, 375979304, 376743317, 378580332, 380144060, 381572604, 382836759, 383205295, 383708179, 385701537, 387932599, 389437467, 390487909, 391037971, 393079042, 396411628, 397280812, 395803779, 395543635, 400375694, 405717850, 406244427, 406053036, 406775117, 407602102, 408393651, 408410311, 407587826, 408682644, 414546251, 419728011, 419103771, 418247163, 420428276, 421843022, 421747953, 421645790, 420854241, 420298427, 422803998, 425345510, 425375015, 428784907, 432632148, 431864858, 430116028, 428303391, 426524103, 427699119, 432165116, 434230536, 432918221, 431334734, 430495828, 430925727, 433057070, 434118092, 432612300, 431407660, 433296174, 437166423, 437836409, 435480505, 433672905, 433425874, 433964789, 434648186, 434928834, 433269829, 430648953, 430400372]
3732.4D30400372L183186L304392j101584m639893j663179M393280J454294j373261
3748.7D33957607L304511K889186k049655k158254N94735N42045j272858o99698L65585
3767.1D35473204J202166J214444r12964j940578m82738J378268O41674o19650p5966
3785.4D35877860n3913o13957r74089j027406j80393l49552K16991K664268L69370
3803.8D35929179q25465J236558j065492l536523j596272J701504O90848Q59171K626658
3822.1D36020166p51794k179146j258581r55016m65989n25176P40259K677292J133412
3840.5D34435427o32733r64373k422005m130274k644420N212903P767230j457065m791945
3858.8D30372745k543926L04311Q20756r19074L10898K008587K69681j195490k172947
$$ y = [430400372, 433583558, 436887950, 435786366, 431146473, 429483294, 433876574, 435330868, 433957607, 437262118, 440151304, 438101649, 435943395, 436538130, 437080175, 435807317, 435107619, 435473204, 436675370, 437889814, 436976850, 435036272, 434553534, 435931802, 436573476, 435953826, 435877860, 435823947, 435209990, 434235901, 433208495, 433028102, 432678550, 432895541, 435559809, 435929179, 435103714, 436340272, 435274780, 431738257, 430141985, 431843489, 432534337, 433393508, 436020166, 435268372, 433089226, 431830645, 430875629, 430409640, 429884464, 430624723, 433302015, 434435427, 433802694, 432838321, 430416316, 426286042, 423641622, 428854525, 436621755, 435164690, 430372745, 427828819, 428133130, 428953886, 428034812, 428345710, 430354297, 430623978, 429428488, 427255541]
3877.2D27255541p82430Q99553p0065P53105M3362j446903O45936L12775k464175j902551
3897.6D23244148N68867J803935K050131P18475j485288j773328j160204r87679K6733
3915.9D23005790J088708K43932p94768k68370m2975q07017l44783P49171K00450q98808
3936.3D22131330j046300m49240L92437J57058m60297p749J17839m14282m97103k97815
3956.7D19625878k23338j00196o4611l27587m36604k43694j16527j14620p0482j30028
3977.1D17798191k70694k28435j43558k65091l63738j92761j14173k17825j51426r3788
3997.5D15756702
$$ y = [427255541, 426473111, 427372664, 427302599, 428055704, 428099066, 426652163, 427298099, 427610874, 425146699, 423244148, 423813015, 425616950, 427667081, 428385556, 426900268, 425126940, 423966736, 422979057, 423005790, 424094498, 424338430, 423543662, 423275292, 423232317, 422425300, 422080517, 422829688, 423030138, 422131330, 421085030, 420635790, 421028227, 421185285, 420724988, 420717239, 420835078, 420420796, 419923693, 419625878, 419402540, 419302344, 419237733, 418910146, 418473542, 418229848, 418113321, 417998701, 417928219, 417798191, 417527497, 417299062, 417155504, 416890413, 416526675, 416333914, 416219741, 416001916, 415850490, 415756702]
##END=$$ End of the data block
