##TITLE=$$ Begin of the data block
##JCAMP-DX=5.00 $$ ACD/SpecManager v 10.08
##SPECTROMETER/DATA SYSTEM=Alpha
##DATE=13 Jun 2014 08:26:00
##DATA TYPE=INFRARED SPECTRUM
##DATA CLASS=XYDATA
##ORIGIN=
##OWNER=
##NPOINTS=1765
##FIRSTX=399.75695801
##LASTX=3997.56933594
##MAXX=3997.56933594
##MINX=399.75695801
##MAXY=0.69785714
##MINY=0.24551919
##XFACTOR=1.0000000000
##YFACTOR=1.000000000000000e-9
##FIRSTY=0.55873317
##DELTAX=2.03957629
##XUNITS=1/CM
##YUNITS=ARBITRARY UNITS
##XYDATA=(X++(Y..Y))
399.8E58733165J0700226J0097385O555497K154708R36270K204180K196252N57721
416.1E94135404K04265J800239K379238J363337o0975J08242J660287J934648N83053
434.4F04107738l46601N08904J661360J066506p75039j414478l30925J78158r76204
452.8F03679419j745761p15077J122296J901865J223862M19498Q83400K059400K214849
471.1F11043751J299858J076460K162338L155589K764105J706481J694084K661943
487.5F27564609K880454J922369J178324J460553K053856J909852Q89838O5804L32296
505.8F40257955R48131P49409K38r5665O21915J136362R14395N39124Q33988J585543
526.2F47491395J766921J278698P48456P99834J525641K045750J755178J194835J128495
$$ y = [558733165, 569433391, 579530776, 586086273, 588240981, 589177251, 591381431, 593577683, 594135404, 594339669, 596139908, 598519146, 599882483, 599821508, 599929750, 601590037, 603524685, 604107738, 603761137, 604270041, 605931401, 606997907, 606222868, 604808390, 604477465, 604655623, 603679419, 601933658, 601218581, 602340877, 604242742, 605466604, 605886102, 606769502, 608828902, 611043751, 612343609, 613420069, 615582407, 618737996, 621502101, 623208582, 624902666, 627564609, 630445063, 632367432, 633545756, 635006309, 637060165, 638970017, 639859855, 639925659, 640257955, 641206086, 641955495, 641955733, 641860068, 642481983, 643618345, 644532740, 645071864, 645905852, 647491395, 649258316, 650537014, 651285470, 652085304, 653610945, 655656695, 657411873, 658606708, 659735203]
544.6F59735203J517653J577616R81688M77195N99623R92596J109839R16540P78735
562.9F68686688R34303J228809J158238O98924M87327P62940J074552R99510O62268
581.3F76693559N06818P90715J125515J074493P58350M25934L41237M32670K84374
599.6F82433665j11282m32909n24163m33743l58879m83275m09841J32262M18186K20418
620F80450439J63496L61502N76139O09398M14848K94089M61757P02620P85649O86764
640.4F85506701M29452K96891N37812O11365l9458p18772p62821o92129r78887j437366
660.8F82752788j483262m291K474189P03871l279209k266228o05166l17216o59049
679.2F77316427j025975j329064j568019j911819k549589l172338l215551k904356
$$ y = [659735203, 661252856, 662830472, 663812160, 664289355, 664888978, 665881574, 666991413, 667907953, 668686688, 669620991, 670849800, 672008038, 672706962, 673194289, 673957229, 675031781, 676031291, 676693559, 677200377, 677991092, 679116607, 680191100, 680949450, 681375384, 681716621, 682149291, 682433665, 682322383, 681889474, 681365311, 680931568, 680572689, 680089414, 679679573, 679811835, 680230021, 680450439, 680613935, 680975437, 681551576, 682160974, 682575822, 682869911, 683331668, 684034288, 684819937, 685506701, 685936153, 686233044, 686770856, 687382221, 687342763, 686623991, 685861170, 685169041, 684190154, 682752788, 681269526, 681265235, 683739424, 684443295, 681164086, 678897858, 678292692, 677975476, 677316427, 676290452, 674961388, 673393369, 671481550, 668931961, 665759623, 662544072, 659639716]
695.5F59639716k824783j174689J695216R08077l670096q583069j2884140j1623681
711.8F21482551j026332Q530676Q827865O102741N349636N903602O738960O929338
728.1F68839037O190062M835010L189146J758933R63807N53489J38581k39909l84450
746.5F85843706l66270l42071m68672p46250q98600q44478q02338r79007j254141j397669
766.9F77744210j363755j325607j466036j564026j128017r3401R08852J212954Q53896
785.2F73779070M08709K00034j12176o20783o54697J67429J421273K330005K626121
803.6F79544985K658248K706468K752781K596796K086699J504540J263202J243531
819.9F96357250J054585M45306l45468q49366j187325j895606l036738m039526m627824
$$ y = [659639716, 656814933, 655640244, 657335460, 658243537, 654573441, 645990372, 633106232, 621482551, 620456219, 628986895, 637814760, 643917501, 649267137, 655170739, 661909699, 668839037, 675029099, 679864109, 683053255, 684812188, 685775995, 686329484, 686468065, 686228156, 685843706, 685477436, 685135365, 684666693, 683920443, 683021843, 682177365, 681375027, 680396020, 679141879, 677744210, 676380455, 675054848, 673588812, 672024786, 670896769, 670803368, 671712220, 672925174, 673779070, 674187779, 674387813, 674275637, 673654854, 673000157, 673167586, 674588859, 676918864, 679544985, 682203233, 684909701, 687662482, 690259278, 692345977, 693850517, 695113719, 696357250, 697411835, 697857141, 697511673, 696662307, 695474982, 693579376, 690542638, 686503112, 681875288]
838.3F81875288n513012o445348o626547p255256q291721j0032058j4195084j6682744
854.6F06833518j3063908o727040k463639j587331m783630j3464809k5518417l1696141
870.9E07528603k5148958j0355502O749660K3712188L4795343L5906315L1052888K4972677
887.2F29213214J8419862J1988461P084250M273355L130973K682447K005994J100839
903.5F79899395N75304O56366Q40902M25816l87669p37607n69523o37233j172006j645923
923.9F77247822j608610j263499j120865j295746j407564j124203o89327o45638j028717
942.3F67063653j276731j104951q59678j017689j512051j818955j808882j873493k242446
960.6F53548777k638042k672255k415001k397478k822995l261566l369510l384531
$$ y = [681875288, 676362276, 669916928, 663290381, 656035125, 647743404, 637711346, 623516262, 606833518, 593769610, 587042570, 584578931, 582991600, 578207970, 564743161, 539224744, 507528603, 482379645, 472024143, 478773803, 502485991, 537281334, 573187649, 604240537, 629213214, 647633076, 659621537, 666705787, 670979142, 674110115, 676792562, 678798556, 679899395, 680474699, 681131065, 681971967, 682397783, 682010114, 681272507, 680702984, 680065751, 678893745, 677247822, 675639212, 674375713, 673254848, 671959102, 670551538, 669427335, 668738008, 668092370, 667063653, 665786922, 664681971, 663822293, 662804604, 661292553, 659473598, 657664716, 655791223, 653548777, 650910735, 648238480, 645823479, 643426001, 640603006, 637341440, 633971930, 630587399]
977F30587399l681958m242003m632353m497171m105806l968299m039585l857434l367543
995.3E94195247l012419l083825l341258l362417l133535l057063l289998l430604
1011.6E68484128l197670k861083k802789k947986k967298k705813k313852k133727
1027.9E46553910k143920j924157j289427m98653O0022K00928Q3029j69695o15418
1046.3E40256619j153349j512230j512766j278579j082003q67248l70502J97410L51191
1064.7E33028543j49250j081705j902640k291858k392590k566993l298343l568828
1081E15776336q07941L188730M136502K979517K401889K363681K083600J449406Q67903
1099.3E34439623O74963Q09014Q77977O74009N02527O80804J121819J450598J394332
$$ y = [630587399, 626905441, 622663438, 618031085, 613533914, 609428108, 605459809, 601420224, 597562790, 594195247, 591182828, 588099003, 584757745, 581395328, 578261793, 575204730, 571914732, 568484128, 565286458, 562425375, 559622586, 556674600, 553707302, 551001489, 548687637, 546553910, 544409990, 542485833, 541196406, 540697753, 540757775, 540958703, 541041732, 540872037, 540256619, 539103270, 537591040, 536078274, 534799695, 533717692, 532850444, 532479942, 532677352, 533028543, 532879293, 531797588, 529894948, 527603090, 525210500, 522643507, 519345164, 515776336, 514968395, 518157125, 522293627, 525273144, 527675033, 530038714, 532122314, 533571720, 534439623, 535114586, 535923600, 536801577, 537475586, 537978113, 538658917, 539780736, 541231334, 542625666]
1117.7E42625666J092612Q84235Q97587R74297R89497J055717J187146J194418R72569
1136E51873744N28931M8518k00748k92838m58300o89030q06510o63638l87550l47673
1156.4E48604906o44088q29220m29630L92139J106918J514554J746118J946926K093911
1174.8E55502534K044856J815200J596034J481891J316487R50754M69685J13248k6941
1193.1E65263748j73032m61459p25806p47204n81503m72009n10454n75543n44667n10752
1213.5E59961319o34789q93832j100898j154720j137019j235604j458108j587689j487315
1231.9E49271345j295566j235009j280069j301646j228154j121759j103521j183569
1248.2E39522052j193285j063109r82165j080513j225412j217842j119614j058042
$$ y = [542625666, 543718278, 544602513, 545500100, 546474397, 547463894, 548519611, 549706757, 550901175, 551873744, 552402675, 552451193, 552250445, 551957607, 551499307, 550810277, 550003767, 549340129, 548952579, 548604906, 547960818, 547131598, 546701968, 547094107, 548201025, 549715579, 551461697, 553408623, 555502534, 557547390, 559362590, 560958624, 562440515, 563757002, 564707756, 565177441, 565290689, 565263748, 565090716, 564629257, 563903451, 563156247, 562574744, 562102735, 561592281, 561016738, 560472071, 559961319, 559326530, 558432698, 557331800, 556177080, 555040061, 553804457, 552346349, 550758660, 549271345, 547975779, 546740770, 545460701, 544159055, 542930901, 541809142, 540705621, 539522052, 538328767, 537265658, 536283493, 535202980, 533977568, 532759726, 531640112, 530582070]
1264.5E30582070j082837j136959j144230j106203j143336j288354j402855j387179
1280.8E20890117j231373j143634j228452j390993j501620j579404j688838j834810
1297.2E09290993j995206k103626k167344k228976k336025k410591k460926k483666
1313.5D91104633k433062k308249k207458k180338k192557k314180k536208k781182
1329.8D72151399k870083k832920k796828k876729k971053k902866k841115k936542
1346.1D49123263l111004l268958l486782l692537l836751l859759l921568m176676
1362.4D19769228m314781m256218m357636m432798m401147m606217m715413m780114
1378.7C83904904n021006n153894n016089n065679n316436n307526n694389o500155
$$ y = [530582070, 529499233, 528362274, 527218044, 526111841, 524968505, 523680151, 522277296, 520890117, 519658744, 518515110, 517286658, 515895665, 514394045, 512814641, 511125803, 509290993, 507295787, 505192161, 503024817, 500795841, 498459816, 496049225, 493588299, 491104633, 488671571, 486363322, 484155864, 481975526, 479782969, 477468789, 474932581, 472151399, 469281316, 466448396, 463651568, 460774839, 457803786, 454900920, 452059805, 449123263, 446012259, 442743301, 439256519, 435563982, 431727231, 427867472, 423945904, 419769228, 415454447, 411198229, 406840593, 402407795, 398006648, 393400431, 388685018, 383904904, 378883898, 373730004, 368713915, 363648236, 358331800, 353024274, 347329885, 340829730]
1395.1C40829730o820440o998360p049293p023602p518769p537842p151752o942272
1411.4B83787400o511927n792976n263358m800618l419876k049416j137823l64363
1427.7B54447043K81960N65558N97775P72268O60926K6614l96044o50495q29696r00656
1448.1B54575253r08673q16137n76466L5345M58002j758m27425q85516j594231j857251
1468.5B48001143j543358q93876m4718O55949J268551J907021K439812K737730L273517
1486.8B57801771M216314M623770L958017M091978N345911N551219M675477L986538
1503.2B94250995N023956P557690O178528M476965M625261N181759N629063N621016
1519.5C38545233O280005N976319N132258N308092M834115M929781N782098M795253
$$ y = [340829730, 334009290, 327010930, 319961637, 312938035, 305419266, 297881424, 290729672, 283787400, 277275473, 271482497, 266219139, 261418521, 257998645, 255949229, 254811406, 254447043, 254729003, 255294561, 255892336, 256664604, 257325530, 257352144, 256956100, 256305605, 255475909, 254575253, 253666580, 252850443, 252273977, 252309322, 252767324, 252765566, 252338141, 251452625, 249858394, 248001143, 246457785, 245563909, 245519191, 246175140, 247443691, 249350712, 251790524, 254528254, 257801771, 262018085, 266641855, 270599872, 274691850, 280037761, 285588980, 290264457, 294250995, 299274951, 306832641, 313011169, 317488134, 322113395, 327295154, 332924217, 338545233, 344825238, 350801557, 355933815, 361241907, 366076022, 371005803, 376787901, 381583154]
1535.8C81583154M262805O713748P133842N054950M420937M275739M583925M591703
1552.1D22620803M354388M180282N933851O451756K864182K168774K728343L162623
1568.4D54465002L300011K218574K046943K843708J945913J079678J102328J050979
1584.7D70053136Q37297O66529M74274K74837J26123k9892j39802k09034k83420l89397
1605.1D71380651l91901m34964o69599q42810n31912l06069p76172p85709m72933n30719
1625.5D65637863n36532m46885m81993O1720J064122P41601Q2493K45958P22170J719505
1645.9D68810022J806378N89133J617461L400445J465350P72387J636058K566606K531409
1664.3D85195249J914561K620429L381908K520144K644032L117353K382874K035857
$$ y = [381583154, 385845959, 392559707, 399693549, 404748499, 409169436, 413445175, 418029100, 422620803, 426975191, 431155473, 437089324, 443541080, 446405262, 448574036, 451302379, 454465002, 457765013, 459983587, 462030530, 464874238, 466820151, 467899829, 469002157, 470053136, 470890433, 471556962, 472031236, 472306073, 472432196, 472402304, 472262502, 472053468, 471770048, 471380651, 470988750, 470553786, 469884187, 469041377, 468509465, 468203396, 467427224, 466641515, 466168582, 465637863, 465101331, 464654446, 464172453, 464234173, 465298295, 466039896, 466122389, 466368347, 467090517, 468810022, 470616400, 471205533, 472822994, 476223439, 477688789, 478461176, 480097234, 482663840, 485195249, 487109810, 489730239, 493112147, 495632291, 498276323, 501393676, 503776550, 505812407]
1680.6E05812407L073692M728615L398299K263308K594352K507925L377437M128874
1696.9E31884909M075825M613936L095448K529263L036976K429724J933098J909375
1713.2E55508554K402306L284990K482176J114488J178205J517475J454174J362562
1729.5E70304930J430512K437353K211034R91464J452684J866937J655519J805663
1745.9E84156096K192318K662421K415359J594424J671672J887202J696885J796186
1762.2F00072563J339912J002312J216531J310825J368821N18441o08266q39293p22229
1780.5F04659617p67052q03590q69155q76844m10139L5226k87533m00960K36511J036405
1800.9F01552486J326323J303434J458109J707971J790523J599491J550973J730799
$$ y = [505812407, 508886099, 513614714, 517013013, 519276321, 521870673, 524378598, 527756035, 531884909, 535960734, 540574670, 543670118, 546199381, 549236357, 551666081, 553599179, 555508554, 557910860, 561195850, 563678026, 564792514, 565970719, 567488194, 568942368, 570304930, 571735442, 574172795, 576383829, 577375293, 578827977, 580694914, 582350433, 584156096, 586348414, 589010835, 591426194, 593020618, 594692290, 596579492, 598276377, 600072563, 601412475, 602414787, 603631318, 604942143, 606310964, 606829405, 606221139, 605381846, 604659617, 603892565, 603088975, 602219820, 601342976, 600932837, 600968063, 600680530, 600279570, 600516081, 601552486, 602878809, 604182243, 605640352, 607348323, 609138846, 610738337, 612289310, 614020109]
1817.2F14020109J642466J278877J265049J456738J269817J277089J094162N73218
1833.6F23877525O27816Q13007N08309L80754J016736J126469M09483J39416J85430
1851.9F29084945K82049L90649L82900K47598J09791Q2910K89798O87838N40376K0384
1872.3F32119238P0691L36648L30626K25008K17497K82169L38197M75764M12106J55807
1892.7F34963751K76565M41969L17037K30074K59459L23057M00901M46677L45409J54912
1913.1F38159811J75775M77075M52697J36197J89006K35498J30177J17242J28746J51634
1933.5F40353858J45674P3314M3213K24650K80380O1751l0458N305M1902Q4996R9242
1955.9F41383827O5267J4543l2067j0312R2864J04964k2530k9624R6023J15395K7895
$$ y = [614020109, 615662575, 616941452, 618206501, 619663239, 620933056, 622210145, 623304307, 623877525, 624505341, 625318348, 625826657, 626207411, 627224147, 628350616, 628760099, 628899515, 629084945, 629366994, 629757643, 630140543, 630388141, 630497932, 630580842, 630870640, 631558478, 632098854, 632119238, 632189929, 632526577, 632857203, 633082211, 633299708, 633581877, 633920074, 634395838, 634807944, 634963751, 635240316, 635682285, 635999322, 636229396, 636488855, 636811912, 637212813, 637659490, 638004899, 638159811, 638335586, 638812661, 639265358, 639401555, 639590561, 639826059, 639956236, 640073478, 640202224, 640353858, 640499532, 640572846, 640616059, 640840709, 641121089, 641182840, 641152382, 641157687, 641199589, 641284585, 641383827, 641449094, 641463637, 641431570, 641421258, 641514122, 641619086, 641596556, 641566932, 641662955, 641778350, 641806245]
1978.4F41806245k1160k563M828k1994o0201K0624J17003j9967j50085r7811p927K1696
2002.8F41588688P391K503p152k8312j7226L7670Q3089N781j05440r0063l9995m1067
2027.3F41395867o6400o2883j6987J6391j1742n8770m6313Q703M5359N126m8638l9220
2051.8F41120493k384K5869R894o9916j11580k0862M1902m4822j29939r0062j431K3067
2076.3F40750229m4822j28329j23680n2333j7702p2897j39773r8049J1503N663j40548
2098.7F39949262k38895j75953n4658m5299j61231k33352j39892j7107m1663j73211
2119.1F38668001k41816j83463j07348j25766k09213k11298j08242o0081j30833j98543
2139.5F37091398j55806m7684k2590j10209j73986j27614j8179J9669n8412j28210
$$ y = [641806245, 641785085, 641782522, 641787350, 641765356, 641705155, 641725779, 641842782, 641822815, 641672730, 641574919, 641566992, 641588688, 641596079, 641598582, 641591430, 641563118, 641545892, 641583562, 641666651, 641672432, 641566992, 641476929, 641436934, 641395867, 641329467, 641266584, 641249597, 641265988, 641254246, 641195476, 641149163, 641157866, 641203225, 641208351, 641159713, 641120493, 641118109, 641143978, 641153872, 641083956, 640972376, 640951514, 640993416, 640948594, 640818655, 640728593, 640727162, 640750229, 640705407, 640577078, 640453398, 640401065, 640383363, 640310466, 640170693, 640072644, 640084147, 640089810, 639949262, 639710367, 639534414, 639479756, 639434457, 639273226, 639039874, 638899982, 638882875, 638841212, 638668001, 638426185, 638242722, 638135374, 638009608, 637800395, 637589097, 637480855, 637420774, 637289941, 637091398, 636935592, 636887908, 636865318, 636755109, 636581123, 636453509, 636435330, 636454999, 636396587, 636268377]
2159.9F36268377p5102L5763L7790o7532j14859m1961M6432L7491n6326j08123n7757
2182.3F35904193N066j5616o8903o9976m4107m1843o7115j10268j27793p7903k5391
2204.8F35260344n4360j29759j51336j13964q1063j05500j52826j38581j13726j22428
2225.2F34096801j34170j48594j42098q8632m1723n8889r6858j14441j19388r2983
2245.6F33059025o9678j04547j08957m8518k6405m6790n9008n0783l9280p7128j15574
2268F32312357q6963o3777j16288j93477k36094k62618k20776p3671P1645J41382J71840
2290.4F31443560K08318K08855J82390K26915L02851L40224M35412O34789Q15213Q37326
2310.8F35635853O60896N17964P69794J315892J619935J381994R03546P39396R18508
$$ y = [636268377, 636193275, 636229038, 636266828, 636199296, 636084437, 636042476, 636088908, 636126399, 636070073, 635961950, 635904193, 635909259, 635893643, 635824740, 635754764, 635710657, 635668814, 635601699, 635491431, 635363638, 635285735, 635260344, 635205984, 635076225, 634924889, 634810925, 634729862, 634624362, 634471536, 634332955, 634219229, 634096801, 633962631, 633814037, 633671939, 633583307, 633541584, 633482695, 633385837, 633271396, 633152008, 633059025, 632989347, 632884800, 632775843, 632727325, 632700920, 632654130, 632595122, 632544339, 632505059, 632427931, 632312357, 632225394, 632161617, 632045329, 631851852, 631615758, 631353140, 631132364, 631058693, 631130338, 631271720, 631443560, 631651878, 631860733, 632043123, 632270038, 632572889, 632913113, 633348525, 633983314, 634798527, 635635853, 636296749, 636814713, 637584507, 638900399, 640520334, 641902328, 642805874, 643545270, 644463778]
2329.2F44463778P76886K01405N6386L53694N33401M92573m9472j894593l602028k359748
2349.6F38972282J096666L853321L989041K862692J531243Q3208j156866j973987k597511
2367.9F46660089l119885l338576l224849l076137l030240k899707k562761k043009
2384.2F23364925j412689q41320m70638k89381k61247k94745k76565k20240k19821
2402.6F19078279k94447l38078k77400j93596k13444l16620l78191l44158l00109l25978
2423F16096258l65317l66389l28303k82883l04044l71873l91185l51370l22819l81887
2443.4F12630188m74333m87924m36783l96967m58181n92291o45697n89550n37753o05821
2463.8F07404888p59185q24451p90060q19087r86457j193821j260281j192212j181841
$$ y = [644463778, 645240664, 645442069, 645498455, 645852149, 646385550, 646878123, 646828651, 644934058, 641332030, 638972282, 640068948, 643922269, 647911310, 650774002, 652305245, 652388453, 651231587, 649257600, 646660089, 643540204, 640201628, 636976779, 633900642, 630870402, 627970695, 625407934, 623364925, 621952236, 621110916, 620640278, 620350897, 620089650, 619794905, 619518340, 619298100, 619078279, 618783832, 618445754, 618168354, 617974758, 617761314, 617444694, 617066503, 616722345, 616422236, 616096258, 615730941, 615364552, 615036249, 614753366, 614449322, 614077449, 613686264, 613334894, 613012075, 612630188, 612155855, 611667931, 611231148, 610834181, 610376000, 609783709, 609138012, 608548462, 608010709, 607404888, 606645703, 605821252, 605031192, 604212105, 603225648, 602031827, 600771546, 599579334, 598397493]
2482.1E98397493j318216j464486j456440j360654j324237j359582j364767j248837
2498.5E87500274j055717r48549r73224j004994r61781q84115r21190j075328j121461
2516.8E78553915r00686n20944k48790j45137l2008K11060M65870N60999N10513M30406
2537.2E78885198L82423L13163K01702J35958J76191L05355M46320M40418K40744Q1598
2557.6E81609070J01447J17481J9908p0572q7797o0499m2021j06454k19882k71916
2578E80988765k29299j84775k20179k87533l18945k94864k60114k83003l13401k95222
2598.4E78301430k64526k36392k38835k73109k71142k23219j86384j99377k30491k18809
2618.8E75959146j56939j11341j43946j84357j60515j32203j39118j51813j36017j18614
$$ y = [598397493, 597079277, 595614791, 594158351, 592797697, 591473460, 590113878, 588749111, 587500274, 586444557, 585496008, 584522784, 583517790, 582556009, 581671894, 580750704, 579675376, 578553915, 577653229, 577132285, 576883495, 576738358, 576706350, 576917410, 577383280, 577944279, 578454792, 578885198, 579267621, 579580784, 579782486, 579918444, 580094635, 580399990, 580846310, 581286728, 581527472, 581609070, 581710517, 581827998, 581847906, 581777334, 581689537, 581629038, 581587017, 581480563, 581260681, 580988765, 580759466, 580574691, 580354512, 580066979, 579748034, 579453170, 579193056, 578910053, 578596652, 578301430, 578036904, 577800512, 577561677, 577288568, 577017426, 576794207, 576607823, 576408446, 576177955, 575959146, 575802207, 575690866, 575546920, 575362563, 575202048, 575069845, 574930727, 574778914, 574642897, 574524283]
2639.2E74524283j37150j56820j78754k24948k58207k66254k74480k99513l27826l45230
2659.6E72055101l73363l85583l68952l81530m15921m13775l86954l88622m06384m16875
2680E68117142m36127m48585m47333m46737m52339m76063m73320m26769m10736m34756
2700.4E63664377m73202n04612m88699m57942m67718m72605m34935m17531m42088m68492
2720.8E59036553m76182m47452m02152m07994m49479m64141m47452m25339m25994m26889
2741.2E54663479m04417l90411m06921m37557m39584l86775l36826l71456m47512m82559
2761.6E50559461m82976m83454m94480m97937m89771m80831m68552m93586n61535n86808
2782E45519531n58675n58674n66184n46217n48542n87940o49870o92188o87063o52611
$$ y = [574524283, 574387133, 574230313, 574051559, 573826611, 573568404, 573302150, 573027670, 572728157, 572400331, 572055101, 571681738, 571296155, 570927203, 570545673, 570129752, 569715977, 569329023, 568940401, 568534017, 568117142, 567681015, 567232430, 566785097, 566338360, 565886021, 565409958, 564936638, 564509869, 564099133, 563664377, 563191175, 562686563, 562197864, 561739922, 561272204, 560799599, 560364664, 559947133, 559505045, 559036553, 558560371, 558112919, 557710767, 557302773, 556853294, 556389153, 555941701, 555516362, 555090368, 554663479, 554259062, 553868651, 553461730, 553024173, 552584589, 552197814, 551860988, 551489532, 551042020, 550559461, 550076485, 549593031, 549098551, 548600614, 548110843, 547630012, 547161460, 546667874, 546106339, 545519531, 544960856, 544402182, 543835998, 543289781, 542741239, 542153299, 541503429, 540811241, 540124178, 539471567]
2802.3E39471567o37174o90997p73310q09551p88092p77781q08895q50022r11355r71138
2822.7E31453252r81748r99272j095414j199425j246392j335800j538992j740396j903415
2841.1E19412398k138734k405226k522051k308905j734555j053631n59509l40223l43323
2859.5E06006241m60625o09636p61449q79467r34482q79109o84738n16176m99040n01931
2879.9D99279588m92692n66333o97583q34554r14991r03219q76606q66443q43495q28385
2900.2D91455287q29399q78453j046002j294255j521319j705409j819282j777590j517921
2918.6D79065657j100749p14004m24355j54287R3341K99066M77046N81443O10262O22273
2939D79355693N93185N11438L89278K16484Q672j74462k66493l02314k64109j22279
$$ y = [539471567, 538834393, 538143396, 537370086, 536560535, 535772443, 534994662, 534185767, 533335745, 532424390, 531453252, 530471504, 529472232, 528376818, 527177393, 525931001, 524595201, 523056209, 521315813, 519412398, 517273664, 514868438, 512346387, 510037482, 508302927, 507249296, 506689787, 506349564, 506006241, 505545616, 504935980, 504174531, 503295064, 502360582, 501481473, 500796735, 500280559, 499781519, 499279588, 498786896, 498220563, 497522980, 496688426, 495773435, 494870216, 493993610, 493127167, 492283672, 491455287, 490625888, 489747435, 488701433, 487407178, 485885859, 484180450, 482361168, 480583578, 479065657, 477964908, 477250904, 476826549, 476672262, 476765603, 477064669, 477541715, 478123158, 478733420, 479355693, 479948878, 480460316, 480849594, 481066078, 481074750, 480900288, 480633795, 480331481, 480067372, 479945093]
2959.4D79945093P0304K80559M28856N03122N65917O18308O05733N09262M30345M35829
2979.8D84393328M40985L88503L52175L24338K28882J80841K26378J73956L7789n8978
3000.2D86688197j20014j23293j30802k12431k89500k99394k73198k85238l49641m18663
3020.6D84186023n02824n72503n90593n84542n54085n67049o27577o84321p31945p20352
3041D78050232p04378p26014p20650p06941p41065p75814p32213o82473p21604p85261
3061.4D70753819p71284p01070o71506o96123p12812p19070p23034o93381o55234o71595
3081.8D63738710p25180p26789o76305o68376p04557p17163p09713o98357o67572p01160
3102.2D56743538p93904p88450p19786p17520p44939p39992p45565p84158q23319q53300
$$ y = [479945093, 480015397, 480295956, 480724812, 481227934, 481793851, 482412159, 483017892, 483527154, 483957499, 484393328, 484834313, 485222816, 485574991, 485899329, 486128211, 486309052, 486535430, 486709386, 486747175, 486688197, 486568183, 486444890, 486314088, 486101657, 485812157, 485512763, 485239565, 484954327, 484604686, 484186023, 483683199, 483110696, 482520103, 481935561, 481381476, 480814427, 480186850, 479502529, 478770584, 478050232, 477345854, 476619840, 475899190, 475192249, 474451184, 473675370, 472943157, 472260684, 471539080, 470753819, 469982535, 469281465, 468609959, 467913836, 467201024, 466481954, 465758920, 465065539, 464410305, 463738710, 463013530, 462286741, 461610436, 460942060, 460237503, 459520340, 458810627, 458112270, 457444698, 456743538, 455949634, 455161184, 454441398, 453723878, 452978939, 452238947, 451493382, 450709224, 449885905, 449032605]
3122.6D49032605q83013q85070q69542q63135q41141q51839q86679q95739r18954r30459
3143D40207034r45300r76085r12637q31783r01073j013726j019984r85116r93282j007467
3163.4D30620581j011014j027018j021236r87500r94444j037389j038253j048863j086444
3181.7D21368420j056611j037509j070082j011133r46701j019895j070589j033812
3198D13122088j006306r87768r98884j024157r93520r69440r70959r58026r90689j006096
3218.4D03216243r62287r86278j048148j018405r32038q62718q50737r45568j001864
3236.8C94608200r39489r18984q97050q03352q02695r14097r46999q64386q14408q56579
3257.2C85850161r23663r52184r12249q36850p82698p62343p72715q03560q09729q06779
$$ y = [449032605, 448149592, 447264522, 446394980, 445531845, 444690704, 443838865, 442952186, 442056447, 441137493, 440207034, 439261734, 438285649, 437373012, 436541229, 435640156, 434626430, 433606446, 432621330, 431628048, 430620581, 429609567, 428582549, 427561313, 426573813, 425579369, 424541980, 423503727, 422454864, 421368420, 420311809, 419274300, 418204218, 417193085, 416246384, 415226489, 414155900, 413122088, 412115782, 411128014, 410129130, 409104973, 408111453, 407142013, 406171054, 405213028, 404222339, 403216243, 402253956, 401267678, 400219530, 399201125, 398269087, 397406369, 396555632, 395610064, 394608200, 393668711, 392749727, 391852677, 391049325, 390246630, 389332533, 388385534, 387521148, 386706740, 385850161, 384926498, 383974314, 383062065, 382225215, 381442517, 380680174, 379907459, 379103899, 378294170, 377487391]
3277.6C77487391q29190q22484p94113p80761p35551o53029o29961p16716p90835p79062
3298C69955689p68692p53074o86020o74337p93308r39340r47058q48979q41796r23216
3318.4C61779869r53406r09597q55684q76248r78291j061291j051724r44465q55804
3336.7C53293359r45061j085699j094699j036524r52334q30173q21084r60737r84133
3355.1C44582915q76605q52376q74103q14080o97285o79910p99060r34094r49055q25435
3375.5C36280912p21067p38770p85380p27386o27786n89937n30630n01037o35534o75947
3395.9C29747438m68254l56108n38230p25477o39380m49210l56346l83437n09292n82933
3416.3C24738771m34488k06858j90944k59280j75536p3075p4595o5744l6717j13129
$$ y = [377487391, 376658201, 375835717, 375041604, 374260843, 373525292, 372872263, 372242302, 371525586, 370734751, 369955689, 369186997, 368433923, 367747903, 367073566, 366280258, 365340918, 364393860, 363544881, 362703085, 361779869, 360826463, 359916866, 359061182, 358184934, 357206643, 356145352, 355093628, 354149163, 353293359, 352348298, 351262599, 350167900, 349131376, 348179042, 347348869, 346527785, 345567048, 344582915, 343706310, 342853934, 341979831, 341165751, 340468466, 339788556, 338989496, 338055402, 337106347, 336280912, 335559845, 334821075, 334035695, 333308309, 332680523, 332090586, 331559956, 331058919, 330423385, 329747438, 329279184, 328923076, 328384846, 327659369, 327019989, 326570779, 326214433, 325830996, 325321704, 324738771, 324304283, 324097425, 323906481, 323647201, 323471665, 323398590, 323323995, 323258251, 323221534, 323108405]
3436.6C23108405k53230k33412j16468L3319K75880K08110l5822L6537K02060K78264
3457C23503643L32952L39627L23981M27902N72115M12524J32739J97143L90559M12345
3477.4C27045530M81039N93573N05716M58240N72145N31853M26173N64754P44283O05643
3497.8C32528949M71473P73966Q66860M22060M18306Q53568Q99792O44147N28783N50210
3518.2C38958114O44893R32693J048625Q76516R00716Q63909O35088P74920J051396
3536.6C46686870Q62300N87553Q23081J454830J544267P91460O42687J142681J008242
3554.9C55543971P37101R35644Q32081L23772J138151L076911K413213L57866K70903
3573.3C65629613J064837J350880J354396R95815M65155J376301L277004K242595K06053
$$ y = [323108405, 322855175, 322621763, 322505295, 322538614, 322814494, 323022604, 322986782, 323023319, 323225379, 323503643, 323836595, 324176222, 324500203, 324928105, 325500220, 325912744, 326045483, 326242626, 326633185, 327045530, 327526569, 328120142, 328625858, 329084098, 329656243, 330188096, 330614269, 331179023, 331923306, 332528949, 333000422, 333774388, 334641248, 335063308, 335481614, 336335182, 337234974, 337879121, 338407904, 338958114, 339603007, 340535700, 341584325, 342460841, 343361557, 344225466, 344860554, 345635474, 346686870, 347549170, 348136723, 348959804, 350414634, 351958901, 352750361, 353393048, 354535729, 355543971, 356281072, 357216716, 358048797, 358372569, 359510720, 362587631, 365000844, 365358710, 365629613, 366694450, 368045330, 369399726, 370395541, 370860696, 372236997, 375514001, 377756596, 377962649]
3591.7C77962649Q77470J916349J566827J456231J358866M11541M70638K034336K344400
3610C90399307J588970J126379O02454K067089L423900R85235j455397k73496M952610
3628.4D03417051N530149O00993j66684P38472Q61942R08852J20431q52734J002431
3646.7D12160903N874008N317122n34713q42512K215147J481086n0038p2986p50095
3665.1D24797922n30690K499998K565593R7632L511608L901809p81774j747311j828163
3683.4D32486624j829595J185537M520475K085448j267582j548470q44478M91500K243161
3701.8D37522620J077533j574487j311302J792491L890126P45625k325952j813650
3718.1D38003004k68609N24938O94931K84910j645028k541632j69337L184140L316253
$$ y = [377962649, 378840119, 380756468, 382323295, 383779526, 385138392, 385549933, 386020571, 388054907, 390399307, 391988277, 393114656, 393717110, 395784199, 399208099, 400193334, 398737937, 398464441, 403417051, 408947200, 409548193, 409381509, 410119981, 410981923, 411890775, 412011206, 411158472, 412160903, 418034911, 423352033, 422817320, 421974808, 424189955, 425671041, 425621003, 425548017, 424797922, 424267232, 426767230, 429332823, 429430455, 432942063, 436843872, 436062098, 434314787, 432486624, 430657029, 431842566, 436363041, 438448489, 437180907, 435632437, 434787959, 435279459, 437522620, 438600153, 437025666, 435714364, 437506855, 441396981, 442142606, 439816654, 438003004, 437734395, 438259333, 438954264, 439239174, 437594146, 435052514, 434883177, 438067317, 441383570]
3736.5D41383570j049518m696995j795381M421591J558364j384050L328800L006846
3752.8D44773227j992047k185315N82993O02871j279503q40276K53290J235962J313299
3771.1D42464501q57234j922548m63426J431286O61433o77824j01805j2517n69791
3789.5D39952075r89079j081675k18362m06921K02149K781868M48346q56906J195967
3807.8D41027462j092910l547430j576931J692117N94943Q21472K744257o45161k158463
3826.2D37859356j275658r68009m78954n67585P27356K734124J189977n92857r63599
3844.6D37664151k504706m237920k679050N308091P901997j422048m827946k587855
3860.9D32614714K93732Q23497r27776L21508K040952K81006j179576k160698q09252
$$ y = [441383570, 440334052, 435637057, 433841676, 438263267, 439821631, 438437581, 441766381, 444773227, 442781180, 440595865, 441178858, 441781729, 440502226, 439661950, 439915240, 441151202, 442464501, 441607267, 439684719, 439221293, 440652579, 441314012, 440636188, 440534383, 440521866, 439952075, 438962996, 437881321, 437662959, 437256038, 437458187, 440240055, 440688401, 439831495, 441027462, 439934552, 436387122, 434810191, 436502308, 437097251, 437918723, 440662980, 440017819, 437859356, 436583698, 435615689, 435136735, 434569150, 435296506, 438030630, 439220607, 438627750, 437664151, 435159445, 430921525, 428242475, 433550566, 441452563, 440030515, 435202569, 432614714, 432908446, 433731943, 432804167, 433125675, 435166627, 435447633, 434268057, 432107359, 431298107]
3879.2D31298107Q74519p4774P66695P7039j393974P25061L33845k585232k068043
3897.6D27953243N55218J969665K219111P41004j602798j905114j194030r33349O2674
3915.9D27865624J071096K69622o80984j75029p4625r28133l97683Q46029K94953r08017
3936.3D27182853j080066m74512L61740J25498m80622L4600J73062m64439n87761k88576
3956.7D24501777j58847p8082n9992l37541m30673k02298j15812j56135p7396q8275
3977.1D22796726k30938j79201j03712k89262m07129k18839p0572j13248j75000k23159
3997.5D20785666
$$ y = [431298107, 432172626, 432097852, 432864547, 432941586, 431547612, 432272673, 432606518, 430021286, 427953243, 428508461, 430478126, 432697237, 433438241, 431835443, 429930329, 428736299, 427802950, 427865624, 428936720, 429206342, 428525358, 428350329, 428275704, 427347571, 426949888, 427795917, 428090870, 427182853, 426102787, 425628275, 425990015, 426115513, 425634891, 425669491, 425842553, 425378114, 424790353, 424501777, 424342930, 424264848, 424204856, 423867315, 423436642, 423234344, 423118532, 422962397, 422885001, 422796726, 422565788, 422386587, 422282875, 421993613, 421586484, 421367645, 421297073, 421183825, 421008825, 420785666]
##END=$$ End of the data block
