##TITLE=$$ Begin of the data block
##JCAMP-DX=5.00 $$ ACD/SpecManager v 10.08
##SPECTROMETER/DATA SYSTEM=Alpha
##DATE=13 Jun 2014 08:26:00
##DATA TYPE=INFRARED SPECTRUM
##DATA CLASS=XYDATA
##ORIGIN=
##OWNER=
##NPOINTS=1765
##FIRSTX=399.75695801
##LASTX=3997.56933594
##MAXX=3997.56933594
##MINX=399.75695801
##MAXY=0.69721681
##MINY=0.24582401
##XFACTOR=1.0000000000
##YFACTOR=1.000000000000000e-9
##FIRSTY=0.55757725
##DELTAX=2.03957629
##XUNITS=1/CM
##YUNITS=ARBITRARY UNITS
##XYDATA=(X++(Y..Y))
399.8E57577252J0690987J0202885O953776K400696N32270J702845K380252J246035
416.1E93686998O37889J684189K034664J108706j19508k61783J077950J742244O52611
434.4F02243960k09749N99682J644254J093567o07729j369298n59568K20001o78599
452.8F02376521j831591q87394J301169J947164J012087L62635J093805K303541K296984
471.1F09974921J241505R38833K027750L089428K705276J615345J622617K523542K676070
489.5F28415287J923024J263917J317084J878023J966893J009107M4107L63112J135707
507.9F39316261Q53777r9421k63989O29843J334667J017093N14567P10070J430810
526.2F45443678J794159J344920Q24034J001298J579344J817942J543641J188934J223207
$$ y = [557577252, 568268239, 578471124, 585424900, 587825596, 588357866, 590060711, 592440963, 593686998, 594324887, 596009076, 598043740, 599152446, 599032938, 598771155, 599849105, 601591349, 602243960, 602034211, 602633893, 604278147, 605371714, 604763985, 603394687, 602835119, 603055120, 602376521, 600544930, 599657536, 600958705, 602905869, 603917956, 604280591, 605374396, 607677937, 609974921, 611216426, 612155259, 614183009, 617272437, 619977713, 621593058, 623215675, 625739217, 628415287, 630338311, 631602228, 632919312, 634797335, 636764228, 637773335, 637817442, 638180554, 639316261, 640170038, 640070617, 639806628, 640436471, 641771138, 642788231, 643302798, 644012868, 645443678, 647237837, 648582757, 649406791, 650408089, 651987433, 653805375, 655349016, 656537950, 657761157]
544.6F57761157J617372J633823R79721M96864N78583Q99970J059056Q70466P62701
562.9F66659713R76324J243710J295507J006544O25312N84722Q39889Q87215O44803
581.3F74763739M95195O72937J096249J257121Q24690L45469L26335M51505L27289
599.6F80560529j9014l76701n24044l96967l32296n36322m77374R0837M21226K60771
620F78670645K00927L53575N36084O42538N20349L71575M93288P09653P45237N24103
640.4F83767974K16008K22087N71250O02246m5121o26087o65784o65665r63032j355886
660.8F81057990j369238l0518K229989O01887l024339k139330o97255l62933n96583
679.2F75669670r49681j244068j499355j912236k610266l195763l246426l014505k853334
$$ y = [657761157, 659378529, 661012352, 661992073, 662488937, 663067520, 663967490, 665026546, 665897012, 666659713, 667636037, 668879747, 670175254, 671181798, 671807110, 672391832, 673231721, 674118936, 674763739, 675258934, 675931871, 677028120, 678285241, 679109931, 679455400, 679781735, 680233240, 680560529, 680541515, 680164814, 679640770, 679243803, 678911507, 678375185, 677897811, 677988648, 678409874, 678670645, 678871572, 679225147, 679761231, 680403769, 680924118, 681295693, 681788981, 682498634, 683243871, 683767974, 683983982, 684206069, 684777319, 685379565, 685334444, 684708357, 684042573, 683376908, 682413876, 681057990, 679688752, 679658234, 681888223, 682490110, 679465771, 677326441, 676629186, 676266253, 675669670, 674719989, 673475921, 671976566, 670064330, 667454064, 664258301, 661011875, 657997370, 655144036]
697.5F55144036j034856J865149J017689l604114q589148j2926281j1611879j008928
713.8F19251668Q459867Q699834O057799N412459N948961O727218O962121O231248
730.2F73751175M790068L230989J935065J041651M90248J01745k31147m14014m20391
748.5F84275389l40760l71397o57618r12487r05216q20160r47952j219690j359343
766.9F76740766j335621j305044j441777j601517j213133j03593R82702J266598Q72970
785.2F72862351M54664K49028j17480o63996o80149J99795J525462K468884K704739
803.6F79003298K667010K703309K734900K536118J995265J480878J350343J325011
819.9F95796132J019240M01437k45691p32719j168848j909673l036201m044473m678368
$$ y = [655144036, 654109180, 655974329, 656992018, 653387904, 644798756, 631872475, 620260596, 619251668, 627711535, 636411369, 642469168, 647881627, 653830588, 660557806, 667519927, 673751175, 678541243, 681772232, 683707297, 684748948, 685239196, 685340941, 685109794, 684695780, 684275389, 683934629, 683563232, 682905614, 681993127, 681087911, 680267751, 679319799, 678100109, 676740766, 675405145, 674100101, 672658324, 671056807, 669843674, 669740081, 670722783, 671989381, 672862351, 673317015, 673566043, 673448563, 672784567, 672104418, 672304213, 673829675, 676298559, 679003298, 681670308, 684373617, 687108517, 689644635, 691639900, 693120778, 694471121, 695796132, 696815372, 697216809, 696971118, 696238399, 695069551, 693159878, 690123677, 686079204, 681400836]
838.3F81400836n530358o393611o607771p273674q288384j0001361j4176548j6684651
854.6F06444478j3030410o668687k440393j596570m797101j3482511k5565028l1713843
870.9E07149935k5065482j0234743O825357K3729444L4777582L5873353L1029344K4957895
887.2F29042685J8397331J1992276P131636M343331L175259K668678J949609J023471
903.5F79724276N43594P17581R18984M46916m12882p86244o09994o39856j135826j610875
923.9F77155674j607061j270473j141369j341105j412034j051068o28293o54697j055718
942.3F66993856j291930j101554q57830j048863j553297j840889j790106j826466k208113
960.6F53474808k620280k675772k444327k409756k808034l260255l375411l370047
$$ y = [681400836, 675870478, 669476867, 662869096, 655595422, 647307038, 637305677, 623129129, 606444478, 593414068, 586745381, 584304988, 582708418, 577911317, 564428806, 538863778, 507149935, 482084453, 471849710, 478675067, 502404511, 537182093, 573055446, 604084790, 629042685, 647440016, 659432292, 666563928, 670907259, 674082518, 676751196, 678700805, 679724276, 680267870, 680985451, 681904435, 682351351, 681938469, 681152225, 680542231, 679902375, 678766549, 677155674, 675548613, 674278140, 673136771, 671795666, 670383632, 669332564, 668704271, 668049574, 666993856, 665701926, 664600372, 663742542, 662693679, 661140382, 659299493, 657509387, 655682921, 653474808, 650854528, 648178756, 645734429, 643324673, 640516639, 637256384, 633880973, 630510926]
977F30510926l676474m251003m580736m409731m082381l973544m046202l911793l428638
995.3E94150424l031671l072202l288985l315031l174126l118217l284335l394723
1011.6E68471134l167272k822578k772331k968192k988994k678812k312064k157807
1027.9E46603084k122522j895487j277387m66109P8500J68144K5809k02417n96106
1046.3E40315509j123548j509428j512348j270533j064420q35836l57508J81436L50058
1064.7E33173382j12056j049996j926601k340376k381623k521872l297329l582657
1081E15960872q16941L155053M093587K976239K428651K363681K069533J458228Q91745
1099.3E34580648P08580Q27312Q65102O83606N48899P14660J125395J441836J384438
$$ y = [630510926, 626834452, 622583449, 618002713, 613592982, 609510601, 605537057, 601490855, 597579062, 594150424, 591118753, 588046551, 584757566, 581442535, 578268409, 575150192, 571865857, 568471134, 565303862, 562481284, 559708953, 556740761, 553751767, 551072955, 548760891, 546603084, 544480562, 542585075, 541307688, 540841579, 540920079, 541088223, 541114032, 540911615, 540315509, 539191961, 537682533, 536170185, 534899652, 533835232, 532999396, 532641888, 532823324, 533173382, 533061326, 532011330, 530084729, 527744353, 525362730, 522840858, 519543529, 515960872, 515143931, 518298984, 522392571, 525368810, 527797461, 530161142, 532230675, 533688903, 534580648, 535289228, 536116540, 536981642, 537665248, 538214147, 538928807, 540054202, 541496038, 542880476]
1117.7E42880476J086354Q93116R13977R75013R66907J008868J131773J172066R84668
1136E52013218N59628R0599j96516l26574m78029o63340p41005o39618m29511l77059
1156.4E48811793o44982q28444m26412M06861J137853J524746J719892J925707K085805
1174.8E55712819K015889J771092J591802J514792J329899R44853M91977J50561k0266
1193.1E65503418j79052m56929p24733p74801o38962n08964m85241n30541n35727n12957
1213.5E60155511o26266q93772j099169j133800j130461j267314j467586j541495j465559
1231.9E49530089j315117j217723j247704j298308j213014j096726j106441j198590
1248.2E39836466j200497j082897j008749j075685j199484j224875j167655j090527
$$ y = [542880476, 543966830, 544859946, 545773923, 546748936, 547715843, 548724711, 549856484, 551028550, 552013218, 552572846, 552663445, 552466929, 552140355, 551662326, 550998986, 550257981, 549618363, 549188852, 548811793, 548166811, 547338367, 546911955, 547318816, 548456669, 549981415, 551701307, 553627014, 555712819, 557728708, 559499800, 561091602, 562606394, 563936293, 564881146, 565373123, 565523684, 565503418, 565324366, 564867437, 564142704, 563367903, 562728941, 562219977, 561734736, 561204195, 560668468, 560155511, 559529245, 558635473, 557536304, 556402504, 555272043, 554004729, 552537143, 550995648, 549530089, 548214972, 546997249, 545749545, 544451237, 543238223, 542141497, 541035056, 539836466, 538635969, 537553072, 536544323, 535468638, 534269154, 533044279, 531876624, 530786097]
1264.5E30786097j064241j096666j121044j110136j157165j289487j393437j387298
1280.8E21166623j255572j166046j218378j379133j512825j599550j704991j849294
1297.2E09480834j999617k067864k115368k220929k381772k450943k448439k462686
1313.5D91333216k446621k337903k223104k164424k173722k327293k542674k750010
1329.8D72367465k837300k825528k821624k923251l010004k917678k830982k905547
1346.1D49295551l083915l274083l501266l686250l833442l885806l945679m159391
1362.4D19925719m292100m273564m378527m413992m383207m624694m734189m783630
1378.7C84041816n010128n136609n017370n088866n355954n330592n665124o437838
$$ y = [530786097, 529721856, 528625190, 527504146, 526394010, 525236845, 523947358, 522553921, 521166623, 519911051, 518745005, 517526627, 516147494, 514634669, 513035119, 511330128, 509480834, 507481217, 505413353, 503297985, 501077056, 498695284, 496244341, 493795902, 491333216, 488886595, 486548692, 484325588, 482161164, 479987442, 477660149, 475117475, 472367465, 469530165, 466704637, 463883013, 460959762, 457949758, 455032080, 452201098, 449295551, 446211636, 442937553, 439436287, 435750037, 431916595, 428030789, 424085110, 419925719, 415633619, 411360055, 406981528, 402567536, 398184329, 393559635, 388825446, 384041816, 379031688, 373895079, 368877709, 363788843, 358432889, 353102297, 347437173, 340999335]
1395.1C40999335o784439p019430p095904p048636p516772p522195p118673o905317
1411.4B83987969o506413n809397n281090m815907l417015k027213j103878l36647
1427.7B54690409K78443N48690N95928P67231O55412M5866l78698o57380q38160q96871
1448.1B54810870r06945q24809n95420K4438M80860K4706m18007q73357j552254j825094
1468.5B48344988j559168r24156l7655O96838J286477J888320K443895K771496L294409
1486.8B58205444M218787M632711L969073M097760N362779N561650M661858L965854
1503.2B94675916N012483P596046O248474M513651M620105N163044N646795N660474
1519.5C39136988O304324N997866N159050N326778M830539M930139N821794M825115
$$ y = [340999335, 334214896, 327195466, 320099562, 313050926, 305534154, 298011959, 290893286, 283987969, 277481556, 271672159, 266391069, 261575162, 258158147, 256130934, 255027056, 254690409, 254968852, 255517542, 256113470, 256880701, 257536113, 257581979, 257203281, 256545901, 255707741, 254810870, 253903925, 253079116, 252483696, 252508134, 252988994, 253013700, 252595693, 251722336, 250170082, 248344988, 246785820, 245861664, 245824009, 246520847, 247807324, 249695644, 252139539, 254911035, 258205444, 262424231, 267056942, 271026015, 275123775, 280486554, 286048204, 290710062, 294675916, 299688399, 307284445, 313532919, 318046570, 322666675, 327829719, 333476514, 339136988, 345441312, 351439178, 356598228, 361925006, 366755545, 371685684, 377507478, 382332593]
1535.8C82332593M244119O701350P158459N087971M449845M279345M579782M583896
1552.1D23417360M315614M107803N888462O512464K924561K189606K719582L141999
1568.4D55217451L313511K245963K041906K818614J939744J096368J122206J046390
1584.7D70842153Q20100O43790M09961J99824J02014l6896j63525k37554l33935m64738
1605.1D71781194m65482m94421p12216q94606o29812m07636q26836q40098n20617n37902
1625.5D65451568n44905m58628m95702K0653J018017P46668J27047L01093P56144J716107
1645.9D68638062J811564O31869J685083L497035J546740Q26329J677185K626390K606779
1664.3D85547036J971781K660215L418833K591431K744824L182560K400041K051592
$$ y = [382332593, 386576712, 393278062, 400436521, 405524492, 409974337, 414253682, 418833464, 423417360, 427732974, 431840777, 437729239, 444241703, 447166264, 449355870, 452075452, 455217451, 458530962, 460776925, 462818831, 465637445, 467577189, 468673557, 469795763, 470842153, 471662253, 472306043, 472716004, 472915828, 473017842, 472980946, 472817421, 472579867, 472245932, 471781194, 471315712, 470821291, 470109075, 469214469, 468584657, 468177021, 467350185, 466510087, 465989470, 465451568, 464906663, 464448035, 463952333, 463972986, 464991003, 465737671, 465864718, 466165811, 466921955, 468638062, 470449626, 471081495, 472766578, 476263613, 477810353, 478636682, 480313867, 482940257, 485547036, 487518817, 490179032, 493597865, 496189296, 498934120, 502116680, 504516721, 506568313]
1680.6E06568313L093660M768967L472626K330959K649188K531529L372788M144967
1696.9E32932997M122495M673899L149867K572953L074170K452492J948178J938164
1713.2E56865215K452433L338695K491057J074135J148701J544893J503586J377941
1729.5E71796656J419484K458811K264440R93312J432478J904190J712858J817405
1745.9E85799634K163351K632082K425253J646221J738667J919329J675189J785993
1762.2F01785719J355052R93848J206219J345814J433789N47708o14048q37743p16746
1780.5F06499612p79569q27908q87096q80957l75569Q8811k89678m27127K35557J048148
1800.9F03404224J331150J312972J486718J733661J802266J618504J576126J724302
$$ y = [506568313, 509661973, 514430940, 517903566, 520234525, 522883713, 525415242, 528788030, 532932997, 537055492, 541729391, 544879258, 547452211, 550526381, 552978873, 554927051, 556865215, 559317648, 562656343, 565147400, 566221535, 567370236, 568915129, 570418715, 571796656, 573216140, 575674951, 577939391, 578932703, 580365181, 582269371, 583982229, 585799634, 587962985, 590595067, 593020320, 594666541, 596405208, 598324537, 599999726, 601785719, 603140771, 604134619, 605340838, 606686652, 608120441, 608668149, 608054101, 607216358, 606499612, 605720043, 604892135, 604005039, 603124082, 602748513, 602837324, 602547646, 602120519, 602356076, 603404224, 604735374, 606048346, 607535064, 609268725, 611070991, 612689495, 614265621, 615989923]
1817.2F15989923J603723J277983J308918J467347J239360J254380J100301O26028
1833.6F25867963O95526Q27432M83453L74139J022219J113654M10854J71543K04026
1851.9F31170809K87116M08232L89755K36451R6024O4909K65181O75082N68390Q0049
1872.3F34241998J30356L73721L47078K31981K20954K77937L05891M33743M08113J74403
1892.7F37146175K80380M32432L04162K31982K76923L43382M16458M37975L25501J57356
1913.1F40352726J92404M83930M54426J44183K23518K95698J40965O7354R7870J58906
1933.5F42611980J61946R4414N2929K11537K79784Q0943l1292j7524L3855J09256J22606
1955.9F43710434N3287p033l9459K802J32561J38044j0669k3127P4327O7294q405k6643
$$ y = [615989923, 617593646, 618871629, 620180547, 621647894, 622887254, 624141634, 625241935, 625867963, 626563489, 627390921, 627874374, 628248513, 629270732, 630384386, 630795240, 630966783, 631170809, 631457925, 631866157, 632255912, 632492363, 632588387, 632653296, 632918477, 633593559, 634161949, 634241998, 634372354, 634746075, 635093153, 635325134, 635546088, 635824025, 636129916, 636563659, 636971772, 637146175, 637426555, 637858987, 638163149, 638395131, 638672054, 639015436, 639431894, 639869869, 640195370, 640352726, 640545130, 641029060, 641483486, 641627669, 641851187, 642146885, 642287850, 642355204, 642453074, 642611980, 642773926, 642868340, 642921269, 643132806, 643412590, 643493533, 643462241, 643444717, 643478572, 643587828, 643710434, 643763721, 643756688, 643717229, 643720031, 643852592, 643990636, 643979967, 643956840, 644031167, 644098461, 644090056, 644063413]
1980.4F44063413L4273M1544j7822o9916n245R8884P272r7990p3731k6763J908J5616
2004.9F43971443J3650k027j2040j1325J6689N8353J6690m6313l8386m6074n9903n0306
2029.4F43810451m6432l0577j5736k6226k7120l934J8895L6955J788n0128m1842J669
2053.8F43627763K8729J6332m6194r7155k1041O5446j967j08838j05321l5942j0490
2076.3F43311322o3718j14619p4268J848k384r4056j31488p0930j1444k9027j34766
2098.7F42586470k19524j65582n6207n1856j47581k02120j21057k1219m5717j60992
2119.1F41394615k34663j68264o5029j01328k20835k29359j04248j1862q8870k22325
2139.5F39947832k00630n8174j371q6963j74582j42276j8895M9949j3769j01983p7665
$$ y = [644063413, 644097686, 644139230, 644121408, 644051492, 644046247, 644145131, 644152403, 644054413, 643980682, 643953919, 643955827, 643971443, 643985093, 643983066, 643971026, 643959701, 643976390, 644034743, 644051433, 644005120, 643966734, 643920660, 643860757, 643810451, 643764019, 643733442, 643717706, 643691480, 643664360, 643660426, 643679321, 643716276, 643718064, 643667936, 643626094, 643627763, 643656492, 643672824, 643626630, 643529475, 643508434, 643573880, 643571913, 643463075, 643357754, 643321812, 643311322, 643247604, 643132985, 643058717, 643060565, 643058181, 642964125, 642832637, 642761707, 642750263, 642721236, 642586470, 642366946, 642201364, 642145157, 642093301, 641945720, 641743600, 641622543, 641601324, 641555607, 641394615, 641159952, 640991688, 640926659, 640825331, 640604496, 640375137, 640270889, 640259027, 640170157, 639947832, 639747202, 639689028, 639687657, 639600694, 639426112, 639283836, 639264941, 639314890, 639301121, 639199138, 639121473]
2161.9F39121473J1802K5153n9188j08301k1935P2897M5180m2498q0705m6193O973
2184.4F38924658l993p7427j15215p8559k2531j6808p6771j22607q3089j5795k0802
2206.8F38291061j01030j56760j25289p9453j08838j61529j58071j30773j11580j07586
2227.2F37050152j22845j17779p9930n2571o3122r4831j15394j08063o2883j7941m6492
2249.6F36168301q1122n6326n3108p7665p1406l5882l0577q4937j10030p9513p5578
2272.1F35412157j27137j89006k14875k25365k00093p6890O2644J23501J65105K12550
2292.5F34942591K00987J81139K30252K79606K98202M00603O15477P98941Q11279O36220
2312.9F39395297M88817P31290J269102J544654J278341P87675O46949Q88169Q25763
$$ y = [639121473, 639133275, 639158428, 639099240, 638990939, 638969004, 639041901, 639087081, 639044583, 638963878, 638917685, 638924658, 638920665, 638843238, 638728023, 638649464, 638626933, 638610125, 638533354, 638410747, 638327658, 638311863, 638291061, 638190031, 638033271, 637907982, 637828529, 637719691, 637558162, 637400091, 637269318, 637157738, 637050152, 636927307, 636809528, 636729598, 636677027, 636613905, 636519074, 636403680, 636295617, 636232734, 636214793, 636168301, 636087179, 636030853, 635977745, 635900080, 635828674, 635792792, 635762215, 635677278, 635567248, 635487735, 635412157, 635285020, 635096014, 634881139, 634655774, 634455681, 634378791, 634441435, 634564936, 634730041, 634942591, 635143578, 635324717, 635554969, 635834575, 636132777, 636533380, 637148857, 637947798, 638759077, 639395297, 639884114, 640615404, 641884506, 643429160, 644707501, 645495176, 646142125, 647030294, 647856057]
2331.2F47856057K95102J09732L35694M77969M49062m590j749336l490925k374471
2349.6F41904294R80437L684581L846645K796173J498818J55151j022696j944721k557635
2367.9F49341047k939940l138899l142119l037274k926767k752661k450526k007127
2384.2F26945734j409709q00312l96669k50399k67565l02375k82049k45988k56539
2402.6F22734129l00645l02315k45631j96814k39969l37422l63230k97249k44081k92599
2423F19914174l83258l77774k94149k74241l32236l90530m04298l61443l23593l74377
2443.4F16398275m64678m66883l95060l82781m85539o02186o13809n61416n38170n91218
2463.8F11296535p32840q33869q07285q12530r91404j224161j297176j220881j178802
$$ y = [647856057, 648151159, 648260891, 648596585, 649074554, 649523616, 649519026, 647769690, 644278765, 641904294, 642884731, 646569312, 650415957, 653212130, 654710948, 654866099, 653843403, 651898682, 649341047, 646401107, 643262208, 640120089, 637082815, 634156048, 631403387, 628952861, 626945734, 625536025, 624735713, 624339044, 624088645, 623821080, 623518705, 623236656, 622990668, 622734129, 622433484, 622131169, 621885538, 621688724, 621448755, 621111333, 620748103, 620450854, 620206773, 619914174, 619530916, 619153142, 618858993, 618584752, 618252516, 617861986, 617457688, 617096245, 616772652, 616398275, 615933597, 615466714, 615071654, 614688873, 614203334, 613601148, 612987339, 612425923, 611887753, 611296535, 610563695, 609729826, 608922541, 608110011, 607118607, 605894446, 604597270, 603376389, 602197587]
2482.1F02197587j277506j427650j470805j395642j312912j320004j355827j272559
2498.5E91364682j079858r44137r45747r81450r48787q94189r48250j077533j087010
2516.8E82457721q80301n46396k66611j28985j7762K01941M47511N54204N23329M68314
2537.2E82812965M25041L43561K28643J63257J95265L09348M36366M20034K22742Q3328
2557.6E85640550J31130J56522K7716j03533j03653k8014j9312j21057k27809k61307
2578E85091233k22325j73628k11418k95639l05712k45631k24173k80321l23653l11911
2598.4E82496822k83897k53737k45988k50519k31862k23398k22683k03252j92880j94788
2618.8E80193818j72437j17600j15037j68561j67847j17183r3460j30177j69813j38819
$$ y = [602197587, 600920081, 599492431, 598021626, 596625984, 595313072, 593993068, 592637241, 591364682, 590284824, 589340687, 588394940, 587413490, 586464703, 585570514, 584622264, 583544731, 582457721, 581577420, 581031024, 580764413, 580635428, 580617666, 580819607, 581267118, 581821322, 582344651, 582812965, 583238006, 583581567, 583810210, 583973467, 584168732, 584478080, 584914446, 585334480, 585557222, 585640550, 585771680, 585928202, 585955918, 585852385, 585748732, 585720718, 585701406, 585580349, 585352540, 585091233, 584868908, 584695280, 584483862, 584188223, 583882511, 583636880, 583412707, 583132386, 582808733, 582496822, 582212925, 581959188, 581713200, 581462681, 581230819, 581007421, 580784738, 580581486, 580388606, 580193818, 580021381, 579903781, 579788744, 579620183, 579452336, 579335153, 579241693, 579111516, 578941703, 578802884]
2639.2E78802884r9481j34110j96755k36869k64644k77996k82050k93493k95520l02314
2659.6E76419652l52920l86357l73244l72589m03642m25458l96908l85046m08530m16577
2680E72498381m35054m47810m20093l94583m17531m74751m99963m67658m22836m03941
2700.4E68114161m37557m88937m96268m75288m69088m63844m26352l96490m19497m67897
2720.8E63572943m85480m63426m30047m09842m23431m40359m18842l94464m11749m32848
2741.2E59262455m19796l90828l81946m01080m13537l98636l80814m09067m74631n01871
2761.6E55090249m62354m25696m53591m77851m64141m87328n26368n26548n49257n81085
2782E50136030n30541n00798n60523n88536n79893o06418o35862o41823o68526o93321
$$ y = [578802884, 578703403, 578569293, 578372538, 578135669, 577871025, 577593029, 577310979, 577017486, 576721966, 576419652, 576066732, 575680375, 575307131, 574934542, 574530900, 574105442, 573708534, 573323488, 572914958, 572498381, 572063327, 571615517, 571195424, 570800841, 570383310, 569908559, 569408596, 568940938, 568518102, 568114161, 567676604, 567187667, 566691399, 566216111, 565747023, 565283179, 564856827, 564460337, 564040840, 563572943, 563087463, 562624037, 562193990, 561784148, 561360717, 560920358, 560501516, 560107052, 559695303, 559262455, 558842659, 558451831, 558069885, 557668805, 557255268, 556856632, 556475818, 556066751, 555592120, 555090249, 554627895, 554202199, 553748608, 553270757, 552806616, 552319288, 551792920, 551266372, 550717115, 550136030, 549605489, 549104691, 548544168, 547955632, 547375739, 546769321, 546133459, 545491636, 544823110, 544129789]
2802.3E44129789o79255o91414p56859p99835p87318p67648p96080q76426r36568r64105
2822.7E36074281r77516j004279j106560j200736j239896j336038j521528j734614
2839.1E25953114j945436k174079k414048k523065k293288j704514j022876n64337
2855.4E11311471l95953l82364m40419n74588p59602r11653r67145r07898p10845n04673
2875.8E04756331m64141m83572m94779n66959o78360q17240r20713r06884q54612q51065
2896.2D97718006q50975q36134q51423q99732j037627j309097j569688j721442j791298
2914.5D86850590j746297j532078j147479p26968l91662j44005L3408K56598N30333
2932.9D81982440O73204O60032O19710N88804N08160L70115K17020M8399j34885k66403
$$ y = [544129789, 543450534, 542759120, 542002261, 541202426, 540415108, 539647460, 538851380, 537974954, 537038386, 536074281, 535096765, 534092486, 532985926, 531785190, 530545294, 529209256, 527687728, 525953114, 524007678, 521833599, 519419551, 516896486, 514603198, 512898684, 511875808, 511311471, 510915518, 510533154, 510092735, 509518147, 508758545, 507846892, 506879747, 505971849, 505261004, 504756331, 504292190, 503808618, 503313839, 502746880, 502068520, 501251280, 500330567, 499423683, 498569071, 497718006, 496867031, 496030897, 495179474, 494279742, 493242115, 491933018, 490363330, 488641888, 486850590, 485104293, 483572215, 482424736, 481697768, 481306106, 481162101, 481195509, 481452107, 481982440, 482655644, 483315676, 483935386, 484524190, 485032350, 485402465, 485619485, 485667884, 485532999, 485266596]
2953.3D85266596k98738k43664j26809N7042K71499M30524N18948N64039N99712O09070
2973.7D87648219N44339M51356M20154M37021M23640L72827K99454K20865J90615J97292
2994.1D91205782J59114Q7381J728r6500j26809j51872k55406k90126k28345k42233
3014.5D90062714l23028l63797l98546m81427n52058n75394n89668n95153o18696o38515
3034.9D84926432o46323o91890p23899p27594p41541p49469p37250p40498p48605p10040
3055.3D77709323p01517p89761q40247p59900o72221o60449o75231p02352p33107p28696
3075.6D70445842o83070o32167o59525p51287p87526p42346o91474p17729p37846o78420
3096D63364452o57439o74576p00771p70778q04067p67260p54744p70360p43628p46876
$$ y = [485266596, 484967858, 484724194, 484597385, 484654427, 484925926, 485356450, 485875398, 486439437, 487039149, 487648219, 488192558, 488643914, 489064068, 489501089, 489924729, 490297556, 490597010, 490817875, 491008490, 491205782, 491364896, 491452277, 491454005, 491357505, 491230696, 491078824, 490823418, 490533292, 490304947, 490062714, 489739686, 489375889, 488977343, 488495916, 487943858, 487368464, 486778796, 486183643, 485564947, 484926432, 484280109, 483588219, 482864320, 482136726, 481395185, 480645716, 479908466, 479167968, 478419363, 477709323, 477007806, 476218045, 475377798, 474617898, 473945677, 473285228, 472609997, 471907645, 471174538, 470445842, 469762772, 469130605, 468471080, 467719793, 466932267, 466189921, 465498447, 464780718, 464042872, 463364452, 462707013, 462032437, 461331666, 460560888, 459756821, 458989561, 458234817, 457464457, 456720829, 455973953]
3116.4D55973953q22872q48710q36313q78245r00388q84801q88526q73775q74459q88676
3136.8D47277188q80956r28700r93371j002819r65506q95947q59260r25303j027792
3155.2D38797534j038671j020879j046747j047462j038372j051516j034051j002759
3171.5D30517077j035809j079440j032889r97305j048714j077652j092285j113772
3187.8D22039211j047164r86338j047403j089781j048804j016020j022458j058072
3204.1D13723171j060307j030356j038045j020133r77487j012057j050293j013756
3220.5D05520737r90927j012892r92059r27687q84414q92847r75818j038879j008809
3238.8C96796405r48548q64953q05735q65490r70751r73195q80777q38817q65250r03339
$$ y = [455973953, 455151081, 454302371, 453466058, 452587813, 451687425, 450802624, 449914098, 449040323, 448165864, 447277188, 446396232, 445467532, 444474161, 443471342, 442505836, 441609889, 440750629, 439825326, 438797534, 437758863, 436737984, 435691237, 434643775, 433605403, 432553887, 431519836, 430517077, 429481268, 428401828, 427368939, 426371634, 425322920, 424245268, 423152983, 422039211, 420992047, 420005709, 418958306, 417868525, 416819721, 415803701, 414781243, 413723171, 412662864, 411632508, 410594463, 409574330, 408596843, 407584786, 406534493, 405520737, 404529810, 403516918, 402524859, 401597172, 400712758, 399819911, 398844093, 397805214, 396796405, 395847857, 394982904, 394177169, 393311679, 392340928, 391367733, 390486956, 389648139, 388782889, 387879550]
3259.2C87879550r62913r55343q60214p76708p37906p76797q38280q32558q14557q43405
3279.6C79480869q59708q27104q26627q24630p03395o08980p02769q26597q48144q32111
3300C71620804p66158o66738p07507q61197r60082r64582r11057q84026r03994r30429
3320.4C63065034r25720r01699r61721j082986j134545j080513r59426q82447r68486
3338.8C54167491j106143j108557j051038j007200r11027q96394j014531j022070r19432
3357.1C45131099q80718r10014r01252p71552o83427q03679r73314r89080r13292q52615
3377.5C36452156q00997p73072p52151p07209o29395m94749m37230o28858p66039n72682
3397.9C29889774m03583n48839p47651o79434m89175m20004m48137n21452n37187l69310
$$ y = [387879550, 386916637, 385961294, 385101080, 384324372, 383586466, 382809669, 381971389, 381138831, 380324274, 379480869, 378621161, 377794057, 376967430, 376142800, 375439405, 374830425, 374127656, 373301059, 372452915, 371620804, 370854646, 370187908, 369480401, 368619204, 367659122, 366694540, 365783483, 364899457, 363995463, 363065034, 362139314, 361237615, 360275894, 359192908, 358058363, 356977850, 356018424, 355135977, 354167491, 353061348, 351952791, 350901753, 349894553, 348983526, 348087132, 347072601, 346050531, 345131099, 344250381, 343340367, 342439115, 341667563, 340984136, 340180457, 339207143, 338218063, 337304771, 336452156, 335651159, 334878087, 334125936, 333418727, 332789332, 332294583, 331857353, 331228495, 330462456, 329889774, 329486191, 328937352, 328189701, 327510267, 327021092, 326601088, 326152951, 325631499, 325094312, 324725002]
3418.3C24725002j96546k56092l60459k43485n4806j8388l3230j013p9662l00139l07381
3440.7C22873801j09047O1542K68102K29507J5587N6267J84417K63095L38912L50624
3461.1C24532807L40819M27932N32806M04477J84357K36571M10497M67032N69016O63221
3481.5C28769535N25743M51803N68956N70714N02170N77032P09593O35118N36471Q10683
3501.9C34657818Q73208M35650M96030R40860R39846P16954O19501N65976O32614R47296
3522.3C41825753J071901R17702R63450R40442P18325Q36015J096040R25332O55145
3540.7C49950105Q71479J498849J589089Q37714P14600J233399J051873P34150R69559
3559C59450817R21846M28974J248777L160477K456158M22865L57986J168907J464962
$$ y = [324725002, 324528456, 324272364, 323911905, 323668420, 323613614, 323595226, 323561996, 323560983, 323481321, 323181182, 322873801, 322764754, 322826296, 323094398, 323323905, 323339492, 323395759, 323580176, 323843271, 324182183, 324532807, 324873626, 325301558, 325834364, 326238841, 326423198, 326659769, 327070266, 327537298, 328106314, 328769535, 329295278, 329747081, 330316037, 330886751, 331388921, 331965953, 332675546, 333310664, 333847135, 334657818, 335531026, 335966676, 336462706, 337403566, 338343412, 339060366, 339679867, 340245843, 340878457, 341825753, 342897654, 343815356, 344778806, 345719248, 346437573, 347273588, 348369628, 349294960, 349950105, 350821584, 352320433, 353909522, 354747236, 355461836, 356695235, 357747108, 358481258, 359450817, 360372663, 360801637, 362050414, 365210891, 367667049, 368089914, 368447900, 369616807, 371081769]
3577.4C71081769J415521J030714N48929J492172L391266K328932K10494Q48681J973569
3595.7C84322047J729489J635521J448632M67985N93245K133400K362400J619518J186758
3614.1C97498995O68556K181768L561079J071930j401782k51621M971177N637556P56413
3632.4D14694071l7551Q49217R60887R44674R3281q61675J092434O059915N445927
3650.8D29241180m88996p53522K349287J540184o5058o4075p30664n47617K547234
3669.2D33027953K672225J53691L577351L953457p71969j737953j816123j804889J247943
3687.5D38501686M614115K115458j283854j535505q48741M41492K245605J123577j575500
3705.9D43798333j328975J853705M068375Q40067k367764j832038k61456M70727O32316
$$ y = [371081769, 372497290, 373528004, 374076933, 375569105, 378960371, 381289303, 381499797, 382348478, 384322047, 386051536, 387687057, 389135689, 389603674, 390196919, 392330319, 394692719, 396312237, 397498995, 398167551, 400349319, 403910398, 404982328, 403580546, 403328925, 408300102, 413937658, 414694071, 414656520, 415505737, 416466624, 417411298, 417504579, 416642904, 417735338, 423795253, 429241180, 428752184, 427998662, 430347949, 431888133, 431823075, 431759000, 431028336, 430480719, 433027953, 435700178, 435853869, 439431220, 443384677, 442612708, 440874755, 439058632, 437253743, 438501686, 443115801, 445231259, 443947405, 442411900, 441563159, 442004651, 444250256, 445373833, 443798333, 442469358, 444323063, 448391438, 449231505, 446863741, 445031703, 444770247, 445240974, 445873290]
3724.2D45873290L22789j584619k584368k55227L206342L446699j009912m797160j893491
3742.6D40724343M405737J559347j296938L547460L116012k067804k276421N70774
3758.9D48282510O09726j249761p30246L46601J236051J253069r28670j965434m62979
3777.3D46390867J439929O52582o65933q1092k2501n78940r60082j035988j69993l56435
3797.7D44612414K22146K717793L47674q28087J309335j083732l624230j613856J751155
3816D43810612O46323Q33303K757072o67155k155959j208633r14574m80235o17444
3834.4D42003310O33001K685309J213908n84096r50664k478093m277855k770543N378574
3852.7D40852851Q143514j357526m901796k642572L10421Q53330r56118K88188K033085
$$ y = [445873290, 446196079, 444611460, 442027092, 441771865, 444978207, 448424906, 447414994, 442617834, 440724343, 445130080, 446689427, 445392489, 448939949, 452055961, 449988157, 447711736, 448282510, 448892236, 447642475, 446912229, 447258830, 448494881, 449747950, 448819280, 446853846, 446390867, 447830796, 448483378, 447817445, 447736353, 447713852, 447134912, 446174830, 445138842, 444968849, 444612414, 444834560, 447552353, 447900027, 447071940, 448381275, 447297543, 443673313, 442059457, 443810612, 444456935, 445290238, 448047310, 447380155, 445224196, 444015563, 443100989, 442620754, 442003310, 442636311, 445321620, 446535528, 445951432, 445000768, 442522675, 438244820, 435474277, 440852851, 448996365, 447638839, 442737043, 440094471, 440404892, 441258222, 440302104, 440590292, 442623377]
3871.1D42623377K79486j139730k104819p92652Q23646j25885Q04037R2298j444161
3889.4D39015597P53403M04596k580553k079994N59777J980752K242953P71314j569778
3907.8D39498067j891941j251817r96679Q9139J101643K14368p60496j94102l1859
3926.1D35776323q70973l71724Q32140L03209q63373j058459m66079L98219J31428
3944.5D33810711n35786k0206J72406m19259n42164k69234j60277r0033q7261l40938
3964.9D31517959m06325j76966p6265j27345j07944j61737k74152j91360q8931k22444
3985.3D29684490l54856k40028j37568j84655j72675j48832
3997.5D28445876
$$ y = [442623377, 442902863, 441763133, 439658314, 438865662, 439689308, 439563423, 440367460, 440459758, 439015597, 439769000, 440173596, 437593043, 435513049, 436072826, 438053578, 440296531, 441067845, 439498067, 437606126, 436354309, 435357630, 435446769, 436548412, 436762780, 436002284, 435808182, 435776323, 434905350, 434533626, 435365766, 435668975, 434805602, 433747143, 433281064, 433679283, 433810711, 433274925, 433254719, 433427125, 433007866, 432465702, 432196468, 432036191, 431946158, 431858897, 431517959, 431111634, 430934668, 430858403, 430731058, 430623114, 430461377, 430187225, 429995865, 429906934, 429684490, 429329634, 429089606, 428952038, 428767383, 428594708, 428445876]
##END=$$ End of the data block
