##TITLE=$$ Begin of the data block
##JCAMP-DX=5.00 $$ ACD/SpecManager v 10.08
##SPECTROMETER/DATA SYSTEM=Alpha
##DATE=13 Jun 2014 08:26:00
##DATA TYPE=INFRARED SPECTRUM
##DATA CLASS=XYDATA
##ORIGIN=
##OWNER=
##NPOINTS=1765
##FIRSTX=399.75695801
##LASTX=3997.56933594
##MAXX=3997.56933594
##MINX=399.75695801
##MAXY=0.69632298
##MINY=0.24635136
##XFACTOR=1.0000000000
##YFACTOR=1.000000000000000e-9
##FIRSTY=0.55502617
##DELTAX=2.03957629
##XUNITS=1/CM
##YUNITS=ARBITRARY UNITS
##XYDATA=(X++(Y..Y))
399.8E55026174J0692656J0656178P033825K275049P59185J880884K230823R55105
416.1E91509879L516J298309K445578J292944k58267K2769J506329J840234O79910
434.4F00341201k24114M72308J483380R36866o36339j305223m12404M09007o34491
452.8F00430191j895309r39608J120627J719892J058817N49734J028597J993895K138436
471.1F07205272J484394J434386K294302K951026K547979J553595J550615K598762
487.5F23620331K815962J745343R24468J421512K344846K104342O55949k97665K39193
505.8F35574281J076043Q55565K1577q9228O23285J127601R45747N51820O47902J344323
526.2F42678916J744569J371860R13143J093150J732707J929998J495004J150310J274109
$$ plain form
399.8 555026174 565718830 576375008 583408833 585683882 586443067 588323951 590554774 591509879
416.1 591509879 591513395 592811704 595257282 596550226 596291959 596314728 597821057 599661291 600341201
434.4 600341201 600117087 600589395 602072775 603009641 602373302 601068079 600655675 601064682 600430191
452.8 600430191 598534882 597595274 598715901 600435793 601494610 602044344 603072941 605066836 607205272
471.1 607205272 608689666 610124052 612418354 615369380 617917359 619470954 621021569 623620331
487.5 623620331 626436293 628181636 629106104 630527616 632872462 634976804 635632753 635335088 635574281
505.8 635574281 636650324 637505889 637527466 637438238 638061523 639189124 640134871 640686691 641334593 642678916
526.2 642678916 644423485 645795345 646708488 647801638 649534345 651464343 652959347 654109657 655383766
544.6F55383766J484096J260996P58886N61416Q00789J050472R64164Q22723Q69632
562.9F63956940J072288J323938J219511P39753M40956O03854R70066J041770P34031
581.3F72103107N39780P30037J053512J154602Q60095M12703K92897M33326L25620
599.6F77905679n2214l97503m93288l23713k95222n35250m74512O7293L93570K66433
620F76061273K20775L87073N81562O58870N25057L66927M32431O43969P68900O64830
640.4F81311667L63827K61903N36799N77748m1783o71089p74324p26819r46939j337290
660.8F78553700j305937M1902K200782O01172l002047k192199p15375l31044n98967
679.2F73251987r83120j245498j495421j911342k572716l144621l081739k753735k745867
$$ plain form
544.6 655383766 656867862 658128858 658887744 659449160 660249949 661300421 662264585 663087308 663956940
562.9 663956940 665029228 666353166 667572677 668312430 668753386 669357240 670327306 671369076 672103107
581.3 672103107 672642887 673372924 674426436 675581038 676441133 676853836 677146733 677580059 677905679
599.6 677905679 677853465 677455962 676962674 676638961 676343739 675808489 675333977 675401270 675794840 676061273
620 676061273 676282048 676669121 677250683 677909553 678434610 678801537 679233968 679877937 680646837 681311667
640.4 681311667 681675494 681937397 682474196 683051944 683010161 682339072 681564748 680837929 679890990 678553700
660.8 678553700 677247763 677289665 679490447 680091619 677089572 674897373 674181998 673850954 673251987
679.2 673251987 672268867 671023369 669527948 667616606 665043890 661899269 658817530 656063795 653317928
697.5F53317928j117587J710177R19282l560543q485854j2899935j1651993r84668
713.8F17246807Q585810Q831620O080330N348265N882919O670654O941795O292522
730.2F71880722M873097L217459J842200R91107N63085K25961j82569m29511l86775
748.5F82594776k50518l13819o19053q86798r23217q06510q88050j253903j500427
766.9F75152481j402975j260042j373350j490832j090467j04963R22203J322925R99927
785.2F71674907M91441J89542j47164o12378o19113K47657J566768K454579K669930
803.6F77916169K637625K688885K804637K640903K075195J525283J328528J287639
819.9F94904864J020729L97385k87414p17163j099169j960516l144682l977239m487514
$$ plain form
697.5 653317928 652200341 653910518 654829800 651269257 642783403 629883468 618231475 617246807
713.8 617246807 625832617 634664237 640744567 646092832 651975751 658646405 665588200 671880722
730.2 671880722 676753819 679971278 681813478 682804585 683367670 683593631 683411062 682981551 682594776
748.5 682594776 682344258 682030439 681411386 680524588 679601371 678794861 677906811 676652908 675152481
766.9 675152481 673749506 672489464 671116114 669625282 668534815 668429852 669352055 670674980 671674907
785.2 671674907 672166348 672355890 672208726 671596348 670977235 671224892 672791660 675246239 677916169
803.6 677916169 680553794 683242679 686047316 688688219 690763414 692288697 693617225 694904864
819.9 694904864 695925593 696322978 696035564 695318401 694219232 692258716 689114034 685136795 680649281
838.3F80649281n468607o462694o620824p231057q254349r962976j4136910j6680062
854.6F05831802j3091445o742537k432644j506985m739046j3487100k5497377l1565607
870.9E06769061k4967670j0200531O822795K3713589L4797251L5915792L1028151K4901510
887.2F28779948J8358946J2015640P158339M300237L107548K642214J977623J105964
903.5F79446459N98073P06911R03666M38213m01079p39158n94914o75141j165390j631618
923.9F76886022j637697j275778j092493j292289j400709j052439o24836o42895j036585
942.3F66830301j284778j135409r17673j093268j553774j808882j782834j852274k219975
960.6F53181434k617658k682089k467513k432585k772689l188670l352582l377021
$$ plain form
838.3 680649281 675180674 668717980 662097156 654866099 646611750 636648774 622511864 605831802
854.6 605831802 592740357 585997820 583565176 582058191 577319145 563832045 538334668 506769061
870.9 506769061 481801391 471600860 478423655 502137244 536934495 572850287 603878438 628779948
887.2 628779948 647138894 659154534 666312873 670613110 673720658 676362872 678340495 679446459
903.5 679446459 680044532 680751443 681655109 682093322 681692243 680953085 680358171 679683030 678517640 676886022
923.9 676886022 675248325 673972547 672880054 671587765 670187056 669134617 668509781 667866886 666830301
942.3 666830301 665545523 664410114 663492441 662399173 660845399 659036517 657253683 655401409 653181434
960.6 653181434 650563776 647881687 645414174 642981589 640208900 637020230 633667648 630290627
977F30290627l649711m199922m556477m404187m052580l957987m065871l915310l445208
995.3E94043374l074765l072262l289044l352821l158986l060341l244877l360093
1011.6E68430185l143012k823115k763629k914249k949059k693415k326489k177894
1027.9E46639323k171397j920760j245737m31776P5698J62065L7074j98602o09994
1046.3E40335894j122177j491129j515806j287758j052022p94352l34560J81019L49402
1064.7E33268511j28269j052976j887619k306700k379000k536356l289223l553450
1081E16134918q23796L128648M092157K976298K395034K315521K062261J487076R14693
1099.3E34682810P20859Q22067Q56996O99222N59509P11023J134634J467228J421810
$$ plain form
977 630290627 626640916 622440994 617884517 613480330 609427750 605469763 601403892 597488582 594043374
995.3 594043374 590968609 587896347 584607303 581254482 578095496 575035155 571790278 568430185
1011.6 568430185 565287173 562464058 559700429 556786180 553837121 551143706 548817217 546639323
1027.9 546639323 544467926 542547166 541301429 540869653 540945351 541107416 541144490 540945888 540335894
1046.3 540335894 539213717 537722588 536206782 534919024 533867002 533072650 532738090 532919109 533268511
1064.7 533268511 533140242 532087266 530199647 527892947 525513947 522977591 519688368 516134918
1081 516134918 515311122 518439770 522531927 525508225 527903259 530218780 532281041 533768117 534682810
1099.3 534682810 535403669 536225736 537082732 537781954 538341463 539052486 540187120 541654348 543076158
1117.7E43076158J115024Q82625Q73626R46104R88364J082421J196563J171529R56655
1136E52289069N34951L8743k33709k92898m28021o74188p79032o17207l62634l34144
1156.4E49140930o34491q49545m67062L96192J136660J489401J693726J935303K108634
1174.8E55949748K052903J813292J598120J490176J323104R55999N00321J49250m4346
1193.1E65788567k15948m91797p31648p23540n66125m84467n27203n84006n49138m93765
1213.5E60420930o01112q73447j094520j153529j122534j199245j429081j569748j467645
1231.9E49910069j287103j256228j320719j306475j194656j120507j134038j182378
1248.2E40107965j155018j041651r95576j088441j220822j235843j131356j032710
$$ plain form
1117.7 543076158 544191182 545073807 545947433 546893537 547881901 548964322 550160885 551332414 552289069
1136 552289069 552824020 552862763 552629054 552336156 551908135 551233947 550454915 549837708 549475074 549140930
1156.4 549140930 548506439 547656894 547189832 547586024 548722684 550212085 551905811 553841114 555949748
1174.8 555949748 558002651 559815943 561414063 562904239 564227343 565183342 565683663 565832913 565788567
1193.1 565788567 565572619 565080822 564349174 563625634 563059509 562575042 562047839 561463833 560914695 560420930
1213.5 560420930 559819818 558946371 557851851 556698322 555575788 554376543 552947462 551377714 549910069
1231.9 549910069 548622966 547366738 546046019 544739544 543544888 542424381 541290343 540107965
1248.2 540107965 538952947 537911296 536915720 535827279 534606457 533370614 532239258 531206548
1264.5E31206548j071989j142681j119792j091421j178742j335799j419306j366735
1280.8E21480083j212775j159549j253486j392424j465857j528084j682341j884818
1297.2E09900749k042890k118587k163947k211988k319425k416551k468914k490640
1313.5D91667807k475470k357632k195627k131253k171755k324283k542168k766162
1329.8D72703457k867997k863407k833158k900064k976507k912104k867192k946585
1346.1D49536443l083736l228188l476381l713459l849119l875762l945797m168600
1362.4D20195401m305244m283666m361391m385263m398406m665196m729390m757374
1378.7C84309471n023182n173266n022108n052537n317748n318075n686283o473243
$$ plain form
1264.5 531206548 530134559 528991878 527872086 526780665 525601923 524266124 522846818 521480083
1280.8 521480083 520267308 519107759 517854273 516461849 514995992 513467908 511785567 509900749
1297.2 509900749 507857859 505739272 503575325 501363337 499043912 496627361 494158447 491667807
1313.5 491667807 489192337 486834705 484639078 482507825 480336070 478011787 475469619 472703457
1329.8 472703457 469835460 466972053 464138895 461238831 458262324 455350220 452483028 449536443
1346.1 449536443 446452707 443224519 439748138 436034679 432185560 428309798 424364001 420195401
1362.4 420195401 415890157 411606491 407245100 402859837 398461431 393796235 389066845 384309471
1378.7 384309471 379286289 374113023 369090915 364038378 358720630 353402555 347716272 341243029
1395.1C41243029o789595o999880p077247p041484p513523p511706p120788o921172
1411.4B84267634o506085n791366n269409m812210l406585k009451j091540l42011
1427.7B55038977K81840N87732O33210P73698O63131N5850l97444o90818q52316q83490
1448.1B55210370q91864q04067n55724L8922M60654J9729m24116q81941j555770j826465
1468.5B48789728j549632q88735O229P07760J288742J908735K470851K791226L286093
1486.8B58810997M194230M653692M021108M128218N365491N555302M656374L963679
1503.2B95349091N024612P648558O308168M560262M685312N235643N688935N662352
1519.5C40162933O287634O000191N176664N348056M860223M953086N831599M847556
$$ plain form
1395.1 341243029 334453434 327453554 320376307 313334823 305821300 298309594 291188806 284267634
1411.4 284267634 277761549 271970183 266700774 261888564 258481979 256472528 255380988 255038977
1427.7 255038977 255320817 255908549 256541759 257315457 257978588 258034438 257636994 256946176 256093860 255210370
1448.1 255210370 254318506 253514439 252958715 252997637 253458291 253478020 253053904 252171963 250616193 248789728
1468.5 248789728 247240096 246351361 246357590 247065350 248354092 250262827 252733678 255524904 258810997
1486.8 258810997 263005227 267658919 271680027 275808245 281173736 286729038 291385412 295349091
1503.2 295349091 300373703 308022261 314330429 318890691 323576003 328811646 334500581 340162933
1519.5 340162933 346450567 352450758 357627422 362975478 367835701 372788787 378620386 383467942
1535.8C83467942M278213O702185P128805N096525M499942M345119M616588M587442
1552.1D24722761M331589M128039N850344O466747K953887K222091K728313L130346
1568.4D56534117L281028K206057K016842K836019J946777J047433J071333J040340
1584.7D71979946Q17925O11782L90351J81496L5375j10894k05309k74688l78549n15580
1605.1D72531855n55754o19053q08835r48072o87122n18531r45955r18776n74142n87493
1625.5D65368122o06060n21511n29736k146R79453P57426J88023L51787P87645J759857
1645.9D68532860J911015P58439J814455L607869J615912Q93294J740873K696276K712101
1664.3D86283094K077609K742380L492534K638936K792865L281832K493143K095878
$$ plain form
1535.8 383467942 387746155 394448340 401577145 406673670 411173612 415518731 420135319 424722761
1552.1 424722761 429054350 433182389 439032733 445499480 448453367 450675458 453403771 456534117
1568.4 456534117 459815145 462021202 464038044 466874063 468820840 469868273 470939606 471979946
1584.7 471979946 472797871 473409653 473800004 473981500 474016875 473905981 473700672 473425984 473047435 472531855
1605.1 472531855 471976101 471357048 470548213 469600141 468913019 468394488 467448533 466529757 465955615 465368122
1625.5 465368122 464762062 464240551 463710815 463708669 464688122 465445548 465633571 465985358 466773003 468532860
1645.9 468532860 470443875 471202314 473016769 476624638 478240550 479133844 480874717 483570993 486283094
1664.3 486283094 488360703 491103083 494595617 497234553 500027418 503309250 505802393 507898271
1680.6E07898271L134430M861950L562272K383173K692580K586603L447235M205286
1696.9E34771800M156828M709423L181397K606750L121495K518893K027213J981080
1713.2E59074879K419173L278375K531648J207888J266837J588285J509786J389861
1729.5E74266732J417637K436459K264440J039147J494527J938522J732230J838267
1745.9E88427961K169609K635658K441048J672149J777768J951099J684665J789034
1762.2F04548991J376688J030445J214505J303315J374483N50806n51343p87854p01010
1780.5F09359026p80344q25882q50678q47816m14908M9532k44022l72410K45989J048743
1800.9F06367230J353622J332521J482427J734972J834095J653254J607180J761198
$$ plain form
1680.6 507898271 511032701 515894651 519456923 521840096 524532676 527119279 530566514 534771800
1696.9 534771800 538928628 543638051 546819448 549426198 552547693 555066586 557093799 559074879
1713.2 559074879 561494052 564772427 567304075 568511963 569778800 571367085 572876871 574266732
1729.5 574266732 575684369 578120828 580385268 581424415 582918942 584857464 586589694 588427961
1745.9 588427961 590597570 593233228 595674276 597346425 599124193 601075292 602759957 604548991
1762.2 604548991 605925679 606956124 608170629 609473944 610848427 611399233 610847890 610060036 609359026
1780.5 609359026 608578682 607752800 606902122 606054306 605639398 605688930 605444908 605072498 605318487 606367230
1800.9 606367230 607720852 609053373 610535800 612270772 614104867 615758121 617365301 619126499
1817.2F19126499J631796J267374J260101J449943J293838J327574J125157O03914
1833.6F29086196O81043Q57353N18143L61205R99987J141250M41849J66834J87039
1851.9F34440899K67148M14073M42684K84672J03950M4823K56300P09772N95153O0260
1872.3F37619734J14798L84868L60429K38955K28762K96891L35276M43876M01914J81020
1892.7F40606523K92420M58658L39985K43246K81274L60370M13895M05729L10778J76251
1913.1F43889129K14338N02766M66823J41502K01821K57313J45376J26123J31667J62005
1933.5F46238863J77861R8109L5048K15828L03864R2984l5644k3186N2392J29283J12057
1955.9F47397459M9173J7703j6868J6391J46806J51217k0563p0691N1319J13070N7102
$$ plain form
1817.2 619126499 620758295 622025669 623285770 624735713 626029551 627357125 628482282 629086196
1833.6 629086196 629767239 630624592 631142735 631503940 632503927 633645177 634087026 634253860 634440899
1851.9 634440899 634708047 635122120 635564804 635849476 635953426 635998249 636254549 636964321 637559474 637619734
1872.3 637619734 637734532 638119400 638479829 638718784 638947546 639244437 639579713 640023589 640425503 640606523
1892.7 640606523 640898943 641357601 641697586 641940832 642222106 642582476 642996371 643402100 643712878 643889129
1913.1 643889129 644103467 644606233 645073056 645214558 645416379 645673692 645819068 645945191 646076858 646238863
1933.5 646238863 646416724 646514833 646549881 646765709 647069573 647162557 647126913 647103727 647156119 647285402 647397459
1955.9 647397459 647446632 647464335 647447467 647463858 647610664 647761881 647741318 647670627 647721946 647835016 647892118
1978.4F47892118O616L0934L0816j3649n4241K087R2923m77j00195o6042r418L0220
2002.8F47841692K4199j6808k3425Q524L0696O5863R9182J2398r4116o8604j7465k1159
2027.3F47840977n1558n2274q761K0742r298m3214j7225L0398N9307K3007k4200j9490
2051.8F47748411J371K3961J0490n9307p5757K6643P4089k1696j12534q8930M947M4704
2076.3F47576392k7359j24633j09971j0073K563p9632j20341q3983L874K0981j06871
2098.7F46940947k10762j55330l6061k6941j39654k11835j32441j0908k1815j43349
2119.1F45851851j95683j26063p0513j33335k40147k23518q9168k1994r0301j71423
2139.5F44489706j45019k9981R835j05679j99079j26183P748M5717j3769q2254p4804
$$ plain form
1978.4 647892118 647898734 647929668 647960484 647946835 647892594 647894681 647987604 647987127 647886932 647820890 647811472 647841692
2002.8 647841692 647865891 647849083 647825658 647834182 647864878 647930741 648029923 648042321 647948205 647879601 647862136 647840977
2027.3 647840977 647789419 647737145 647728384 647749126 647739828 647696614 647679389 647709787 647769094 647792101 647767901 647748411
2051.8 647748411 647749782 647773743 647784233 647724926 647649169 647675812 647749901 647728205 647615671 647526741 647531688 647576392
2076.3 647576392 647549033 647424400 647314429 647304356 647306919 647227287 647106946 647022963 647026837 647047818 646940947
2098.7 646940947 646730185 646574855 646538794 646511853 646372199 646160364 646027923 646017015 645995200 645851851
2119.1 645851851 645656168 645530105 645459592 645326257 645086110 644862592 644773424 644751430 644661129 644489706
2139.5 644489706 644344687 644314706 644324541 644218862 644019783 643893600 643901348 643947065 643933296 643851042 643776238
2161.9F43776238O080N2988j609o9797k6107O8247O4314l3915q8811l9995K4617J5676
2186.4F43747926l4094n4598n1856n1200n2095p0333p3493k8789r596n7638j21593
2208.8F43142641j39773j09315p2181p3195j11461j34170j06275p0691j05262j50978
2229.2F42069340j23024o6459m1008m0234o5505j16229j29640p8440l0637n6445p9096
2251.7F41242623m2438k1517k8670l4213k9147l3021o2466o8605m5836n5611j12295
2274.1F40708804j88470k34544k41339j96815o6280O6757J19925J42276J87933K06530
2294.5F40504777J96934K40624K90632K99096L77059N79060P86483Q31962O51776M69625
2314.9F45228028O79136J194059J460612J235009Q34047P04646Q55566P45415K50817
$$ plain form
2161.9 643776238 643782318 643835306 643833697 643763900 643737793 643806040 643870354 643836439 643747628 643707633 643732250 643747926
2186.4 643747926 643713832 643659234 643607378 643556178 643504083 643433750 643360257 643331468 643321872 643264234 643142641
2208.8 643142641 643002868 642893553 642821372 642748177 642636716 642502546 642396271 642325580 642220318 642069340
2229.2 642069340 641946316 641879857 641838849 641798615 641733110 641616881 641487241 641408801 641378164 641321719 641242623
2251.7 641242623 641200185 641178668 641149998 641115785 641086638 641053617 640991151 640922546 640876710 640821099 640708804
2274.1 640708804 640520334 640285790 640044451 639847636 639781356 639848113 639968038 640110314 640298247 640504777
2294.5 640504777 640701711 640942335 641232967 641532063 641909122 642488182 643274665 644106627 644758403 645228028
2314.9 645228028 645907164 647101223 648561835 649796844 650630891 651335537 652191103 652936518 653187335
2333.3F53187335J10566L64065N15104M46975m9949j722276l394187k333462R25601
2351.6F48049772L601432L786564K688586J412273J44362r93788j823783k401888k829850
2370F51633680l046453l017187k882481k793074k683103k395093j911402j338064p95842
2388.3F30770981m09007k54631k80916l17157k66194j96278k11239k77519k95699k61784
2408.7F28000557k23219k28047k73347l09527k97368k76386l18826l80695l66687k75493
2429.1F25050962k32220l07262l96073m15027l77357l28898l53575m39942m61757l95596
2449.5F21343255l68178m69446o08087o30021n48243n07951n79953p23481q31008q37684
2469.9F15239203q42869r73404j176893j270116j219153j180709j286506j451373j473725
$$ plain form
2333.3 653187335 653297901 653661966 654177070 654624045 654574096 652851820 649457633 647124171 648049772
2351.6 648049772 651651204 655437768 658126354 659538627 659682989 658689201 656865418 654463530 651633680
2370 651633680 648587227 645570040 642687559 639894485 637211382 634816289 632904887 631566823 630770981
2388.3 630770981 630361974 630107343 629826427 629509270 629243076 629046798 628835559 628558040 628262341 628000557
2408.7 628000557 627777338 627549291 627275944 626966417 626669049 626392663 626073837 625693142 625326455 625050962
2429.1 625050962 624818742 624511480 624115407 623700380 623323023 622994125 622640550 622200608 621738851 621343255
2449.5 621343255 620975077 620505631 619897544 619267523 618719280 618211329 617631376 616907895 616076887 615239203
2469.9 615239203 614396334 613422930 612246037 610975921 609756768 608576059 607289553 605838180 604364455
2488.3F04364455j357198j284719j344919j395106j270890j047910r30488r58740r99213
2506.6E93775272r76920r20892r30666j033545j059771q66115n40971k59698r6559
2525E87090135J9133K15769M54783N76794N52774M70340M03106L34621K31206J61350
2545.4E90510011K08676L49462M80055M58122K49564Q0705J21296J73389P5639m0949
2565.8E92665970q3804o3240l8207j04785k17497k56241k01284j51754j97291k78712
2586.2E91073155k98559k66016k37167k58028l10123k99275k44320k31802k43425k43485
2606.6E88440955k22147j97172j84894j78158j89602j83225j26898r0003j31607j77384
2626.9E86759865j51813j19030j11938j08540j19209j28508j42336j67310j63555j70231
$$ plain form
2488.3 604364455 603007257 601722538 600377619 598982513 597711623 596663713 595733225 594774485 593775272
2506.6 593775272 592798352 591877460 590946794 589913249 588853478 587987363 587446392 587186694 587090135
2525 587090135 587109268 587325037 587779820 588356614 588909388 589379728 589782834 590117455 590348661 590510011
2545.4 590510011 590718687 591068149 591548204 592006326 592255890 592336595 592457891 592631280 592706919 592665970
2565.8 592665970 592582166 592518926 592480719 592375934 592158437 591902196 591700912 591549158 591351867 591073155
2586.2 591073155 590774596 590508580 590271413 590013385 589703262 589403987 589159667 588927865 588684440 588440955
2606.6 588440955 588218808 588021636 587836742 587658584 587468982 587285757 587158859 587068856 586937249 586759865
2626.9 586759865 586608052 586489022 586377084 586268544 586149335 586020827 585878491 585711181 585547626 585377395
2647.3E85377395k21550k49148k48849k78890l11435l18944l58999l96728l82424l74376
2667.7E82236052l82364l75092l71456m09186m53234m56572m44531m18663l83020l80337
2688.1E78161597m20034m71770m61817m12464m20332m54903m69744m66109m49776m39048
2708.5E73695600m53949m74870m48883m12404m32313m54306m31419m24325m27068m16159
2728.9E69319904m20213m33445m16934l80278m00126m37736m12345l70861l84509m34399
2749.3E65229058m45783l94761l47972l80099m68373n12779m52817l99172m36127m80473
2769.7E60910702m98176m99487m90963m90964n00440n21839n40912n67079n97536n79000
2790.1E55624306n49793n87165o41108o58452o81460p03693o86109o91235p47263p78675
$$ plain form
2647.3 585377395 585155845 584906697 584657848 584378958 584067523 583748579 583389580 582992852 582610428 582236052
2667.7 582236052 581853688 581478596 581107140 580697954 580244720 579788148 579343617 578924954 578541934 578161597
2688.1 578161597 577741563 577269793 576807976 576395512 575975180 575520277 575050533 574584424 574134648 573695600
2708.5 573695600 573241651 572766781 572317898 571905494 571473181 571018875 570587456 570163131 569736063 569319904
2728.9 569319904 568899691 568466246 568049312 567669034 567268908 566831172 566418827 566047966 565663457 565229058
2749.3 565229058 564783275 564388514 564040542 563660443 563192070 562679291 562226474 561827302 561391175 560910702
2769.7 560910702 560412526 559913039 559422076 558931112 558430672 557908833 557367921 556800842 556203306 555624306
2790.1 555624306 555074513 554487348 553846240 553187788 552506328 551802635 551116526 550425291 549678028 548899353
2810.5E48899353p76768p68304p70032q29697r15647r52422r66072j014054j106918
2828.9E40799439j221299j302600j375198j536012j743734j939356k165139k406955
2845.2E27109146k531469k331733j752675j051545n58019l78728l72052m22358n79119
2863.5E17131448p88570r17196r63688r11057p06076m83394m25220m71711n02825n59091
2883.9E10402620o85871q38578r32097r14693q54432q42095q43167q24213q45313r22263
2904.3E01899898j063704j288385j529485j728803j831293j771778j539886j179158
2920.6D89967406p83622m08710r4711J22398K99215M80563O30557P00176O73681N93394
2941D92180347N26548M42803K72333K8611j77443k55078k84881k71022j23114R8080
$$ plain form
2810.5 548899353 548122585 547354281 546584249 545754552 544838905 543886483 542920411 541906357 540799439
2828.9 540799439 539578140 538275540 536900342 535364330 533620596 531681240 529516101 527109146
2845.2 527109146 524577677 522245944 520493269 519441724 518883705 518504977 518132925 517710567 517131448
2863.5 517131448 516342878 515425682 514461994 513550937 512844861 512361467 511936247 511464536 510961711 510402620
2883.9 510402620 509716749 508878171 507946074 507031381 506176949 505334854 504491687 503667474 502822161 501899898
2904.3 501899898 500836194 499547809 498018324 496289521 494458228 492686450 491146564 489967406
2920.6 489967406 489183784 488775074 488680363 488802761 489101976 489582539 490213096 490913272 491586953 492180347
2941 492180347 492706895 493149698 493422031 493450642 493273199 493018121 492733240 492462218 492339104 492437184
2961.4D92437184L01659M52936N47170N90921O15895O12914N31882M49002M61072N00291
2981.8D97500926M53055L61473L10778K49505K11477K41578J89006O4403k9951j08123
3002.2D99444127j30773j56134k56806l05236k73764k61545k75910l13014l83407m91917
3022.6D96595621n62936n61923n59777n38885n71937o82562p48843p67678p61718p51525
3043D90087837p41482p10934p00981p44789p73967p26998o90341p23213p62730p58440
3063.4D82753962p23034p08848p28309p40260p25061o98894o89060o93619p11799p46607
3083.8D75588471p42793p16776p41750p51168p02560o81489p21842p36326p22945p54446
3104.2D68316376p60257p47085p99209q38995p98881p63744q02010q57115q89599r06020
$$ plain form
2961.4 492437184 492738843 493191779 493738949 494329870 494945765 495558679 496090561 496539563 497000635 497500926
2981.8 497500926 497953981 498315454 498626232 498875737 499087214 499328792 499517798 499582201 499552250 499444127
3002.2 499444127 499313354 499157220 498900414 498595178 498321414 498059869 497783959 497470945 497087538 496595621
3022.6 496595621 496032685 495470762 494910985 494372100 493800163 493117601 492368758 491601080 490839362 490087837
3043 490087837 489346355 488635421 487934440 487189651 486415684 485688686 484998345 484275132 483512402 482753962
3063.4 482753962 482030928 481322080 480593771 479853511 479128450 478429556 477740496 477046877 476335078 475588471
3083.8 475588471 474845678 474128902 473387152 472635984 471933424 471251935 470530093 469793767 469070822 468316376
3104.2 468316376 467556119 466809034 466009825 465170830 464371949 463608205 462806195 461949080 461059481 460153461
3124.6D60153461r02266q98003q88229q78811r00983q99792q93593r64910j031488
3143D51895386j025468r89467r34482q81374r39011j091659j131326j047880j009196
3161.3D42845523j034349j064092j065880j051932j058460j092642j136512j106620
3177.6D34235036j042276j064211j103551j113891j112193j065970j038163j076371
3193.9D25618410j094997j101315j143753j124412j052022j050949j090944j086027
3210.3D16873991j030832j026422j106918j107633j023888j023978j073391j043051
3226.6D08437878r64612r11593r13978j013309j091361j036525r73880r54360r30786
3244.9C99647474r36120r64523r48012q87602q67486r13680r58949r70036r40591q63969
$$ plain form
3124.6 460153461 459251195 458353192 457464963 456586152 455685169 454785377 453891784 452926874 451895386
3143 451895386 450869918 449880451 448945969 448064595 447125584 446033925 444902599 443854719 442845523
3161.3 442845523 441811174 440747082 439681202 438629270 437570810 436478168 435341656 434235036
3177.6 434235036 433192760 432128549 431024998 429911107 428798914 427732944 426694781 425618410
3193.9 425618410 424523413 423422098 422278345 421153933 420101911 419050962 417960018 416873991
3210.3 416873991 415843159 414816737 413709819 412602186 411578298 410554320 409480929 408437878
3226.6 408437878 407473266 406561673 405647695 404634386 403543025 402506500 401532620 400578260 399647474
3244.9 399647474 398711354 397746831 396798819 395911217 395043731 394130051 393171102 392201066 391260475 390396506
3265.3C90396506p93308p97064q54224q77678q54731q51184q70704q69066q46088q18640
3285.7C81963819p93099p46846o91504p32541q34197q60035q47012q19415p75843q10296
3306.1C74053031q87215r29594r76592j003623r80139r85950j030594j008690r51499
3324.5C65299135j010596j134634j166702j101225j006365r53913j029551j173615
3340.8C56722534j229108j189857j071513r50396r90570j092642j069099j004785r85384
3359.1C47139180r62943r15766p98494p18891q69841j112878j130104r63271q64654
3377.5C38802338q49992q50350p98464p13110o60419n70238n53101p44403q16553n91398
3397.9C31654310m19259n55932p87944p62969n57512m38929m40240n10931n72502m59701
$$ plain form
3265.3 390396506 389603198 388806134 387951910 387074232 386219501 385368317 384497613 383628547 382782459 381963819
3285.7 381963819 381170720 380423874 379732370 378999829 378165632 377305597 376458585 375639170 374863327 374053031
3306.1 374053031 373165816 372236222 371259630 370256007 369275868 368289918 367259324 366250634 365299135
3324.5 365299135 364288539 363153905 361987203 360885978 359879613 358925700 357896149 356722534
3340.8 356722534 355493426 354303569 353232056 352281660 351291090 350198448 349129349 348124564 347139180
3359.1 347139180 346176237 345260471 344461977 343743086 342873245 341760367 340630263 339666992 338802338
3377.5 338802338 337952346 337101996 336303532 335590422 334930003 334359765 333806664 333062261 332245708 331654310
3397.9 331654310 331235051 330679119 329891175 329128206 328570694 328131765 327691525 327180594 326608092 326148391
3418.3C26148391k51383k36600l21955k42740p6145l0488l7044p897j09911l04997
3438.7C24529231k66344q3238N0784K03818J47283J0132J16408K40654K98232L79324
3459.1C25626284M09901L89814M59373N71758M28170J84774K71142M78655N04613N44935
3479.5C29869419O30647N85318N83261O64026O04510N37306O69599Q30263P12603N66631
3499.9C36253583Q51393R55135N04881N14656R78142J038015Q13782O72579O09577
3518.2C43191743P02232J050979J187712J006096J021624R84192P95394R81301J240790
3536.6C52162063J024515P45534R54718J557469J652539R49800Q42243J313448J149089
3554.9C62351418Q89152J074046R55194M91381J388937L345460K602249N05686M31716
$$ plain form
3418.3 326148391 325897008 325660408 325338453 325095713 325019568 324989080 324952036 324944139 324834228 324529231
3438.7 324529231 324262887 324179649 324230433 324434251 324581534 324591666 324708074 324948728 325246960 325626284
3459.1 325626284 326036185 326425999 326885372 327457130 327885300 328070074 328341216 328819871 329324484 329869419
3479.5 329869419 330500066 331085384 331668645 332332671 332937181 333474487 334144086 334974349 335686952 336253583
3499.9 336253583 337104976 338060111 338564992 339079648 340057790 341095805 341909587 342582166 343191743
3518.2 343191743 343893975 344944954 346132666 347138762 348160386 349144578 349939972 350921273 352162063
3536.6 352162063 353186578 353932112 354886830 356444299 358096838 359046638 359888881 361202329 362351418
3554.9 362351418 363240570 364314616 365269810 365761191 367150128 370495588 373097837 373603523 374035239
3573.3C74035239J244039J528441J532674J215041O99848J580775L478080K470553
3589.6C87784690M30494J082361K114564J792878J710266J548797N60045O94037K285540
3608D00003672K557814J818686J344115P85798K329141L731161J203150j304359j42365
3626.3D12326813N154520N816907Q72492Q7739R78261J074284J063436K03908p88748
3644.7D26789612J195877O272227N614966m94778p89851K409607J650155Q0079R0569
3663D42818463o78390m98474K738506K783417Q5682L610015M114270o91593j780003
3681.4D52501893j907736j835793J306534M731059K218902j261354j535892p80493
3697.7D53437120N55783K299398J110048j563609j280099J908421M112751Q44448k389073
$$ plain form
3573.3 374035239 375279278 376807719 378340393 379555434 380255282 381836057 385314137 387784690
3589.6 387784690 388215184 389297545 391412109 393204987 394915253 396464050 397024095 397718132 400003672
3608 400003672 402561486 404380172 405724287 406510085 408839226 412570387 413773537 412469178 412326813
3626.3 412326813 417481333 423298240 424170732 424258471 425236732 426311016 427374452 427578360 426789612
3644.7 426789612 427985489 434257716 439872682 439377904 438588053 440997660 442647815 442727894 442818463
3663 442818463 442140073 441641599 444380105 447163522 447249204 450859219 454973489 454281896 452501893
3681.4 452501893 450594157 448758364 450064898 454795957 457014859 455753505 454217613 453437120
3697.7 453437120 453992903 456292301 457402349 455838740 454558641 456467062 460579813 461424261 459035188
3716.1D59035188j836866k32637N05894O55890L45915j590132k627343k56628L319442
3734.4D57318723L541947j082868m888445j786232M632294J573950j374781L545881
3750.7D61480469L065079k120882k200932O92934N92053j359194p49946M05580J297712
3769.1D61102873J334727q56578j957864n17488J385272O49512o42002o6042j0341
3787.5D60422069n55873r63688j087934k00808l40134K58088K802611M36276p81357
3805.8D59989250J325428j093894l653437j662165J697630O13838Q85964K825141o78897
3824.2D60248858k151549j237691j000404n11616o19352O81489K826155J335621n31227
3842.5D59040284r82225k598345m416645k759486N655289Q301347j506716n011737
$$ plain form
3716.1 459035188 457198322 456965685 457471579 458127469 458473384 456883252 454255909 453999281 457318723
3734.4 457318723 460860670 459777802 454889357 453103125 457735419 459309369 457934588 461480469
3750.7 461480469 464545548 462424666 460223734 460916668 461508721 460149527 459399581 459805161 461102873
3769.1 461102873 462437600 461581022 459623158 459105670 460490942 461140454 460498452 460432410 460422069
3787.5 460422069 459866196 458902508 457814574 457613766 457273632 457531720 460334331 460770607 459989250
3805.8 459989250 461314678 460220784 456567347 454905182 456602812 457216650 458102614 460927755 460248858
3824.2 460248858 458097309 456859618 455859214 455347598 454728246 455409735 458235890 459571511 459040284
3842.5 459040284 458058059 455459714 451043069 448283583 453938872 462240219 460733503 455721766
3858.8D55721766k624989L37571Q05825j004547L85314K199859L23892j209617k206683
3877.2D52728391q01355R08941o8933Q21710M4495j514256P40379L65585k664357k105266
3897.6D48455334N89281K006054K324313R05186j492024j868367j268208j059353Q4460
3915.9D48676676J197576K78264p63267k16752q4698r25661l80337Q30233K66463q84742
3936.3D47993755j036048m37498M03852J63823m23551Q1748J60992m99546o02633k99871
3956.7D45505023j73897p0899m9562k98619l66211j72376r8259j15245o6012j26899
3977.1D43967044k25484j53959r9450k32637l26336j83165j11758k08378k00898j81198
3997.5D42043781
$$ plain form
3858.8 455721766 453096777 453434348 454240173 453235626 453620940 455820799 456144691 454935074 452728391
3877.2 452728391 451927036 452835977 452767044 453588754 453633249 452118993 452859372 453224957 450560600 448455334
3897.6 448455334 449044615 451050669 453374982 454280168 452788144 450919777 449651569 448592216 448676676
3915.9 448676676 449874252 450152516 449389249 449172497 449087799 448162138 447781801 448612034 448878497 447993755
3936.3 447993755 446957707 446520209 446924061 447087884 446664333 446746081 446907073 446407527 445804894 445505023
3956.7 445505023 445331126 445260227 445210665 444912046 444545835 444373459 444275200 444159955 444093943 443967044
3977.1 443967044 443741560 443587601 443488151 443255514 442929178 442746013 442634255 442425877 442224979 442043781
3997.5 442043781
##END=$$ End of the data block
