##TITLE=T008 Forro $$ Begin of the data block
##JCAMP-DX=5.00 $$ ACD/SpecManager v 10.08
##SPECTROMETER/DATA SYSTEM=Alpha
##DATE=20 Nov 2014 09:22:14
##DATA TYPE=INFRARED SPECTRUM
##DATA CLASS=XYDATA
##ORIGIN=
##OWNER=
##NPOINTS=1667
##FIRSTX=599.57470703
##LASTX=3997.16503906
##MAXX=3997.16503906
##MINX=599.57470703
##MAXY=0.97816366
##MINY=0.79206610
##XFACTOR=1.0000000000
##YFACTOR=1.000000000000000e-9
##FIRSTY=0.89041436
##DELTAX=2.03937006
##XUNITS=1/CM
##YUNITS=ARBITRARY UNITS
##XYDATA=(X++(Y..Y))
599.6H90414357j54376o54638n12004j57177L2187M43220N95033P6890k42353l92854
$$ 890414357 890259981 889605343 889093339 888936162 888968349 889411569 890006602 890083492 889841139 889448285
620H89448285m50075q4757Q0347k70963l71814J86086O63638M17233K0504j33396l53932
$$ 889448285 888998210 888913453 888993800 888722837 888351023 888537109 889200747 889617980 889638484 889505088 889151156
642.4H89151156m32909l78429m91441n15878m26233m38034m64380n09381n48244n79238
$$ 889151156 888718247 888339818 887848377 887332499 886906266 886468232 886003852 885494471 884946227 884366989
662.8H84366989n68569p73727j416803j393795j231015j339435j307309j157045j177907
$$ 884366989 883798420 883024693 881607890 880214095 878983080 877643645 876336336 875179291 874001384
681.1H74001384j333237j580894k223015k800882l064334l616869m320801m222631
$$ 874001384 872668147 871087253 868864238 866063356 862999022 859382153 855061352 850838721
697.5H50838721l067672j618207r28342j376152k407611l538310n097568p762432j0594488
$$ 850838721 847771049 846152842 845224500 843848348 841440737 837902427 832804859 825042427 814447939
715.8H14447939j1132955q392990k855897N585611J5227676K1712124K3513138K2823930
$$ 814447939 803314984 794921994 792066097 797651708 812879384 834591508 858104646 880928576
732.1H80928576K1101356J7964065J2738525O599248J933455n61416j693368k129912
$$ 880928576 902029932 919993997 932732522 939331770 941265225 940703809 939010441 936880529
748.4I36880529k232134k136410j995206j680791j181602r82345j314640j545071j159668
$$ 936880529 934648395 932511985 930516779 928835988 927654386 926672041 925357401 923812330 922652662
766.8I22652662p71702p24852q56042r48667r56416j075983j196802j286626j332283
$$ 922652662 921880960 921156108 920300066 919351399 918394983 917319000 916122198 914835572 913503289
785.2I13503289j284957j205444p19428N44608J679897J395464K39134m60983n98311
$$ 913503289 912218332 911012888 910293460 910838068 912517965 913913429 914152563 913691580 913093269
803.5I13093269n56052m24147l16679m19378n51224n10156o56724r81987r77456q71122
$$ 913093269 912537217 912113070 911796391 911377013 910825789 910315633 909658909 908676922 907699466 906828344
823.9I06828344r75490j044214j230418j599610j698375j407504j058221r95159j107991
$$ 906828344 905852854 904808640 903578222 901978612 900280237 898872733 897814512 896819353 895711362
842.3H95711362o77645N79059J827181K306580K015054J282990N23627o6876o54638
$$ 895711362 895033717 895612776 897439957 899746537 901761591 903044581 903568208 903501332 902846694
860.6I02846694j573384k945721m647136n790054l109813M139483R173274P908463
$$ 902846694 901273310 898327589 893680453 887890399 884780586 888920069 898093343 906001806
876.9I06001806M621327K572537J258671M27365M5538l59416o83904o65664m60565
$$ 906001806 910623133 913195670 914454341 914881706 914927244 914567828 913883924 913218260 912757695
895.3I12757695j21832K15649K62857J79112J84178J30832l1530k11001l02136l95596
$$ 912757695 912635863 912851512 913114369 913293481 913477659 913608491 913576961 913365960 913063824 912668228
915.7I12668228n67138p82609r94086j010955r25302q88109r53377j144170j244367
$$ 912668228 912101090 911318481 910324395 909313440 908388138 907500029 906546652 905402482 904158115
934I04158115j103580r43660r41933q69691p56144p80464r07302j085221j142383j054406
$$ 904158115 903054535 902110875 901168942 900299251 899543107 898762643 897855341 896770120 895627737 894573331
954.4H94573331r62675r59694j048744j009941o36280J1981Q69155J853943K389312
$$ 894573331 893610656 892650962 891602218 890592277 889955997 889967978 890837133 892691076 895080388
972.8H95080388K106070J333475L88503m16517r60469j320660j327813j082778r95338
$$ 895080388 897186458 898519933 898908436 898491919 897531450 896210790 894882977 893800199 892804861
991.1H92804861j227558j624763k049923k526164l029763l622949m370749m975796
$$ 892804861 891577303 889952540 887902617 885376453 882346690 878723741 874352992 869377196
1007.4H69377196n219162n106687l668487N75363O438077J0356188J1427760J1007130
$$ 869377196 864158034 859051347 855382860 855958223 862396300 872752488 884180248 895187378
1023.8H95187378Q054018K319634k482057l999173l585101k942204k415955j872361
$$ 895187378 903241396 905561030 903078973 899079800 895494699 892552495 890136540 888264179
1040.1H88264179j472115j311899j253247j144409j088619j326680j770676k174019
$$ 888264179 886792064 885480165 884226918 883082509 881993890 880667210 878896534 876722515
1056.4H76722515k346039k408982k678573l040373l406823l916025m275739m130185
$$ 876722515 874376476 871967494 869288921 866248548 862841725 858925700 854649961 850519776
1072.7H50519776l615260k995372k282142j477659p30693l6240M68671O40452R15766
$$ 850519776 846904516 843909144 841627002 840149343 839418650 839382410 839851081 840491533 841407299
1091.1H41407299J622915K624095L643274M487634N142033N457342N324840M687250
$$ 841407299 843030214 845654309 849297583 853785217 858927250 864384592 869709432 874396682
1107.4H74396682L530204K178967R24766K75910Q37803K270102L742636M936039N859256
$$ 874396682 877926886 880105853 881030619 881306529 882144332 884414434 888157070 893093109 898952365
1125.7H98952365O541848O944001O793022O119788N335629M381954L211022K214908
$$ 898952365 905494213 912438214 919231236 925351024 930686653 935068607 938279629 940494537
1142.1I40494537J398743O11424q4162o42419j040816j340091j636446j874983j914442
$$ 940494537 941893280 942504704 942420542 941778123 940737307 939397216 937760770 935885787 933971345
1160.4I33971345j921415k157926k477110k526402k143741j539171j040876p30812
$$ 933971345 932049930 929892004 927414894 924888492 922744751 921205580 920164704 919433892
1176.7I19433892o13451p95245j217068j625001k023220k486706k862096l176152l466547
$$ 919433892 918820441 918025196 916808128 915183127 913159907 910673201 907811105 904634953 901168406
1195.1I01168406l619254l583729l353238l081203k970159l009438l208816l641367
$$ 901168406 897549152 893965423 890612185 887530982 884560823 881551385 878342569 874701202
1211.4H74701202m104138m336595m212379l757537l346085l279686l413201l479421
$$ 874701202 870597064 866260469 862048090 858290553 854944468 851664782 848251581 844772160
1227.7H44772160l243685k563953j442850N7936J707435L177583M325270N208374N703985
$$ 844772160 841528475 838964522 837521672 837579608 839287043 842464626 846789896 851998270 857702255
1246.1H57702255N672336N348742M911363M228532L411591K985120L271043M036367
$$ 857702255 863374591 868723333 873634696 877863228 881274819 884259939 887530982 891567349
1262.4H91567349M763425N198657N334735N157471M811883M422486L918171L350436
$$ 891567349 896330774 901529431 906864166 912021637 916833520 921256006 925174177 928524613
1278.7I28524613K962232K897084K908408K809227K806008K920091K961338K949297
$$ 928524613 931486845 934383929 937292337 940101564 942907572 945827663 948789001 951738298
1295I51738298K833605K483785K063215J654267J221359R20117P31051M94599L00348
$$ 951738298 954571903 957055688 959118903 960773170 961994529 962914646 963645697 964140296 964440644
1313.4I64440644J89960l0518l28064n65529r41097j664698k738536m215300n912006
$$ 964440644 964630604 964600086 964272022 963706493 962765396 961100698 958362162 954146862 948234856
1331.7I48234856o890476o056368k948761J839757N820930P145464O322742M305541
$$ 948234856 941344380 935288012 932339251 934179008 939999938 947145402 953468144 957773685
1348I57773685K278030R22919J22249m47095q85963j311660j682520j596629j252830
$$ 957773685 960051715 960974634 961096883 960649788 959763825 958452165 956769645 955173016 953920186
1366.4I53920186r78888n79893j69993J46807K95579J95980N365j77086k64048j43946
$$ 953920186 952941298 952361405 952191412 952338219 952633798 952829778 952835143 952658057 952394009 952250063
1386.8I52250063K206k75374q53061j419723j865030k434373k914309l182829l083407
$$ 952250063 952252269 951976895 951123834 949704111 947839081 945404708 942490399 939307570 936224163
1405.1I36224163j325250J995444N375207O672322N323649L265440J669586M05788
$$ 936224163 934898913 936894357 942269564 948941886 954265535 957530975 959200561 959606349
1421.5I59606349l95238p79033j003444j296699j340091j130164j074672q15868l59416
$$ 959606349 959211111 958432078 957428634 956131935 954791844 953661680 952587008 951771140 951411724
1439.8I51411724k91109l48568m22716n85497n16772k56955r1315J89364P63536O30915
$$ 951411724 951120615 950772047 950349331 949763834 949247062 948990107 948898792 949088156 949851692 950482607
1460.2I50482607J74224p8797k24412k82943r715J050353J950979J669645J145363
$$ 950482607 950656831 950578034 950353622 950070679 950060964 951111317 953062296 954731941 955877304
1478.6I55877304O73950L38018L5643l85582o18637l89755l12507o96420j329959j919389
$$ 955877304 956551254 956889272 956924915 956539333 955920696 955530941 955218434 954522014 953192055 951272666
1499I51272666k120554j629949j96576K673447L174961J371861K85506l44515n56111
$$ 951272666 949152112 947522163 947325587 949999034 953173995 954545856 954831362 954486847 953930736
1517.3I53930736n01991m10437j42455J6629J2338o1571l12090m37021k22981k07365
$$ 953930736 953428745 953018308 952875853 952892482 952904820 952843249 952531159 952094138 951871157 951663792
1537.7I51663792n47171n86628j44959J12474n007j93536j46806j53959l00288n15580
$$ 951663792 951116621 950529993 950385034 950497508 950492501 950298965 950152159 949998200 949697912 949182332
1558.1I49182332l13342l4452k12073l60310n27143p62761o79374n54859l95179K71082
$$ 949182332 948868990 948834538 948622465 948262155 947735012 946972251 946292877 945738018 945342839 945613921
1578.5I45613921P39813P06017L71038N5731j34885l01838m78447n18501l91364l52859
$$ 945613921 946353734 947059751 947430789 947486520 947351635 947049797 946571350 946052849 945661485 945308626
1598.9I45308626m62473n29527m77195m59850m46916m05609l79503k83182o1094k9266
$$ 945308626 944846153 944316626 943839431 943379581 942932665 942527056 942147553 941864371 941803277 941774011
1619.3I41774011l17812n88417n96941n30422m97102l77834m38333p70867p66992n27680
$$ 941774011 941456199 940867782 940270841 939740419 939243317 938865483 938427150 937656283 936889291 936361611
1639.7I36361611n72741p37131q71539p86185n52833r14932j400470p75934o24716
$$ 936361611 935788870 935051739 934180200 933394015 932841182 931926250 930525780 929749846 929125130
1658I29125130r20474j198769j334727j319885j383305j466751j240551j366735j667916
$$ 929125130 928204656 927005887 925671160 924351275 922967970 921501219 920260668 918893933 917226017
1676.4I17226017j652062j592100j652598k091468k305686k578497l134132l333389
$$ 917226017 915573955 913981855 912329257 910237789 907932103 905353606 902219474 898886085
1692.7H98886085m076958m948855n015611n943060m938483l800929l387988j881718
$$ 898886085 894809127 889860272 884844661 878901601 873963118 870162189 866774201 864892483
1709H64892483j90735J723051M227042P905483R256661P075012O385088O593764O258726
$$ 864892483 864701748 866424799 870651841 878557324 887813985 894888997 901274085 907867849 914126575
1727.4I14126575O001055N855620P125080P751226N752862N551815N695462M768968
$$ 914126575 920127630 925983250 933108330 940859556 946612418 952164233 957859695 962628663
1743.7I62628663M079759L392875K898276K511084J604020P23184K99811K5988k48313
$$ 962628663 966708422 970101297 972999573 975510657 977114677 977837861 978137672 978163660 977915347
1762I77915347l25621n11348o65068n86510n86927n30005l64363m05729n21063m55499
$$ 977915347 977589726 977078378 976413310 975826800 975239873 974709868 974345505 973939776 973418713 972963214
1782.4I72963214l59833k89142l63231n91278n41210j99080j68800l71933m42982k70069
$$ 972963214 972603381 972314239 971951008 971359730 970818520 970619440 970450640 970078707 969635725 969365656
1802.8I69365656j64032k56657l24547k52665j11878j15573j80423j48475j55807k62380
$$ 969365656 969201624 968944967 968620420 968367755 968255877 968140304 967959881 967811406 967655599 967393219
1823.2I67393219k55048j55747j38819j4961K9981j16884j71542j47820k18689k04742
$$ 967393219 967138171 966982424 966843605 966828644 966858625 966741741 966570199 966422379 966203690 965998948
1843.6I65998948m7386j4424l6776n8115j13964j54138j54972j64389j28270r1433
$$ 965998948 965951562 965937138 965900362 965842247 965728283 965574145 965419173 965254784 965126514 965035081
1864I65035081k20895l24845q8573Q3566m8339j18733n7697o9082k07186k73227j86146
$$ 965035081 964814186 964489341 964400768 964484334 964435995 964317262 964259565 964190483 963983297 963710070 963523924
1886.4I63523924j44183j35601l2484J2815q7440j54198j21355q7261r3937j32501
$$ 963523924 963379741 963244140 963211656 963224471 963137031 962982833 962861478 962774217 962680280 962547779
1906.8I62547779j40309o7890m0173q8931j26481j11937j00851j04964n4300q7380
$$ 962547779 962407470 962339580 962299407 962210476 962083995 961972058 961871207 961766243 961711943 961624563
1927.2I61624563j47760j07944r0182j41084j82152j70767j93477j75476n1200L2782
$$ 961624563 961476803 961368859 961278677 961137593 960955441 960784674 960591197 960415721 960364521 960397303
1947.6I60397303M1485l6299j38402j21415k6047J0848N4538R0838L3795Q6725J94729
$$ 960397303 960438788 960402489 960264087 960142672 960116625 960127473 960182011 960272849 960306644 960393369 960588098
1970.1I60588098J23560K1279j9968k1696k1279r6857j49667j16230p1764m8697l1113
$$ 960588098 960711658 960732937 960712969 960691273 960669994 960573137 960423470 960307240 960235476 960186779 960155666
1992.5I60155666m2439n4359J8716O0081j0133l5345K861J8239k3365j19209j10925
$$ 960155666 960113227 960058868 960077584 960137665 960127532 960092187 960095048 960113287 960089922 959970713 959859788
2014.9I59859788j0490j0788l1949j2517J0610P093n5730q5295q5175p3075j2815l5226
$$ 959859788 959849298 959838510 959806561 959794044 959804654 959811747 959756017 959670722 959585547 959512472 959499657 959464431
2039.4I59464431j34826j14262J4603O7711M172m3749m1008p3433j17541j16884j05918
$$ 959464431 959329605 959215343 959229946 959297657 959301829 959258080 959217072 959143639 959026098 958909214 958803296
2061.8I58803296m8757M5836k4318j53005j08421k8193k504L0458L0280K1994J9431
$$ 958803296 958754539 958800375 958776057 958623052 958514631 958486438 958483934 958514392 958544672 958566666 958586097
2084.3I58586097n3227p7963o795k7239j16349j09314j3471M2975K2471J549j0967
$$ 958586097 958532870 958454907 958448112 958420873 958304524 958195210 958181739 958224714 958247185 958248734 958237767
2106.7I58237767n1200o3956j7226K2352R477j7941j5199R894J2517l695J9014R715
$$ 958237767 958186567 958122611 958105385 958127737 958137214 958119273 958104074 958113968 958126485 958122790 958141804 958151519
2131.2I58151519n1617m1485J907J6093L7313N9664O4314J6093n0783q1182o9856j6869
$$ 958151519 958099902 958058417 958060324 958076417 958113730 958173394 958237708 958253801 958203018 958121836 958051980 958035111
2155.6I58035111N007j6570j0848O676p510K6166M2319n9724q2194l9697n6326j7107
$$ 958035111 958040118 958023548 958012700 958019376 958011866 958038032 958080351 958020627 957938433 957898736 957842410 957825303
2180.1I57825303Q7798J15037k7955j56104o7115J2994J192M9173K7776o4909r0957
$$ 957825303 957913101 958028138 958000183 957844079 957776964 957789958 957791150 957840323 957868099 957803190 957712233
2202.5I57712233j19805j38641p4327J2100R6440J41442Q3089j0312p0691r4890q2851
$$ 957712233 957592428 957453787 957379460 957391560 957488000 957629442 957712531 957702219 957631528 957536638 957453787
2225I57453787p9631r6798m9532M530k0981m8876k9325K1398L7909L516k2113P272
$$ 957453787 957374156 957277358 957227826 957232356 957211375 957162499 957133174 957154572 957192481 957195997 957173884 957181156
2249.4I57181156K6583j8477l1173k9207m6730l6656n544j3292r4533j03533k6941
$$ 957181156 957207739 957189262 957158089 957128882 957082152 957045496 957039952 957026660 956932127 956828594 956801653
2271.9I56801653%N543j4126m8936j1682M3332J2637l8684j7464J4365L3438J3709
$$ 956801653 956801653 956807196 956793070 956744134 956732452 956775784 956788421 956749737 956732273 956746638 956780076 956793785
2296.4I56793785l3080l4035q3565j21773P391Q0765l4214m7922L6121J6212m8756
$$ 956793785 956760705 956726670 956643105 956521332 956528723 956609488 956575274 956527352 956563473 956579685 956530929
2318.8I56530929p5579J9729J46091K35677L36706K70904k2591k59041k16425o6280
$$ 956530929 956455350 956475079 956621170 956856847 957193553 957464457 957441866 957182825 956966400 956900120
2339.2I56900120o3658j40607m4346Q6367M0889m1843K2412K36630K67804J98960J81139
$$ 956900120 956836462 956695855 956651509 956737876 956778765 956736922 956759334 956995964 957263768 957462728 957643867
2361.6I57643867q4281m46856n31376k89917j5557N3466o3718j75237r3758L8921P1466
$$ 957643867 957559586 957112730 956581354 956291437 956275880 956329346 956265628 956090391 955996633 956035554 956107020
2384I56107020R6679R6738p271n6923N7280R7454n126l3915j6093k2233k563M0412
$$ 956107020 956203699 956300437 956293166 956236243 956293523 956390977 956385851 956351936 956335843 956313610 956311047 956351459
2408.5I56351459N0068k4557n9724j0967J9669N0068N5194M4823P4029M2259o6995
$$ 956351459 956401527 956376970 956317246 956306279 956325948 956376016 956431210 956476033 956550062 956592321 956525326
2430.9I56525326j29342p5639L4690O1453j6988k2709L8445k2531q9407n0544k3783
$$ 956525326 956395984 956320345 956355035 956416488 956399500 956376791 956415236 956392705 956303298 956252754 956228971
2453.4I56228971k9087J8478J01209R1195p451r2268j21534r2089K9266J59025M8101
$$ 956228971 956199884 956218362 956319571 956410766 956403315 956311047 956189513 956097424 956126690 956285715 956333816
2475.8I56333816j50740j09017k0683q106L4094L278m8160j5080J728m3631o9558l5167
$$ 956333816 956183076 956074059 956053376 956045270 956079364 956082642 956034482 956019402 956021130 955977499 955907941 955872774
2500.3I55872774j2874J1444L7670o676l6836N901M1187N722k9385l934n0783j18435
$$ 955872774 955859900 955871344 955909014 955902338 955865502 955871403 955912590 955918312 955888927 955884993 955834210 955715775
2524.8I55715775l6001J5259o9976m6134O2704Q94j02818k6464M3869R596L7134P2956
$$ 955715775 955679774 955695033 955625057 955578923 955641627 955642521 955539703 955513239 955557108 955566704 955603838 955676794
2549.2I55676794K3425j7286n8353j17719m6432K8968l2306j3172O5565N0306J9372
$$ 955676794 955700219 955682933 955624580 955506861 955460429 955489397 955457091 955443919 955509484 955559790 955579162
2571.7I55579162J8656%o6757r6023J2755P2896j9729l1948L2544L7492J7762J2875
$$ 955579162 955597818 955597818 955531061 955435038 955447793 955520689 955500960 955469012 955501556 955539048 955556810 955569685
2596.1I55569685J8596k563l3438o4194j19567j12057R000J04964O3300j8954k2292
$$ 955569685 955588281 955585718 955552280 955488086 955368519 955256462 955265462 955370426 955433726 955414772 955392480
2618.6I55392480l4452q1598n4479l159J0848J1563K6644M0829M2438O7592Q2195L5703
$$ 955392480 955358028 955276430 955221951 955218792 955229640 955241203 955267847 955308676 955351114 955418706 955500901 955536604
2643I55536604n2869q5712k9981j7285o6758l6954M0233O9737K2769p5102o2406J2815
$$ 955536604 955483735 955398023 955368042 955350757 955283999 955247045 955287278 955357015 955379784 955304682 955242276 955255091
2667.5I55255091J0967K0743l159j06156p3433K1100j9967j6332M3928Q35l7193n186
$$ 955255091 955266058 955286801 955283642 955177486 955104053 955125153 955105186 955088854 955132782 955133617 955096424 955091238
2692I55091238j2994p0810r894O9499l1174p8022l755K6464L5286k0206p7009j7524
$$ 955091238 955078244 955007434 954997540 955067039 955035865 954957843 954954088 954980552 955015838 954995632 954918623 954901099
2716.4I54901099j609j02282j30236m589R3698K6822n3227m7207l2782k384L2484N7995
$$ 954901099 954899490 954797208 954666972 954662383 954756081 954782903 954729676 954682469 954649687 954647303 954679787 954737782
2740.9I54737782N5552j7107r5248q5890P987K8431n6505q9824n3406o7174j11640
$$ 954737782 954793334 954776227 954680979 954595089 954603076 954631507 954575002 954485178 954431772 954364598 954252958
2763.4I54252958p5280O258P1287O9678k2292q4043n8531j4723k7716o1393l5524j5676
$$ 954252958 954177678 954183936 954255223 954324901 954302609 954218566 954160035 954145312 954117596 954056203 954020679 954005003
2787.8I54005003n9605j15811j01328m1068m0770j3411J08481J08480q2910k16663
$$ 954005003 953945398 953829587 953728259 953687191 953646421 953633010 953741491 953849971 953767061 953550398
2808.2I53550398j67727q2731q6069p2957k9146q2910j87517k71141l00765k32637
$$ 953550398 953382671 953299940 953213871 953140914 953111768 953028858 952841341 952570200 952269435 952036798
2828.6I52036798j47998j59502k31088l16798m73261p16567r55880j107693j083314
$$ 952036798 951888800 951729298 951498210 951181412 950708151 949991584 949035704 947928011 946844697
2847I46844697p26044j74344K81871O05940P54774O93262N17308L52919K35975Q1301
$$ 946844697 946118653 945944309 946226180 946832120 947586894 948280156 948797464 949150383 949386358 949467659
2867.4I49467659j7047P5877J51038J22726J43289J42038N1797n3227j29819k09987
$$ 949467659 949450612 949526489 949677527 949800253 949943542 950085580 950137377 950084150 949954331 949744344
2887.8I49744344l28243m07279m33981m17531l95298m67956n19812m72188m04954l95894
$$ 949744344 949416101 949008822 948574841 948157310 947762012 947294056 946774244 946302056 945897102 945501208
2908.1I45501208n63442q17657r11415p29024l43382k0564J19805L32833O25849P38799
$$ 945501208 944937766 944120109 943208694 942479670 942136288 942115724 942235529 942568362 943194211 943933010
2928.5I43933010P91073Q90672Q72195P03037N32865M97461M20212K09689M8042j29879
$$ 943933010 944724083 945614755 946486950 947189987 947722852 948220313 948640525 948850214 948898256 948768377
2948.9I48768377l17454k92182j3411L01301M36902M30942M09961M53412N59748O85155
$$ 948768377 948450923 948158741 948145330 948446631 948883533 949314475 949724436 950177848 950737596 951422751
2969.3I51422751P62880P36058O17981M95731M65393M43817L16679K21729K74063K35140
$$ 951422751 952185631 952921689 953539670 954035401 954500794 954944611 955261290 955483019 955757082 955992222
2989.7I55992222O6340j8776m6134O020J31309J38402L3081k6822r477Q0585J65463
$$ 955992222 956058562 956039786 955993652 955999672 956130981 956269383 956302464 956275642 956266165 956346750 956512213
3012.1I56512213J24275Q5533Q9586k086n6446k9802p1585o1155M3333O4730m17k8252
$$ 956512213 956636488 956722021 956811607 956809521 956753075 956723273 956651688 956590533 956633866 956698596 956698179 956669927
3036.6I56669927J669m1962j23859j22427j32025j72376j67311q3446P8499J43111
$$ 956669927 956671596 956629634 956505775 956383348 956251323 956078947 955911636 955828190 955906689 956049800
3057I56049800N8710P570J2577p15k1279n0783r2745m2558R8288J52826J06574K9623
$$ 956049800 956108510 956116080 956128657 956127942 956106663 956055880 955963135 955920577 956018865 956171691 956278265 956307888
3081.5I56307888r656K2709j6570j02877q8096k8372N663M5538P5698L8027l4690o3777
$$ 956307888 956298232 956320941 956304371 956201494 956113398 956085026 956090689 956136227 956211925 956249952 956215262 956151485
3106I56151485L100N6445k0504r3281q4579p808Q4162O7949K9922P8916P0870n3644
$$ 956151485 956154585 956211030 956190526 956097245 956012666 956004858 956089020 956156969 956186891 956265807 956336677 956283033
3130.4I56283033r6083m1783o7055j03831m0472P7367J10149k7656j11282l8266k9028
$$ 956283033 956186950 956145167 956078112 955974281 955933809 956011176 956121325 956093669 955982387 955944121 955915093
3152.9I55915093p2479m1365j2398m8757r8467j08599p7546J311O8128L8743j1980
$$ 955915093 955842614 955801249 955788851 955740094 955641627 955533028 955455482 955456793 955524921 955563664 955551684
3175.3I55551684n37R954K0743M2081j5617p0393k9087Q3924J26421k3603j74582j94192
$$ 955551684 955551147 955561101 955581844 955623925 955608308 955537915 955508828 955592752 955719173 955695570 955520988 955326796
3199.8I55326796j15157K4319Q7559L6836P987K1577k2531j32858k04742n8473K00809
$$ 955326796 955211639 955235958 955323517 955360353 955368340 955389917 955367386 955234528 955029786 954971313 955172122
3222.2I55172122J60813q0407r2387r656o795K9385K8193j7404J1265N2631K6464n2154
$$ 955172122 955332935 955252528 955160141 955150485 955143690 955173075 955201268 955183864 955195129 955247760 955274224 955222070
3246.7I55222070j25408j6332J16945M8995j0848m1962j00076j05620p5400j3411N5135
$$ 955222070 955096662 955080330 955197275 955246270 955235422 955193460 955093384 954987764 954912364 954898953 954954088
3269.1I54954088P8797N2095l8326j00136p9274l7968N7876J26898M9770p0810k5571
$$ 954954088 955032885 955084980 955046654 954946518 954867244 954829276 954887152 955014050 955063820 954993010 954967439
3291.5I54967439P1705R894j5676N0902O8069K4676k7239l9280J1027J9968j01090
$$ 954967439 955039144 955049038 955033362 955084264 955152333 955177009 955149770 955110490 955121517 955141485 955040395
3314I55040395j45912n7161J9908N5492R120k1696N2630Q5891R3579J11043O2109o974
$$ 955040395 954894483 954837322 954857230 954912722 954921842 954900146 954952776 955038667 955132246 955243289 955305398 955298424
3338.4I55298424m8459n066P5340R5725N0426n4896j23859p6770N7458J44422P6712
$$ 955298424 955249965 955244899 955320239 955415964 955466390 955411494 955287635 955210865 955268323 955412745 955489457
3360.9I55489457q2672j66535j14322K026J25587J14084J9371M232K3127J10566J66953
$$ 955489457 955406785 955240250 955125928 955127954 955253541 955367625 955386996 955391228 955414355 955524921 955691874
3383.3I55691874J07944K2829o5923k9385M9650J2279N6446J24514K1219k146J8001
$$ 955691874 955799818 955822647 955756724 955727339 955776989 955789268 955845714 955970228 955991447 955989301 956007302
3405.7I56007302j38045k16960j40191n2213L1590Q5175P4506L9756O497J5974N4777
$$ 956007302 955869257 955652297 955512106 955459893 955491483 955576658 955651164 955690920 955697417 955713391 955768168
3428.2I55768168l0696j22011J3590K55584L09051J40905J7047J5676N9664J30355
$$ 955768168 955737472 955615461 955629051 955884635 956193686 956334591 956351638 956367314 956426978 956557333
3448.6I56557333J56224Q4102l2365r6500o6757L9875J56701J35660j0669O139J85907
$$ 956557333 956713557 956797659 956765294 956668794 956602037 956641912 956798613 956934273 956923604 956929743 957115650
3471I57115650J55926m1664j03473j11640o0201O3062Q35q4401k4557J5736N0068J22726
$$ 957115650 957271576 957229912 957126439 957014799 956954598 957017660 957018495 956934094 956909537 956925273 956975341 957098067
3495.5I57098067J12593M1485P1943P3969n4121q6546J01388K63035O6042j50144l0399
$$ 957098067 957210660 957252145 957324088 957398057 957343936 957257390 957358778 957621813 957687855 957537711 957507312
3517.9I57507312M8340j00732j58131m0651Q0705J35720O3062j967J18911J82628k8848
$$ 957507312 957555652 957454920 957296789 957256138 957336843 957472563 957535625 957533658 957652569 957835197 957806349
3540.3I57806349k36750j77920P0870K36213J69754R6798R5368k3306j20818k7299
$$ 957806349 957569599 957391679 957462549 957698762 957868516 957965314 958060682 958037376 957916558 957889259
3560.7I57889259k6465k39849q9109N55635O24955J69754l0578P511l6419j728N5134
$$ 957889259 957862794 957622945 957533836 958089471 958714426 958884180 958853602 958861113 958824694 958822966 958878100
3583.2I58878100j82927m19318j9789K96831J12414L9637J29879L3438p7963J1385
$$ 958878100 958695173 958275855 958256066 958552897 958665311 958704948 958834827 958868265 958790302 958801687
3603.5I58801687J0431r6500L2544J44422J9431j39058j20282K44260M17232Q8752
$$ 958801687 958812118 958715618 958748162 958892584 958912015 958772957 958652675 958896935 959314167 959402919
3623.9I59402919k64824l52501N1200M39644L75986J67489P1287m6194k22146j84476
$$ 959402919 959138095 958785594 958836794 959276438 959652424 959819913 959891200 959845006 959622860 959438384
3644.3I59438384r4653j63197o4254J49965J77563J95801K23696J13309N6386N2392
$$ 959438384 959343731 959180534 959116280 959266245 959443808 959639609 959863305 959976614 960033000 960085392
3664.7I60085392r5725j84834j03712j03653j8179L46959L18944K027p1407p2658j28925
$$ 960085392 959989667 959804833 959701121 959597468 959579289 959926248 960245192 960247219 960175812 960103154 959974229
3687.2I59974229N0962J87993O1930K2888N4359N9784k4915j29104l1829J13726j2457
$$ 959974229 960025191 960213184 960275114 960298002 960352361 960412145 960387230 960258126 960226297 960340023 960327566
3709.6I60327566k36392r4235K086q6367p212Q1837o9320j8776K50399K27154p9453
$$ 960327566 960091174 959996939 959999025 959912658 959905446 959987283 959917963 959899187 960149586 960376740 960297287
3732I60297287l52383j54257J52886o5446k78115J32441M33266p391k66551j2279K11954
$$ 960297287 959944904 959790647 959943533 959878087 959599972 959732413 960165679 960158288 959891737 959879458 960091412
3754.5I60091412J79112N0724n1141l7074O0558R9778l5286o2287J49906J66059k3842
$$ 960091412 960270524 960321248 960270107 960233033 960293591 960393369 960358083 960295796 960445702 960611761 960587919
3776.9I60587919j30594j08004j1146N2095P7665K06589K28763q7261k71499K9206
$$ 960587919 960457325 960349321 960338175 960390270 960467935 960674524 960903287 960816026 960544527 960573733
3797.3I60573733J88589q6963j80960k8133P3135Q0823k5212j53840k22206p5340J32858
$$ 960573733 960762322 960675359 960494399 960466266 960539401 960620224 960595012 960441172 960218966 960143626 960276484
3819.7I60276484J75119R9182L0041L397K5690O7174M3512j11163l04103j90317Q2194
$$ 960276484 960451603 960550785 960580826 960584223 960609913 960677087 960720599 960609436 960305333 960115016 960197210
3842.1I60197210J69337J62542P8320p0035j16825R894k1696j41918r716K20537J79470
$$ 960197210 960366547 960529089 960607409 960537374 960420549 960430443 960408747 960266829 960257113 960477650 960657120
3864.6I60657120M9412K8849m471j43289j71781n3525j24156j90556m053K32040L07620
$$ 960657120 960706532 960735381 960730910 960587621 960415840 960362315 960238159 960047603 960043550 960275590 960583210
3887I60583210J00136r6202n3287N3883M113j28746j83821p3254J57773L18110K31922
$$ 960583210 960683346 960587144 960533857 960587740 960591853 960463107 960279286 960206032 960363805 960681915 960913837
3909.4I60913837O4492J4425j8955M6015P9036q5712q5652Q345q8930j34885m9532
$$ 960913837 960978329 960992754 960973799 961019814 961098850 961013138 960927486 960935831 960846901 960712016 960662484
3931.9I60662484L3796J29640R1434o3837m5657J11878N4955q8751r3341j12533n5671
$$ 960662484 960696280 960825920 960917354 960853517 960807860 960919738 960974693 960885942 960792601 960680068 960624397
3954.3I60624397J16229J74224J40846J27077J4246j27674m3928J46866J33812m6730
$$ 960624397 960740626 960914850 961055696 961182773 961197019 961069345 961025417 961172283 961306095 961259365
3974.7I61259365j47581q2314J7524O2704J17123O8009n4717p4625r1315M2737K97248
$$ 961259365 961111784 961029470 961046994 961109698 961226821 961294830 961240113 961165488 961074173 961116910 961414158
3997.1I61414158
$$ 961414158
##END=$$ End of the data block
