##TITLE=T008 Face cor mostarda $$ Begin of the data block
##JCAMP-DX=5.00 $$ ACD/SpecManager v 10.08
##SPECTROMETER/DATA SYSTEM=Alpha
##DATE=20 Nov 2014 09:22:14
##DATA TYPE=INFRARED SPECTRUM
##DATA CLASS=XYDATA
##ORIGIN=
##OWNER=
##NPOINTS=1667
##FIRSTX=599.57470703
##LASTX=3997.16503906
##MAXX=3997.16503906
##MINX=599.57470703
##MAXY=0.97615880
##MINY=0.44932669
##XFACTOR=1.0000000000
##YFACTOR=1.000000000000000e-9
##FIRSTY=0.57870370
##DELTAX=2.03937006
##XUNITS=1/CM
##YUNITS=ARBITRARY UNITS
##XYDATA=(X++(Y..Y))
599.6E78703701l135383k341866L66092L147900M655659N410790N492211M588008L689408
617.9F00576520K987564J926720J028239P07567P11262R81272R85205P41362J266420
636.3F11912131K147973K371609J776815J236796J143575J061678J083016J016974
652.6F23750567O75619M65870Q14736J265585J123846Q54254J243531J724124J261533
671F33179665J224279J482725J452685J275956J077831J075327J280964J163721Q37803
689.3F44050956M12643o31094j741529j226008J862586N791426Q021891P905125O179989
707.7F70625985M251837L798962M447579L525615Q41737j335859j906395j382828p72178
726F82094455j92583J145661L122270M151762L500580K063275O86765n13196j708985
$$ y = [578703701, 575568318, 573226452, 573592544, 576740444, 581396103, 586806893, 592299104, 596887112, 600576520, 603564084, 605490804, 606519043, 607226610, 607937872, 608919144, 609904349, 610645711, 611912131, 614060104, 616431713, 618208528, 619445324, 620588899, 621650577, 622733593, 623750567, 624426186, 624892056, 625706792, 626972377, 628096223, 628950477, 630194008, 631918132, 633179665, 634403944, 635886669, 637339354, 638615310, 639693141, 640768468, 642049432, 643213153, 644050956, 644463599, 643832505, 642090976, 640864968, 642727554, 648518980, 656540871, 664445996, 670625985, 674877822, 678676784, 683124363, 686649978, 687491715, 686155856, 684249461, 682866633, 682094455, 681901872, 683047533, 686169803, 690321565, 693822145, 695885420, 696572185, 696058989, 694350004]
744.4F94350004l000200m223823m999221m894793l875672k734542k915502m999101
760.7F62707150p637382q206486m921735R49681N471647N287647K545953L103733P900417
779F67200625J2226283J2450040Q943379L954530o56009l753781n098939n268813m761457
797.4F85235858l978610l462195l585577m549623o365716q421898r472251p711590
813.7F37688398j918435N811155J1172593J2039900R573996O143987L732204L107429
830F87351227L570497L999233L636897K473950J266122M18723l8863M31538J869321
848.4G04978645L258645L787041L290832K323032J636207J428067J816571K708852
864.7G25227892K883196J255632L84927L740072Q818388J0783970Q933067N387009
$$ y = [694350004, 691349804, 687125981, 682126760, 677231967, 673356295, 670621753, 667706251, 662707150, 655069768, 646863282, 641941547, 642891228, 648362875, 653650522, 656196475, 659300208, 667200625, 679426908, 691876948, 700820327, 704774857, 704118848, 700365067, 695266128, 689997315, 685235858, 681257248, 677795053, 674209476, 669659853, 663294137, 654872239, 645399988, 637688398, 635769963, 641581118, 652753711, 664793611, 674367607, 680511594, 684243798, 687351227, 690921724, 694920957, 698557854, 701031804, 702297926, 702716649, 702677786, 703109324, 704978645, 708237290, 712024331, 715315163, 717638195, 719274402, 720702469, 722519040, 725227892, 728111088, 729366720, 729751647, 733491719, 742310107, 753094077, 762027144, 767414153]
881G67414153K527058J124501J59144q36968j263142j131653j057864j151442j310230
899.4G64473557j592814j934469k160907k082407j454711l57151O97553J448214K103388
917.7G59140253K492130K185166J230716q3625j440525k562761l284216l689230l894925
936.1G50092983l896773l684461l268301k899230k832770l055036l209114k891898
952.4G24355400k247513j817047j756251j833916k058804k367198k527714k653003
968.7G07093954k914965l393471m031718m503846m734636m892468n121231n392850
985F72108769n490303n407869n368412n443454n341172n159378n546093o610334p874131
1003.4F19867623r177089j0699868j2332440j3842821j5003442j3904095p977128j47224
$$ y = [767414153, 769941211, 771065712, 771224856, 770387888, 769124746, 767993093, 766935229, 765783787, 764473557, 762880743, 760946274, 758785367, 756702960, 755248249, 754891098, 755588651, 757036865, 759140253, 761632383, 763817549, 765048265, 764964640, 763524115, 760961354, 757677138, 753987908, 750092983, 746196210, 742511749, 739243448, 736344218, 733511448, 730456412, 727247298, 724355400, 722107887, 720290840, 718534589, 716700673, 714641869, 712274671, 709746957, 707093954, 704178989, 700785518, 696753800, 692249954, 687515318, 682622850, 677501619, 672108769, 666618466, 661210597, 655842185, 650398731, 645057559, 639898181, 634352088, 627741754, 619867623, 610690534, 599990666, 587658226, 573815405, 558811963, 544907868, 536930740, 536783516]
1019.7E36783516L119052O78062l561377o319821p152081p084250o794572o459236
1036E03209293o122679n708187n223364m771084m269629l825486l833860m296094m741520
1054.4D60417390m729390l882766k269596k08944K619356O860524J1728943J4064401
1070.7D84599918J1590451O412625K432526J078367J475274K300144K737999K596855
1087E15224159J930773J177430Q91328J193702K017796L121555L973007M322589M319012
1105.3E38171351M095674L680229L379464L623128M153311M349589M152358L906548
1121.7E69511652L852248L966749L905713L473223K856612K488017K664924L149569
1138E95868707L665924M159510M428089M145920L376722K350927J170516J67548m36485
$$ y = [536783516, 539902568, 540580630, 537019253, 530699432, 523547351, 516463101, 509668529, 503209293, 497086614, 491378427, 486155063, 481383979, 477114350, 473288864, 469455004, 465158910, 460417390, 455688000, 451805234, 449535638, 449326694, 451946050, 458806574, 470535517, 484599918, 496190369, 502602994, 505035520, 506113887, 507589161, 509889305, 512627304, 515224159, 517154932, 518332362, 519223690, 520417392, 522435188, 525556743, 529529750, 533852339, 538171351, 542267025, 545947254, 549326718, 552949846, 557103157, 561452746, 565605104, 569511652, 573363900, 577330649, 581236362, 584709585, 587566197, 590054214, 592719138, 595868707, 599534631, 603694141, 608122230, 612268150, 615644872, 617995799, 619166315, 619333863, 618897378]
1156.3F18897378p68303p30157k38777M09306J130878J824558K244592K442718K418041
1174.7F27630234K004027J444817J370609J867294K177775J397073m60207k613962
1191F34817660m574180o383419q092046q719503o971896l216624J91330N85318k380788
1209.4E95255852o106675p635713o137788k855539O14345L312766M991949O048262
1225.7E87487459O914854P978380R400129J0754109J1368692J0938644R970963R284079
1242F64097309R154022R241998R159029Q840739Q431852P959604P611812P856607Q938193
1260.3G41291165J0476232J1537015J1284829R585797P242084N298257M211426L732502
1276.7H04659307L283978K572715J882612J343430P90059K12133n76973j850128l717601
$$ y = [618897378, 618129075, 617398918, 617160141, 617569447, 618700325, 620524883, 622769475, 625212193, 627630234, 629634261, 631079078, 632449687, 634316981, 636494756, 637891829, 637431622, 634817660, 630243480, 623860061, 615768015, 607048512, 600076616, 596859992, 597051322, 597636640, 595255852, 589149177, 581513464, 575375676, 572520137, 573134482, 576447248, 581439197, 587487459, 594402313, 602380693, 611780822, 622534931, 633903623, 644842267, 654813230, 664097309, 673251331, 682493329, 691652358, 700493097, 708924949, 716884553, 724496365, 732352972, 741291165, 751767397, 763304412, 774589241, 784175038, 791417122, 796715379, 800926805, 804659307, 807943285, 810516000, 812398612, 813742042, 814532101, 814744234, 814167261, 812317133, 808599532]
1295H08599532o258548r083926j1168897j1649907j0110200o461203j419544L258646
1311.3G55705953N769014O207645P510126J1584043J5996695J7733454J6106248J1827648
1327.6H48440826O694674K453447j74701j317978j498163j229942q45790o86884r96232
1346H50839257j610338k117396k227902j894057j394928j172900j690328k859175l400028
1364.3H32472205k738356k071739j872837j887202j577855m58419R60231K014518K382636
1382.7H27223182K542734L186524L569364K656877J178384m64320j817524k611340
1399H35463881l588914o246090j2281180j9409954k3710549k1249235q379757Q385539
1415.3G48983741K2141814K9438198K1191418R828329L295064j582205n137206o594538
$$ y = [808599532, 802340984, 793257058, 782088161, 770438254, 760328054, 753866851, 752447307, 755705953, 761474967, 767682612, 775192738, 786776781, 802773476, 820506930, 836613178, 848440826, 855135500, 857588947, 857414246, 856096268, 854598105, 853368163, 852522373, 851835489, 850839257, 849228919, 847111523, 844883621, 842989564, 841594636, 840421736, 838731408, 835872233, 832472205, 829733849, 827662110, 825789273, 823902071, 822324216, 821865797, 822826028, 824840546, 827223182, 829765916, 832952440, 836521804, 839178681, 840357065, 839892745, 838075221, 835463881, 831874967, 825628877, 813347697, 793937743, 770227194, 748977959, 740598202, 748983741, 771125555, 800563753, 821755171, 831583500, 834878564, 833296359, 828159153, 821564615]
1431.6H21564615n629957m395485k886295r22680q7261l43800j016259j878381k815783
1450H01588714l189862k812862j850128n603K036393L528535N761683P907748Q222521
1468.4H21187139Q505582R196580P736265N709887N375445N244017M461288K950609
1484.7H70366812J609444M63665j328230k624452l674150n546212p621705q578956
1501H43066216q871973j2338638k3832977k4702728j7932177j4607489j0268628p592976
1517.3G22918630q511067j3413727j4987588j1656821q957982n002975m91798M803896
1533.6F64700568P660150R760916J8934608K4972081J9958496J7787934J6711652J7721116
1549.9G98207521J8352032J7592192J5532255J5936375J6251146P411242M364073M237175
$$ y = [821564615, 815934658, 811539173, 808652878, 807730198, 807642937, 807299137, 806282878, 804404497, 801588714, 798398852, 795585990, 793735862, 793730259, 795766652, 799295187, 805056870, 812964618, 821187139, 829692721, 838889301, 846625566, 852335453, 857710898, 862954915, 867416203, 870366812, 871976256, 872439921, 871111691, 868487239, 864813089, 859266877, 851645172, 843066216, 834194243, 821855605, 798022628, 773319900, 755387723, 740780234, 730511606, 722918630, 714407563, 700993836, 686006248, 674349427, 665391445, 660388470, 659896672, 664700568, 672360718, 682121634, 701056242, 726028323, 745986819, 763774753, 780486405, 798207521, 816559553, 834151745, 849684000, 865620375, 881871521, 889282763, 893646836, 897884011]
1566.3H97884011L670454L094018J910925J068353N14627k88963r92716k262533m287719
1584.6I00310457p075072j0753035j4673829j7285288j7063021j2636423n032957K915680
1600.9H18706512Q858920J0883152R083808N320906J901627J077115L964901R449065
1617.2H69246006J0082603P750213O296575L517091J042902o4194l81827n71251j092017
1635.6H95826101j365065j066089r56356r56774j186848j535058j118600j368165k759874
1653.9H83513272k338112j543223j478851j742900k192557k372384l034412m424394
1670.3H64386439m674077n926311q194685q988976r704352j2993931k1075189k1022320
1686.6G71806598j8064261k0166099j9631624k1296561k3699164j9742191j7245889
$$ y = [897884011, 901554465, 904648483, 906559408, 907627761, 908142388, 907853425, 906860709, 904598176, 900310457, 893235385, 882482350, 867808521, 850523233, 833460212, 820823789, 815790832, 818706512, 827565432, 838448584, 847532392, 852853298, 854754925, 855832040, 859796941, 869246006, 879328609, 887078822, 893375397, 896892488, 897935390, 897871196, 897489369, 896918118, 895826101, 894461036, 893394947, 892438591, 891481817, 890294969, 888759911, 887641311, 886273146, 883513272, 881175160, 879631937, 878153086, 876410186, 874217629, 871845245, 868810833, 864386439, 859712362, 853786051, 845591366, 836602390, 826898038, 813904107, 792828918, 771806598, 753742337, 733576238, 713944614, 692648053, 668948889, 649206698, 631960809]
1700.9F31960809j0575115l689945j6630K707303M121899M859329N508422O661117
1717.2F41537189O081284L135800J438737O77705J072466K510607N002380J1076390
1733.5F72532558J6217351J5849531K0779312K6255786K6800990K7133167K7190864
1747.8H32759559K7753055K5215447J8297255J3945639J1672736Q474707O299138M334569
1764.1I48752105K588511J939952J521945J184046Q02100N18143L22581K68995K79844
1782.4I58178222K54214K21312J63853J08361J45913K46048K22146K30610K59698K73108
1802.8I60303485K39671K17676J77324J28269J47879J20223J10328K17080K95698J72139
1823.2I62129772P0393Q8692J46567K35200K29657J16885J9192j311N364L8743N6386
$$ y = [631960809, 621385694, 617695749, 617679119, 620386422, 624508321, 629367650, 634876072, 641537189, 647618473, 650754273, 652193010, 652870715, 653943181, 656453788, 661456168, 672532558, 688749909, 704599440, 725378752, 751634538, 778435528, 805568695, 832759559, 860512614, 885728061, 904025316, 917970955, 929643691, 938118398, 944417536, 948752105, 951340616, 953280568, 954802513, 955986559, 956788659, 957306802, 957629383, 957898378, 958178222, 958432436, 958653748, 958817601, 958925962, 959071875, 959317923, 959540069, 959770679, 960030377, 960303485, 960543156, 960760832, 960938156, 961066425, 961214304, 961334527, 961444855, 961661935, 961957633, 962129772, 962200165, 962288857, 962435424, 962670624, 962900281, 963017166, 963036358, 963035047, 963040411, 963079154, 963135540]
1845.7I63135540R3103J11222M6790o2645o9737k3604n7995m5299j073o0618j35243
1868.1I62930441m9412k2948o0856j3650R596p8380j75833j64986j20461j87397k81334
1890.5I61784780k01821j58191k13861j63198m8935m709M3988J08361J41382K10882
1910.9I61498678K17080J39177R0480J20401J18613P3254P8440M8697M2081J22011
1931.3I62548912J10983N246m2200j4246n0783j19150j7643P7725L8504l3617p5876
1953.7I62427855q2851r0599p7724j2994O7711O8307L9935M7147L8266L1948L1173
1976.2I62488174K4200M77r4056j41204o1154k504m589J013m172j6034L6776K7955
2000.6I62254882n1439N722J08123Q8751k801p7844o9678k861K9981M7863K5213J0192
$$ y = [963135540, 963228643, 963339865, 963386655, 963324010, 963254273, 963230669, 963172674, 963127375, 963126302, 963065684, 962930441, 962881029, 962858081, 962797225, 962783575, 962793171, 962714791, 962538958, 962373972, 962253511, 962066114, 961784780, 961582959, 961424768, 961210907, 961047709, 960998774, 960994065, 961038053, 961146414, 961287796, 961498678, 961715758, 961854935, 961945415, 962065816, 962184429, 962257683, 962336123, 962384820, 962426901, 962548912, 962659895, 962665141, 962622941, 962608695, 962557912, 962438762, 962421119, 962498844, 962537348, 962503731, 962427855, 962345004, 962254405, 962176681, 962163687, 962231398, 962299705, 962339640, 962386787, 962425053, 962457001, 962488174, 962512374, 962512851, 962418795, 962277591, 962216437, 962213933, 962209344, 962210357, 962206185, 962190151, 962226927, 962254882, 962203443, 962209165, 962317288, 962406039, 962403238, 962325394, 962255716, 962252855, 962282836, 962330699, 962355912, 962366104]
2025.1I62366104j0431j21355r5367N6982P5757L0637K325q6427j12116J2457J00434
2047.6I62219000P5579N3048N1856L338m0770k9623j1445K3902N4657j4722q9943k1935
2072I62272942P0989K5690n7042p2896j2637P5102O5089q166n96O8843N1439l100J908
2098.5I62477565K324J7703K5511l2187k6703L7432M6909P0512Q1659j610n8353J4067
2123I62654829O4313K0504K8968Q9944J19090P1227q404k8253k3067j8477j3828J669
2147.5I62958515P2479J03950O4850J7941m4107o6817k265Q6606R2685K8908k6882
2169.9I63285863k8669n901j2517l2008m0829m411L1173R120k6763m0590k8372Q642
2194.4I63114738L0518j6093r1255r2924j9073J5557k6107k4736P6354J32679P3255
$$ y = [962366104, 962355673, 962234318, 962138951, 962195933, 962271690, 962302327, 962304652, 962218225, 962106109, 962118566, 962219000, 962294579, 962347627, 962399483, 962402821, 962362051, 962332428, 962320983, 962344885, 962399542, 962384820, 962294877, 962272942, 962343931, 962369621, 962312579, 962239683, 962227046, 962302148, 962367237, 962359071, 962358475, 962427318, 962478757, 962475657, 962477565, 962479889, 962497592, 962523103, 962490916, 962464213, 962501645, 962548554, 962619066, 962700725, 962699115, 962640762, 962654829, 962719142, 962739646, 962768614, 962858558, 962977648, 963048875, 963040471, 963012218, 962989151, 962970674, 962956846, 962958515, 963030994, 963134944, 963199794, 963217735, 963173628, 963106811, 963104546, 963191152, 963283837, 963312745, 963285863, 963257194, 963251293, 963238776, 963206768, 963165939, 963161528, 963192701, 963201821, 963175058, 963134468, 963106096, 963114738, 963145256, 963129163, 963037908, 962944984, 962925911, 962941468, 962915361, 962890625, 962966979, 963099658, 963172913]
2216.8I63172913o736n3286r0361q0883j1683M17m1246r0540j30176r2328K742R6202
2241.3I62675035J36554J47105J53660O8903k6226j5795J669N603M6372O8963M5538
2263.7I63307381K38p4327j00613m2021J0729O2943N4717p3672j39236l6180P9930
2286.2I63049889Q6784M3392n901o139L1173K5392J8537J4961K2232R0659R2387K503
2310.6I63465869L3319J18077R6739J4662m9889n9962p0453P3195L10600J89006j53780
2333.1I63967383k41578q6248Q2374M8518j20282j13845K8134Q8453J09553K67148
2353.5I64029610M46916L48508J99080J53243M1247j70529l56913l06129r8229q4638
2373.8I64202166k07186j68562m5776k0981k3067M5836J19567P0572j9730k7597j0073
$$ y = [963172913, 963166177, 963112891, 963022530, 962941647, 962929964, 962930381, 962889135, 962798595, 962668419, 962576091, 962578833, 962675035, 962811589, 962958694, 963112354, 963181257, 963155031, 963139236, 963140905, 963146508, 963192880, 963261843, 963307381, 963307619, 963233292, 963132679, 963090658, 963101387, 963164330, 963219047, 963145375, 963006139, 962969959, 963049889, 963136673, 963180065, 963174164, 963168025, 963199198, 963224590, 963243127, 963258088, 963280320, 963370979, 963463366, 963465869, 963499188, 963617265, 963714004, 963728666, 963678777, 963618815, 963548362, 963621557, 963932157, 964121163, 963967383, 963725805, 963639557, 963721931, 963770449, 963650167, 963536322, 963564456, 963652909, 963762462, 964029610, 964476526, 964825034, 965024114, 965177357, 965218604, 965048075, 964691162, 964385033, 964286804, 964202166, 963994980, 963826418, 963780642, 963759661, 963736594, 963782430, 963901997, 963972569, 963952839, 963925242, 963915169]
2396.3I63915169l397j3113L040M7743M4525J6450l278k1934Q404M5896K7298N2214
2420.7I64119017N2214j0491j7285l9220j02818j08600l8266O7532J05739K5213r895
2443.2I64043140L8922M9114K5690l2663p8619l2067L4630N8115L1829j6988k8074
2465.6I64093029j8715l4631m6670n841l1054q9705j5557L2902l4273q6010o0081j3590
2490.1I63689804j4424n1916r0301p9870j9729m3214j13606m4763M6551M8280K5809
2512.5I63352621j3233n3882n2810q225n901l5644K1577N2929m2140l9995O5267J1146
2537I63251710j06752o5684P093L3855Q2016M9591m7922j04964j31130j12474m4584
2559.4I62810755j908n0127q7023k98P3731K8610l6239n3048o9082o6936J1384J8060
$$ y = [963915169, 963911772, 963898659, 963901699, 963949442, 963993967, 964010417, 964007139, 963985205, 963993609, 964039505, 964066803, 964119017, 964171231, 964160740, 964143455, 964104235, 964001417, 963892817, 963854551, 963922083, 964027822, 964053035, 964043140, 964082062, 964131176, 964156866, 964124203, 964045584, 964013517, 964048147, 964106262, 964138091, 964121103, 964093029, 964074314, 964039683, 963993013, 963987172, 963956118, 963866413, 963850856, 963883758, 963849485, 963763475, 963703394, 963689804, 963675380, 963623464, 963533163, 963453293, 963433564, 963390350, 963276744, 963231981, 963278532, 963326812, 963352621, 963339388, 963285506, 963232696, 963224471, 963218570, 963182926, 963204503, 963257432, 963215292, 963175297, 963240564, 963251710, 963144958, 963079274, 963086367, 963120222, 963202238, 963251829, 963203907, 963098943, 962967813, 962855339, 962810755, 962808847, 962758720, 962671697, 962671399, 962745130, 962773740, 962737501, 962684453, 962615371, 962548435, 962559819, 962577879]
2583.9I62577879p1346p5937k1875M4406P0929l0875r5069p272K4140p6175j20520
2606.3I62218285q7440n6327q225N722k7180k5093J549q285n9783p8976n6386m8399
2630.8I61769462m2618k4318l5525n1975N305L5107m5359q8215l2663n6982j70708
2653.2I61261511j55211m7862K146j2994n1618q2135j19031j29401q6665l8863k3484
2675.7I60516393j2398l1113r8407q9169m8935j07885j28329o6518j07408k07186j94549
2698.1I59424496j06395o9439j29700k01702k11060j72198j21891j42336k44558l16441
2718.5I57708776k95937k16425j45375p6533o6161j30415j74105j98007j53899j00493
2738.9I56151426r9778n6744m4823j25408j09792J4604k0445j48952j38759l9459m5836
$$ y = [962577879, 962506533, 962430596, 962408721, 962453127, 962524056, 962493181, 962398112, 962390840, 962414980, 962338805, 962218285, 962130845, 962074518, 962066293, 962072015, 962044835, 962019742, 962021291, 962013006, 961953223, 961874247, 961817861, 961769462, 961726844, 961702526, 961667001, 961615026, 961620331, 961655438, 961610079, 961521864, 961489201, 961432219, 961261511, 961106300, 961058438, 961060584, 961047590, 960995972, 960913837, 960794806, 960665405, 960578740, 960539877, 960516393, 960503995, 960472882, 960374475, 960285306, 960236371, 960128486, 960000157, 959933639, 959826231, 959619045, 959424496, 959318101, 959248662, 959118962, 958917260, 958706200, 958534002, 958412111, 958269775, 958025217, 957708776, 957412839, 957196414, 957051039, 956974506, 956908345, 956777930, 956603825, 956405818, 956251919, 956151426, 956051648, 955994904, 955950081, 955824673, 955714881, 955729485, 955709040, 955560088, 955421329, 955381870, 955336034]
2761.3I55336034k09689l26037l17931k57910j76251j93298l36349m62651n21600n92172
2781.7I51942146o73235p04884p23124p51555p05540n29408l54827k33114n6266J00374
2802.1I47310567J06573p3254l45647m98116n81205p48575r07421j039207j276076
2820.5I41947639j653731k085328k503932k963006l513694m136622m857242n798042
2836.8I14436042p025420q504093j0079384j1329174j1592150j0231852p289171l590286
2853.1H44794512J01387L234744N176664N727827N330324M433632L377796K744734
2869.4H74921620K910733L415525L554463L123820K222479J055896j50442j221180
2885.7H89832914k070546k745390l248096l483295l484428l635049m032314m356384
$$ y = [955336034, 955126345, 954800308, 954482377, 954224467, 954048216, 953854918, 953518569, 953055918, 952534318, 951942146, 951268911, 950564027, 949840903, 949089348, 948383808, 947854400, 947499573, 947266459, 947210193, 947310567, 947417140, 947343886, 946998239, 946500123, 945918918, 945170343, 944262922, 943223715, 941947639, 940293908, 938208580, 935704648, 932741642, 929227948, 925091326, 920234084, 914436042, 907410622, 898906529, 888827145, 877497971, 865905821, 855673969, 848384798, 844794512, 844895899, 848130643, 853307307, 859035134, 864365458, 868799090, 872176886, 874921620, 877832353, 881247878, 884802341, 887926161, 890148640, 891204536, 891054094, 889832914, 887762368, 885016978, 881768882, 878285587, 874801159, 871166110, 867133796, 862777412]
2902H62777412m735470n273640n773127o383836p189155p670820p242679n937815m301071
2920.4H08269799k655447r04500R11236K612412M156410N389750O112039O338001O141185
2938.7H36370885N523384M543245L434777K431035J727700J586438K109944L123522
2955H60850930M229129N117476N744695O102741O250739O263554O092668N759001N367159
2973.4I11778092M896224M421949M068256L767609L457368L026545K499819K025246
2989.7I39941108J610935J181483P52270N34177M58777L61085L73900M73201N89073
3008.1I46276009P78973Q89719Q60154R08912R34362P10368L64900O7651j29461j80423
3028.5I51481164o9261J3649m4465l4809L4809M1485P6592J78695K72929K14816R119
$$ y = [862777412, 858041942, 852768302, 846995175, 840611339, 833422184, 825751364, 818508685, 812570870, 808269799, 805614352, 804709852, 805621088, 808233500, 812389910, 817779660, 823891699, 830229700, 836370885, 841894269, 846437514, 849872291, 852303326, 854031026, 855617464, 857727408, 860850930, 865080059, 870197535, 875942230, 882044971, 888295710, 894559264, 900651932, 906410933, 911778092, 916674316, 921096265, 925164521, 928932130, 932389498, 935416043, 937915862, 939941108, 941552043, 942733526, 943485796, 944019973, 944478750, 944839835, 945213735, 945686936, 946276009, 947054982, 947944701, 948804855, 949713767, 950648129, 951358497, 951723397, 951791048, 951661587, 951481164, 951411903, 951425552, 951381087, 951346278, 951381087, 951422572, 951499164, 951677859, 951950788, 952165604, 952174723]
3050.9I52174723j07765k4200N6684L5584M7327N8651N7458K10345M41075M45663L13879
3073.3I53709424K91228L06070L53992M00722K77698J76847K79963K99751J08660q1063
3093.7I56123292j74880j95264j77920j92940k55287l49581m01676l88503m84944n20944
3114.1I52981353l85821l61621l64244k26140n1320N0902J21594K09927L34084M79818
3134.5I52788532M53949L28660L54707M06921L08990J63019J50859J34409q1599j78933
3154.9I54829514q0109r8765k03669k62856k59340j98960j50979k87175n07235n35727
3175.3I52244699m88937n55932o30022o39081o79731o71148m81904k12311j28448k08438
3195.7I47548747r5785J51098K56360K57253K42412J31608n7579j83165k68280l13759
$$ y = [952174723, 952066958, 952042758, 952099442, 952135026, 952182353, 952241004, 952298462, 952508807, 952949882, 953395545, 953709424, 954000652, 954306722, 954660714, 955061436, 955339134, 955515981, 955795944, 956095695, 956204355, 956123292, 955948412, 955753148, 955575228, 955382288, 955127001, 954777420, 954375744, 953987241, 953502297, 952981353, 952595532, 952233911, 951869667, 951643527, 951592207, 951643109, 951764703, 951974630, 952308714, 952788532, 953242481, 953571141, 953925848, 954332769, 954641759, 954804778, 954955637, 955090046, 955008447, 954829514, 954749405, 954650640, 954446971, 954184115, 953924775, 953725815, 953574836, 953287661, 952780426, 952244699, 951755762, 951199830, 950569808, 949930727, 949250996, 948579848, 948097944, 947885633, 947757185, 947548747, 947452962, 947604060, 947860420, 948117673, 948360085, 948491693, 948434114, 948250949, 947982669, 947668910]
3216.1I47668910l21686l16680l01063m35591n95092n45085n58972o75082n99683n14984
3236.5I42804992n95331o26683o41465p09057p16508p56859p95424q12948q63254q50320
3256.9I35437143r02534r87053r63211r58979j035630j102448j089990j107812j233697
3275.2I26055789j378357j497567j540482j531065j558304j637518j780093j823187
3291.5I13309216j654684j463056j390218j431823j467347j325429r63628o99163p83741
3309.9I02130127q15511n91218m04060k48015K2054K46346K69591L83437P58886J063884
3330.3I02815521J121223J132428J235068J308680J404106J613379J708031J640260
3346.6I13978696J591086J559079J533568J561046J634776J685500J613796J433194
$$ y = [947668910, 947347224, 947030544, 946729481, 946293890, 945698798, 945153713, 944594741, 943919659, 943319976, 942804992, 942209661, 941582978, 940941513, 940232456, 939515948, 938759089, 937963665, 937150717, 936287463, 935437143, 934534609, 933547556, 932584345, 931625366, 930589736, 929487288, 928397298, 927289486, 926055789, 924677432, 923179865, 921639383, 920108318, 918550014, 916912496, 915132403, 913309216, 911654532, 910191476, 908801258, 907369435, 905902088, 904576659, 903613031, 902913868, 902130127, 901314616, 900723398, 900319338, 900071323, 900093377, 900339723, 900609314, 900992751, 901751637, 902815521, 903936744, 905069172, 906304240, 907612920, 909017026, 910630405, 912338436, 913978696, 915569782, 917128861, 918662429, 920223475, 921858251, 923543751, 925157547, 926590741]
3362.9I26590741J220822J106560J211524J362801J282513J053452R00627Q50498Q88586
3381.3I36468124Q68082P18594O39260N96344N28097O43373P18594N29945M53233N64754
3401.7I42728400O21498N40495M43697M67896M92752M81069M74453M36425M54426M56333
3422I47597444K70009J36733K11775K19822N7638M5121K69830L85463L04699K96354
3442.4I49794888L62158K58088J32204J70826K25306K32041K10881J71602J92046K26975
3462.8I51977015J08838O258J51754M23669M77136K50875N1916J7345J46091K08914
3483.2I53819811R8765R2626J38342M8518m2438M0650J55568J58549K48730L02434
3503.6I55061555J29819L1113P3672K11000K70307J61827J52647K36214K49981J44959
$$ y = [926590741, 927811563, 928918123, 930129647, 931492448, 932774961, 933828413, 934729040, 935579538, 936468124, 937336206, 938054800, 938694060, 939290404, 939818501, 940461874, 941180468, 941710413, 942163646, 942728400, 943349898, 943890393, 944334090, 944801986, 945294738, 945775807, 946250260, 946686685, 947141111, 947597444, 947867453, 948004186, 948215961, 948435783, 948493421, 948538542, 948808372, 949193835, 949498534, 949794888, 950157046, 950415134, 950547338, 950718164, 950943470, 951175511, 951386392, 951557994, 951750040, 951977015, 952085853, 952092111, 952243865, 952667534, 953144670, 953395545, 953447461, 953464806, 953610897, 953819811, 953918576, 954011202, 954149544, 954198062, 954155624, 954196274, 954351842, 954510391, 954759121, 955061555, 955191374, 955222487, 955296159, 955507159, 955777466, 955939293, 956091940, 956328154, 956578135, 956723094]
3524I56723094J20282K70546L25024K54631K09749K16782K30848J67907J57654K83897
3544.4I58960414L40104L43561L28005K85923K57969J81675J95444L28779K93612J44005
3564.8I61659491K19822M29392M45783L00229K03490K49028K73526K17914K34962K65539
3585.2I64499176Q2969l7849J29462L39210M65750L77238J78278J28090J87278J48952
3605.6I66498554J32322K36154J87874O4313O0320R0062L25919M50432K59757J84953
3626I68490660J26243R8228L09885L53396K03669J28567J59800J95325K55227K97606
3646.4I70618606R2923j11222J68622L54707K63214J88827K28405J84536Q5056J08957
3666.8I72182631J73927K5093j20520J11699M04179K37048O8903J83940L15845J92880
$$ y = [956723094, 956843376, 957113922, 957438946, 957693577, 957903326, 958120108, 958350956, 958518863, 958676517, 958960414, 959300518, 959644079, 959972084, 960258007, 960515976, 960697651, 960893095, 961221874, 961515486, 961659491, 961879313, 962308705, 962754488, 963054717, 963258207, 963507235, 963780761, 963998675, 964233637, 964499176, 964582145, 964544296, 964673758, 965012968, 965478718, 965855956, 966034234, 966162324, 966349602, 966498554, 966630876, 966867030, 967054904, 967119217, 967179537, 967269599, 967595518, 968045950, 968305707, 968490660, 968616903, 968715131, 969025016, 969378412, 969582081, 969710648, 969870448, 970065773, 970321000, 970618606, 970711529, 970600307, 970768929, 971123636, 971386850, 971575677, 971804082, 971988618, 972073674, 972182631, 972356558, 972381651, 972261131, 972372830, 972777009, 973014057, 973082960, 973266900, 973582745, 973775625]
3687.2I73775625k5868O5267J61767J13487J22488J33872J61349J48416Q2851J30355
3707.6I74869609J81317M5657j60873j65402L3497J82331J16527O5386J33932K06470
3727.9I75508451K13981P3195q2434J5855O736k13921k78414j06394J07706J74641
3748.3I75419402k9445k72631n722J19686L9458J60396J90854L0220j71960k68995
3768.7I75211263l0518K12312J43826P152p2538p2658m18K4796J40667L13997J93358
3791.2I76071239j03593j20879J56880J55151k93374k98143J23501J22130r7454j09315
3811.6I75606143p7366p0393Q9645J92702p5579k10464m7266M0233R4413J24634J06573
3834I75773275J08004m2022k26617k55346j59144R5069J71185L7789R54j5915j14739
$$ y = [973775625, 973749757, 973815024, 973976791, 974090278, 974212766, 974346638, 974507987, 974656403, 974739254, 974869609, 975050926, 975096583, 974935710, 974770308, 974803805, 974986136, 975102663, 975168049, 975301981, 975508451, 975722432, 975795627, 975713193, 975729048, 975735784, 975521863, 975243449, 975137055, 975244761, 975419402, 975389957, 975117326, 975111604, 975231290, 975270748, 975431144, 975621998, 975652218, 975480258, 975211263, 975180745, 975393057, 975536883, 975544035, 975471497, 975398839, 975398421, 975423217, 975563884, 975877881, 976071239, 975967646, 975846767, 976003647, 976158798, 975865424, 975567281, 975690782, 975812912, 975715458, 975606143, 975528777, 975458384, 975548029, 975740731, 975665152, 975454688, 975407422, 975447655, 975542068, 975666702, 975773275, 975881279, 975839257, 975612640, 975357294, 975198150, 975293219, 975464404, 975502193, 975503147, 975487232, 975372493]
3856.4I75372493j16050L4869K29001J80423K027J3828N6565j37270j66952L7908k3782
3878.9I75483060j41144K1815J48297J08659l7253j35660l0458O3479l6359j29819
3899.2I75314617p1108J8596J59741K80738J91510N5730o437j43290j55509M1843P7784
3921.7I75764215M5598J6987p2658n4658j9192n9247k1696K6702L5525M5419J4185
3944.1I75721180r8884k02417j06454L2485l2902m7386K00987L01003M6015j20520
3964.5I75693107p3672j19j8775q2493K2054R8526k0623q4937j9848k7716l2962J05739
3989I75558281N1856j46329k3783K43962
3997.1I75683987
$$ y = [975372493, 975256443, 975291312, 975520313, 975700736, 975702763, 975716591, 975773156, 975635886, 975468934, 975506842, 975483060, 975341916, 975363731, 975512028, 975620687, 975583434, 975447774, 975417316, 975480795, 975444436, 975314617, 975243509, 975262105, 975421846, 975702584, 975894094, 975949824, 975943387, 975800097, 975644588, 975686431, 975764215, 975809813, 975826800, 975754142, 975699484, 975680292, 975621045, 975599349, 975626051, 975661576, 975706995, 975721180, 975622296, 975419879, 975313425, 975345910, 975313008, 975265622, 975466609, 975767612, 975813627, 975693107, 975619435, 975619316, 975600541, 975518048, 975540102, 975638628, 975618005, 975533068, 975513220, 975485504, 975452542, 975558281, 975610137, 975463808, 975440025, 975683987]
##END=$$ End of the data block
