##TITLE=T008 Face cor gelo $$ Begin of the data block
##JCAMP-DX=5.00 $$ ACD/SpecManager v 10.08
##SPECTROMETER/DATA SYSTEM=Alpha
##DATE=20 Nov 2014 09:22:14
##DATA TYPE=INFRARED SPECTRUM
##DATA CLASS=XYDATA
##ORIGIN=
##OWNER=
##NPOINTS=1667
##FIRSTX=599.57470703
##LASTX=3997.16503906
##MAXX=3997.16503906
##MINX=599.57470703
##MAXY=0.94593298
##MINY=0.68577790
##XFACTOR=1.0000000000
##YFACTOR=1.000000000000000e-9
##FIRSTY=0.89655620
##DELTAX=2.03937006
##XUNITS=1/CM
##YUNITS=ARBITRARY UNITS
##XYDATA=(X++(Y..Y))
599.6H96556199J212477Q18193l21209j074732j340508j054347l9637J257480K028703
617.9H98042619J922250J351833Q57175P73132O91652J19448m08113l53277L397J26362
638.3I03126478j66893o30736o46651m32670m36187k03669l4153l60191o06179m62175
658.7H99146974l46899n95093p89582p08461l25680L95298P17759N36621K50518J24693
679.1H98406148l0696p1347J11341J05441j28746m62353r56416j268685j367927j578629
699.5H92758131k091110l302633n755187j0071039j4888763j3835073o264388l948093
715.8H32601845m823863P525444K2183537J8039763K920211p586539k216578J4195502
732.1H82839322J8723548R689509K681315N19574k13265l72172l18229m41074n86689
$$ y = [896556199, 897768676, 898586869, 898265660, 897190928, 895850420, 894796073, 894756436, 896013916, 898042619, 899964869, 901316702, 902173877, 902947009, 903638661, 903758109, 903349996, 902996719, 903000116, 903126478, 902959585, 902328849, 901682198, 901249528, 900813341, 900609672, 900575519, 900215328, 899609149, 899146974, 898800075, 898204982, 897415400, 896706939, 896381259, 896776557, 897494316, 898030937, 898281455, 898406148, 898375452, 898304105, 898415446, 898520887, 898392141, 897929788, 896973372, 895704687, 894336760, 892758131, 890667021, 887364388, 881609201, 871538162, 856649399, 842814326, 836549938, 832601845, 827777982, 835303426, 857486963, 875526726, 878446937, 870860398, 868643820, 882839322, 901562870, 911252379, 913933694, 914453268, 914240003, 913867831, 913549602, 913108528, 912521839]
750.5I12521839n75840n79000m29451j24991p1824k44975k92838j09195J38581K85208
770.9I10517514L07977L50296M25458L90768L25978K23100J40071O8963l4809j28806
791.3I12586510l69906m36843j70767j5140j5497n2094j14620m1187N3346M5836O6579
813.7I11536217N7220o4194j81139m9948J00493K682k4259j06811m37081n89013n95987
836.1I09648180p25269p57695p62999j265585j714647r84907l57032j075268j690805
854.5I00313973j686394j920819k657116m100978o417751j0107756j6113400k1822095
870.8H35487664j9939304o369710J3472855K7234257K7205884J9722641J3851702R204268
887.1I19870257M066944M85838o74307o10888m73380l88325l49819n23806o77824o12736
$$ y = [912521839, 911945999, 911366999, 910937548, 910812557, 910740733, 910495758, 910202920, 910093725, 910232306, 910517514, 910825491, 911175787, 911601245, 911992013, 912317991, 912541091, 912681162, 912750125, 912715316, 912586510, 912216604, 911779761, 911608994, 911593854, 911578357, 911526263, 911411643, 911370456, 911423802, 911469638, 911536217, 911593437, 911529243, 911348104, 911298156, 911398649, 911401331, 911377072, 911270261, 910833180, 910244167, 909648180, 908922911, 908165216, 907402217, 906136632, 904421985, 903437078, 903080046, 902004778, 900313973, 898627579, 896706760, 894049644, 889948666, 883530915, 873423159, 857309759, 835487664, 815548360, 809178650, 822651505, 849885762, 877091646, 896814287, 910665989, 919870257, 923937201, 924423039, 923748732, 923137844, 922664464, 922276139, 921926320, 921402514, 920724690, 920111954]
907.5I20111954m37557k30194j59978l21925l94702l89934m56929m35054l61204l46661
927.9I16577816l94523l70205l00586l31223k52604m0472j4841j75655j50621k3246
948.3I14523840j49906l10302l26097k80380k67446l56018m16935l60131l07441l76940
968.7I11372244l59475k09093j43409j98126k58505k26379k43604l29494l56853m54247
989.1I08593059o85573q46982q17239o74248n37336l68237j79589j92762m53829p67768
1009.5I03069496q66771p19428n34594l92437j68442J15335J77562J06573J85788K04920
1029.9I01178002L1531k6881M6253J07467J60158J07526n7220j39654l6716J10507
1050.3I01480973J81436R9719j13011j88529j69158k67208l15010l44038n11766o28233
$$ y = [920111954, 919674397, 919444203, 919284225, 918962300, 918567598, 918177664, 917720735, 917285681, 916924477, 916577816, 916183293, 915813088, 915512502, 915181279, 914928675, 914888203, 914873362, 914697707, 914547086, 914523840, 914373934, 914063632, 913737535, 913457155, 913189709, 912833691, 912416756, 912056625, 911749184, 911372244, 911012769, 910803676, 910660267, 910462141, 910203636, 909977257, 909733653, 909404159, 909047306, 908593059, 907907486, 907060504, 906243265, 905569017, 905031681, 904663444, 904483855, 904291093, 903837264, 903069496, 902202725, 901483297, 900948703, 900556266, 900387824, 900503159, 900680721, 900787294, 900973082, 901178002, 901209533, 901182652, 901228905, 901336372, 901496530, 901604056, 901546836, 901407182, 901370466, 901480973, 901662409, 901762128, 901649117, 901460588, 901291430, 901024222, 900709212, 900365174, 899853408, 899225175]
1070.7H99225175n73575m91083n09739m42624k07960l2366K5094q226j15454j88112
1091.1H96681130k01166k40981k99871l75092m83036m96865l96669m09364m99130m08709
1111.5H92870247j95264R1612M20034N25653M83513N88179O96242O28709N02348K55347
1131.9H96866620k3425m1664p1525k73228l27766l28481m58181n34475m94420m44711
1152.2H93868744m09007l87728l84390l01898j36316n2034J6748K21312M45128N31793
1172.6H93412352N25236N44727N85198N78165M32968K20001J49012J74105J29997K0266
1193H96772027m7982k5511M9949R3699N9127j7702p3671j08242j67490k08675k34604
1215.5H96090925k51711k35438k97070m15384n06580n33581n00441n50925n96643n09500
$$ y = [899225175, 898651600, 898160517, 897650778, 897208154, 897000194, 896967828, 896992922, 896984696, 896869242, 896681130, 896479964, 896238983, 895939112, 895564020, 895080984, 894584119, 894187450, 893778086, 893278956, 892870247, 892674983, 892766595, 893186629, 893712282, 894195795, 894783974, 895480216, 896108925, 896611273, 896866620, 896843195, 896801531, 896730006, 896456778, 896129012, 895800531, 895342350, 894807875, 894313455, 893868744, 893459737, 893072009, 892687619, 892385721, 892249405, 892197371, 892214119, 892435431, 892880559, 893412352, 893937588, 894482315, 895067513, 895645678, 896078646, 896298647, 896447659, 896621764, 896751761, 896772027, 896724045, 896698534, 896748483, 896842182, 896901309, 896883607, 896809936, 896701694, 896534204, 896325529, 896090925, 895839214, 895603776, 895306706, 894891322, 894384742, 893851161, 893350720, 892799795, 892203152, 891693652]
1235.9H91693652m22716l46840k49982j91211j79053k95818m44472m37140m57466o18636
1256.3H88050318p15852o22213l45111m5836P6056O6161l5048j12533j00672j53482
1276.7H86061788k64168l55780l98755m95971o20305n63026m22954m40657n77391p22169
1297H81200612q05080p44462o13749m80712m18901m88699n79476n33998m69744n56589
1317.4H75509202o60419o63102p06672q57771r66370j072049j190007j305282j471102
1335.8H66616428j649439j649380j421988j363695j587272j828312j859367j764894
1352.1H53492081j738965j851499k014339k274990k626241k662360k526224k555013
1368.4H35242450k625704l089487l603995k557218p81298k63333j180887k551198l862500
$$ y = [891693652, 891270936, 890924096, 890674114, 890482903, 890303850, 890008032, 889563560, 889126420, 888668954, 888050318, 887334466, 886712253, 886367142, 886321306, 886397362, 886463523, 886428475, 886315942, 886215270, 886061788, 885797620, 885441840, 885043085, 884547114, 883926809, 883363783, 882940829, 882500172, 881922781, 881200612, 880395532, 879651070, 879037321, 878556609, 878137708, 877649009, 877069533, 876535535, 876065791, 875509202, 874848783, 874185681, 873479009, 872621238, 871654868, 870582819, 869392812, 868087530, 866616428, 864966989, 863317609, 861895621, 860531926, 858944654, 857116342, 855256975, 853492081, 851753116, 849901617, 847887278, 845612288, 842986047, 840323687, 837797463, 835242450, 832616746, 829527259, 825923264, 823366046, 822584748, 822321415, 821140528, 818589330, 814726830]
1386.8H14726830m648984m554570m701256n123318m672825l945231l713549m232347
1403.1G79134750n520939o353498o445944o224394n370915m129827k943933j524150
1419.4G40621150J6450J046718J691639K103508K748787L226757L229260L913522M628301
1437.8G63226092L644705K957284K733827K473354K224863J680195R96768N23747n5790
1456.1G80405045l055752m685938N42164R523272J1921108N853474K518833R301543
1472.4H12323749K1165609J8564105R362162M667043L765583L392041L123045L383935
1488.8H79747272L650605K958477K396762K694547K822757K417326J958191J838804
1505.1I00484741K160847J891613J471043J379847J383782J520514J535773J731336
$$ y = [814726830, 810077846, 805523276, 800822020, 795698702, 791025877, 787080646, 783367097, 779134750, 773613811, 767260313, 760814369, 754589975, 749219060, 745089233, 742145300, 740621150, 740637600, 741684318, 743375957, 745479465, 748228252, 751455009, 754684269, 758597791, 763226092, 766870797, 769828081, 772561908, 775035262, 777260125, 778940320, 779937088, 780460835, 780405045, 777349293, 772663355, 773205519, 782728791, 794649899, 800503373, 803022206, 812323749, 833489358, 852053463, 861415625, 866082668, 869848251, 873240292, 876363337, 879747272, 883397877, 886356354, 888753116, 891447663, 894270420, 896687746, 898645937, 900484741, 902645588, 904537201, 906008244, 907388091, 908771873, 910292387, 911828160, 913559496]
1521.4I13559496J760483J285434J067460P41243L32892J4365j31846j29878J54137
1539.7I18653786Q64566J379668J593352J303196R85443Q10802O00279K20656j09673
1558.1I26302075l2425M292k01106l56972n61893p96378o60479n60224m86434J848
1578.5I22652304L89815M46319L46840J39176j25289l71873o64771r51647j118005
1596.8I20742869j070797p32958R954Q89182J467824J525163J050711M35591N364k39432
1617.2I24083471k75194j66536N5671K96593L23474J96159k6405l45945p32303n61476
1637.6I22847509o675K50518K09630M9531%o8665n05566j242578j013756q63791q52584
1660.1I18803573k15412P96974J169563J141905R08912K84373m11391r86934j088380
$$ y = [913559496, 915319979, 916605413, 917672873, 918414116, 918747008, 918761373, 918629527, 918499649, 918653786, 919518352, 920898020, 922491372, 923794568, 924780011, 925590813, 926191092, 926411748, 926302075, 926269650, 926273942, 926072836, 925715864, 925153971, 924357593, 923697114, 923136890, 922650456, 922652304, 923042119, 923488438, 923835278, 923974454, 923849165, 923477292, 922812521, 921860874, 920742869, 919672072, 918939114, 918949068, 919838250, 921306074, 922831237, 923881948, 924317539, 924322903, 924083471, 923808277, 923641741, 923697412, 923994005, 924317479, 924513638, 924487233, 924141288, 923408985, 922847509, 922840834, 923091352, 923300982, 923350513, 923350513, 923281848, 922776282, 921533704, 920519948, 919656157, 918803573, 918588161, 919385135, 920554698, 921696603, 922605515, 922889888, 922478497, 921491563, 920403183]
1678.4I20403183j030803j103044j395464j160860o11245j94014R6322L96847Q70228
1696.8I16271150J126289J508177J455009J362860J443386J172364R18925P35998M69327
1715.1I26463485K62558L26097K38896m2916k56359m22359n32746m52817m27782k97666
1735.5I24858391J5676L01004O67751R89437J248955J358092J446367J605093J360178
1753.9I33850944R73284Q07762O19233M35352K81632P7188j5556j9610j32501j52171
1774.3I36725557k206l7491k09987k47359k41697l57926n82576q32975p19964j85609
1794.7I33307767J50382L72470P02560Q51095O08027L16619J30535K026r000J490l1889
1817.1I36402082J5736M9830n8115r5069k8134j6629J3530J0609m3571o8545j04606
$$ y = [920403183, 919372380, 918269336, 916873872, 915713012, 915101767, 914907753, 915004075, 915400922, 916271150, 917397439, 918905616, 920360625, 921723485, 923166871, 924339235, 925258160, 925994158, 926463485, 926726043, 927052140, 927291036, 927248120, 926991761, 926569402, 926036656, 925583839, 925156057, 924858391, 924874067, 925175071, 925842822, 926832259, 928081214, 929439306, 930885673, 932490766, 933850944, 934824228, 935631990, 936251223, 936686575, 936968207, 937045395, 937029839, 937010229, 936877728, 936725557, 936723351, 936685860, 936475873, 936228514, 935986817, 935628891, 935046315, 934213340, 933493376, 933307767, 933458149, 933830619, 934533179, 935384274, 935992301, 936308920, 936439455, 936441481, 936432481, 936433971, 936402082, 936417818, 936467648, 936409533, 936314464, 936286330, 936269701, 936283231, 936293840, 936250269, 936181724, 936077118]
1839.5I36077118j26064q7857m8936j0192J8299l2246q5772o0975n5134j07587q4221
1862I35396433j4007j12772k25485k8729J53840R6976J0014l5107n3406o8128j26422
1884.4I34993207j78575j83940j18434J8119N8711n782k9027k3425m2915k9266J490
1906.8I34460163J2100M2736J0729n2809o7056p8141p4149k3543M5657J3768l9815
1929.3I34249640j9849k2173j6987J4365l3260j41501j17779K027M1663R656o5088
1951.7I33900714o9618J8120J6033j04844j39952r0420n4300O6459J39594L5942l1174
1974.1I33686554j549k6167q7678o1572j1861m2260n4776k7895m3989l8683p927j4902
1998.6I33267295k9325k2411N364j8895j17182j47880r1672k7775j8060n8055j6690
$$ y = [936077118, 935951054, 935863197, 935814261, 935804069, 935822368, 935790122, 935704350, 935643375, 935588241, 935480654, 935396433, 935382426, 935269654, 935044169, 935015440, 935169280, 935266256, 935276270, 935241163, 935187757, 935119629, 934993207, 934814632, 934630692, 934512258, 934530377, 934589088, 934583306, 934554279, 934530854, 934487939, 934458673, 934460163, 934472263, 934514999, 934525728, 934472919, 934405863, 934327722, 934253573, 934230030, 934275687, 934289455, 934249640, 934229791, 934207618, 934190631, 934204996, 934171736, 934030235, 933912456, 933914483, 933956146, 933965802, 933900714, 933831096, 933849216, 933865249, 933760405, 933620453, 933530033, 933475733, 933542192, 933681786, 933717728, 933686554, 933685005, 933658838, 933571160, 933509588, 933497727, 933455467, 933400691, 933372796, 933328807, 933290124, 933282197, 933267295, 933237970, 933215559, 933220923, 933202028, 933084846, 932936966, 932845294, 932817519, 932799459, 932741404, 932724714]
2021I32724714M3214L1948J1861k0385m4703j3888K4557L9160J5974m6849l3915M2021
2045.5I32773709J8120l4451l815J4782q941l7014j05262j57476l6835J27017L9161
2067.9I32588995j04905m8101L8267M4643J3352m4048n8413j4126Q702J2100J490m4524
2092.4I32393432q5414q6009q047M6313j1027o5505o8546m9889l5107O56L4630j0848
2116.9I32054639n0962m0710n9545n6148K146K2054Q642j370L57r53l5584n6327m1723
2143.4I31744516m2439n8531m3214l6955M709P7486K9624m4763j9551M113J0014O3955
2167.9I31688964L2425o6101m8101l7432j24156j12832m530N8651N0247n2333q1897
2190.3I31302905m77R060q285r298o0499j20878r9063m3631k6047L0935J51276J73450
$$ y = [932724714, 932767928, 932799876, 932811737, 932791352, 932746649, 932732761, 932757318, 932796478, 932812452, 932765603, 932731688, 932773709, 932791829, 932757378, 932753563, 932768345, 932759404, 932722390, 932617128, 932459652, 932422817, 932549834, 932588995, 932484090, 932435989, 932474256, 932518899, 932532251, 932488203, 932429790, 932415664, 932424366, 932436466, 932437956, 932393432, 932308018, 932222009, 932213962, 932260275, 932249248, 932183743, 932115197, 932065308, 932030201, 932030857, 932065487, 932054639, 932003677, 931962967, 931903422, 931847274, 931849420, 931871474, 931880116, 931878746, 931879103, 931878150, 931842566, 931786239, 931744516, 931702077, 931643546, 931600332, 931563377, 931568086, 931645572, 931675196, 931630433, 931610882, 931614995, 931625009, 931688964, 931721389, 931655288, 931607187, 931569755, 931445599, 931332767, 931328237, 931386888, 931437135, 931384802, 931302905, 931302428, 931311488, 931303203, 931293905, 931233406, 931112528, 931013465, 930969834, 930943787, 930974722, 931125998, 931299448]
2214.8I31299448M5598n3764n7638q5532r1732K563J8955o3420p8440m5895o3539p3015
2239.3I30753589l4273J9968Q0823M5538n3942p6711m0054k9922m9829m6432k8074
2261.7I30540681j431k384n6743n7877j5080l7789m6253j252J1862k2591m3749j8776
2286.2I30248618k4438o5982o2049M530l814r6441m8756O4909K1994p6592j03056p8499
2310.6I29780424L4213Q6844l0637j51575j91509j06812P2897K75671L59476J45554
2331I30274546j10626j00911J014l040q2016j51038r4116O6399J09673M4763P8261
2353.5I30032909K53141L31282K35796N0903j46985k51293k29538j36495p3015j32203
2373.8I29934502k21134j75654k2054N6624K6942L7610O8545l2961j10686m3690k5034
$$ y = [931299448, 931345046, 931291282, 931233644, 931148112, 931056380, 931058943, 931077898, 931014478, 930936038, 930890143, 930826604, 930753589, 930719316, 930739284, 930820107, 930865645, 930811703, 930734992, 930694938, 930665016, 930615187, 930568755, 930540681, 930539250, 930536866, 930480123, 930422246, 930407166, 930369377, 930323124, 930321872, 930333734, 930311143, 930267394, 930248618, 930224180, 930158198, 930096149, 930100679, 930096865, 930000424, 929951668, 930016577, 930038571, 929961979, 929858923, 929780424, 929814637, 929901481, 929870844, 929719269, 929527760, 929420948, 929493845, 929769516, 930128992, 930274546, 930163920, 930063009, 930064023, 930060983, 929978967, 929827929, 929733813, 929800212, 929909885, 929954648, 930032909, 930286050, 930617332, 930853128, 930904031, 930757046, 930505753, 930276215, 930139720, 930066705, 929934502, 929713368, 929537714, 929515660, 929572284, 929599226, 929636836, 929705381, 929672420, 929561734, 929518044, 929493010]
2396.3I29493010p0989p9334j9848L6597J6570j5974n1975p1407j6450J3530m2737
2418.7I29190993p2598n6625N126Q7321M2618r9838j47939p5877j2636M4227P0810
2441.1I28975582k4676r7394n2929K205j5378q8751p3671R715L576m3392r1731j68562
2465.6I28334594j72973p6353J0609L2425j5020o3777p1764j02759j03235p3790j01746
2488I27596211j24454j29879j72019k04622j80662j16885q8215j40428j87278j48952
2508.4I26102817m1008L3498P15l6895o676O6102J24752J16646R2507N1975M709K1040
2532.9I26530182M6134M6075L5226R894k8312m6849j0788J2397l4034j18732j70231
2555.3I26270962j43171o0677J3888L516q0347j17659n0008k504r0301j80244j46389
$$ y = [929493010, 929422021, 929342687, 929322839, 929359436, 929376006, 929360032, 929308057, 929236650, 929220200, 929233730, 929190993, 929118395, 929061770, 929066896, 929154217, 929196835, 929096997, 928949058, 928873181, 928860545, 928904772, 928975582, 928950906, 928853512, 928800583, 928802788, 928787410, 928698659, 928624988, 928634703, 928638279, 928594887, 928503156, 928334594, 928161621, 928085268, 928095877, 928128302, 928113282, 928049505, 927977741, 927874982, 927771747, 927697957, 927596211, 927471757, 927341878, 927169859, 926965237, 926784575, 926667690, 926579475, 926439047, 926251769, 926102817, 926061809, 926095307, 926096022, 926059127, 926052451, 926118553, 926243305, 926359951, 926452458, 926504433, 926509142, 926530182, 926576316, 926622391, 926657617, 926667511, 926639199, 926592350, 926581562, 926593959, 926559925, 926441193, 926270962, 926127791, 926067114, 926081002, 926084518, 926004171, 925886512, 925836504, 925834000, 925743699, 925563455, 925417066]
2577.8I25417066l3379P0393K5928j17421j42097m7148R060o1154j65284j50800l7610
2600.2I24767554k1160j36018j54793q3864q7380q5712l2663k7478j02102k08319k20775
2622.6I23607290j30713o7353p3135r3937p6831m5299k4021j8895J1683N4896m77q5473
2647.1I23057735q9049n7996o5505r2030r8884q6367r7334j05143m5598k9206n4359
2669.5I22236264j0550K38q5890j38104j11818p5221l7671l9696j01626j21773p5578
2692I21438575p5221j37866j08957j0133q2672k25722k27273j75178j19150j18613
2712.4I20157790j83701j97113k19524l14057l66866k85030j35719m8340o8188j68561
2732.8I18170691k56479k46525j79172j46687j76251k28107k51889k32935k32339k78532
$$ y = [925417066, 925383687, 925454080, 925480008, 925362587, 925220490, 925173342, 925182402, 925121248, 924955964, 924805164, 924767554, 924746394, 924610376, 924455583, 924371719, 924284339, 924198627, 924165964, 924138486, 924036384, 923828065, 923607290, 923476577, 923409224, 923336089, 923242152, 923165321, 923120022, 923096001, 923077106, 923088789, 923143685, 923143208, 923057735, 922968686, 922910690, 922845185, 922753155, 922654271, 922567904, 922470570, 922365427, 922319829, 922290623, 922236264, 922225714, 922225952, 922140062, 922001958, 921890140, 921814919, 921777248, 921737552, 921635926, 921514153, 921438575, 921363354, 921225488, 921116531, 921106398, 921023726, 920798004, 920570731, 920395553, 920276403, 920157790, 919974089, 919776976, 919557452, 919243395, 918876529, 918591499, 918455780, 918407440, 918339252, 918170691, 917914212, 917667687, 917488515, 917341828, 917165577, 916937470, 916685581, 916452646, 916220307, 915941775]
2753.2I15941775l50177m20690l91841l26395l71397m62472m79579m04775l63767m58420
2773.5I11912262n23865n46694o70015p67887p72357p27654o76393p12276q23915r07361
2793.9I04783845r60946j083255j144886j041710j011432j160025j347542j514792
2810.3H95519257j699567j913846k075910k251685k653480l187596l705442m342616
2826.6H73689115n208790o434739q247971j0785342j4312684j9348979k6105523l2581330
2842.9G50663757l2028556j5328228J5320182M0073097M4164598L4425616K3264050
2857.2H60554516J4887870Q854746M495025J462281o24061k064168k998829l645897
2873.5H80921483m257798m933536n589187o099582o500185o809353o994784p104993
$$ y = [915941775, 915591598, 915170908, 914779067, 914452672, 914081275, 913618803, 913139224, 912734449, 912370682, 911912262, 911388397, 910841703, 910171688, 909403801, 908631444, 907903790, 907227397, 906515121, 905691206, 904783845, 903822899, 902739644, 901594758, 900553048, 899541616, 898381591, 897034049, 895519257, 893819690, 891905844, 889829934, 887578249, 884924769, 881737173, 878031731, 873689115, 868480325, 862045586, 853797615, 843012273, 828699589, 809350610, 783245087, 750663757, 718635201, 703306973, 718627155, 758700252, 802864850, 837290466, 860554516, 875442386, 884297132, 888792157, 890254438, 889630377, 887566209, 884567380, 880921483, 876663685, 871730149, 866140962, 860041380, 853541195, 846731842, 839737058, 832632065]
2889.8H32632065p101655o996334o982446p341742q216560r709120j2140989j5555680
2906.1G58587539j9391656k2147000k0501613j0769367N910039K1957099L0562580
2920.4G44207621L1557381K8591633K4565756K0832181J7828226J5268564J2835026
2934.7H95686388J0557592Q519590O651461M867017L188074J700580O12915M3153q4102
2953I31742668J19865M20630O51121R70781J447260J844824J963317J836777J549721
2971.4I42546964J189589Q74818O22212L83556J61887O4849N7996L1113j8894q9526
2991.8I45824564j82748k65658k44081j94192k24829k65241k70187k49148k00808j65820
3012.1I43561852j68562j56224j22130j24275j90258k46287k59220j97888j06931j17063
$$ y = [832632065, 825530410, 818534076, 811551630, 804209888, 795993328, 786284208, 774143219, 758587539, 739195883, 717048883, 696547270, 685777903, 691687942, 713645041, 744207621, 775765002, 804356635, 828922391, 849754572, 867582798, 882851362, 895686388, 906243980, 914763570, 921415031, 926282048, 929470122, 931170702, 931783617, 931826770, 931742668, 931862533, 932283163, 932934284, 933905065, 935352325, 937197149, 939160466, 940997243, 942546964, 943736553, 944611371, 945233583, 945617139, 945779026, 945843875, 945901871, 945932984, 945914090, 945824564, 945641816, 945376158, 945132077, 944937885, 944713056, 944447815, 944177628, 943928480, 943727672, 943561852, 943393290, 943237066, 943114936, 942990661, 942800403, 942554116, 942294896, 942097008, 941990077, 941873014]
3032.5I41873014j43170j26183j69158k62022k14756q5592q9467j42753k02656k31862
3052.9I40205395j42395j03772j44124q8632r716k5928r0778j64151j65343l0518M4287
3075.4I39284325j6630N662K9505q5235k10941k10464q7857p6532j42038p6115j1504
3097.8I38402176Q881o3002k23696j91808o8426r3699j83284j78933q0884j5258L039
3120.2I37315106k4139p6592r8527j11163j12474q9526r6738j24157j27792j30117
3140.6I36323881o5446k5570j34707j49727q3804k32577l64423j86860l6538j69516
3161I34874713l21447k97308j92523q3387o4969j61231k21372k00629j74939k01703
3181.4I32955205k55286l05176l23057k72393k03371j88470j61052j08957j79470k29537
$$ y = [941873014, 941729844, 941603661, 941434503, 941172481, 940957725, 940872133, 940782666, 940639913, 940437257, 940205395, 940063000, 939959228, 939815104, 939726472, 939716756, 939690828, 939600050, 939435899, 939270556, 939240038, 939284325, 939267695, 939273357, 939302862, 939217627, 939006686, 938796222, 938708365, 938631833, 938489795, 938413680, 938402176, 938411057, 938348055, 938124359, 937932551, 937864125, 937770426, 937587142, 937408209, 937327325, 937312067, 937315106, 937290967, 937214375, 937115848, 937004685, 936892211, 936802685, 936705947, 936581790, 936453998, 936323881, 936258435, 936232865, 936098158, 935948431, 935864627, 935632050, 935267627, 935080767, 935044229, 934874713, 934553266, 934255958, 934063435, 933980048, 933915079, 933753848, 933532476, 933331847, 933156908, 932955205, 932699919, 932394743, 932071686, 931799293, 931595922, 931407452, 931246400, 931137443, 930957973, 930728436]
3201.8I30728436r4057L5048M1664O7293J73152K16424J44839O8844J33097K89738
3222.2I31804478K75612J22309J08421J37388P9215J26004K39015K14815J18732Q3328
3242.6I33309317Q9883N1320j8954k7240p4684q4996R0181Q4877j26183k00390k10762
3265I32882369j75298p6472p2301p8797o4194j28389k16126k17796j04844n4419j09256
3287.5I31584477j23798j17004j26005j44243j14918R716O5446L4094J11580J84416
3307.8I31363761Q8394J848Q3327J38879M4048M77j7047n0426P2956J79529R6262K8729
3332.3I32030737M7028M6134l0517r3281m173K2888p7605q7499r3520j35124j58369
3354.8I31466699j23859m768N483j28507k35796k35319j33038p6234j98126k82645
$$ y = [930728436, 930634379, 930669427, 930711091, 930778384, 930951536, 931167960, 931312799, 931381643, 931514740, 931804478, 932080090, 932202399, 932310820, 932448208, 932527423, 932653427, 932892442, 933107257, 933225989, 933309317, 933399200, 933450520, 933431566, 933404326, 933329642, 933244646, 933334827, 933419704, 933293521, 933093131, 932882369, 932707071, 932630599, 932558298, 932479501, 932415307, 932286918, 932070792, 931852996, 931748152, 931693733, 931584477, 931460679, 931343675, 931217670, 931073427, 930958509, 930968225, 931033671, 931067765, 931179345, 931363761, 931452155, 931454003, 931537330, 931676209, 931720257, 931720734, 931703687, 931653261, 931726217, 931905746, 932002008, 932030737, 932077765, 932123899, 932093382, 932000101, 931995928, 932018816, 931941211, 931853712, 931760192, 931625068, 931466699, 931342840, 931338072, 931343555, 931215048, 930979252, 930743933, 930610895, 930534661, 930336535, 930053890]
3375.1I30053890j90258j30654j88529k60234j52707k2411j28091j61290J1802J71899
3395.5I29003417K71440K62022K45750L79384M00364K55048K58982L51310L73304L72231
3415.9I32173252L71635L49164L55721L61442K26140P1287Q0645J13607N8293J35243
3436.3I34296429K99096K33472J08540M5716n5849l0637P7129Q6128M3690M8161P3493
3458.8I35225368l756j00493m6432P5400J48654J95086J42395K3127J7345O0260P2181
3481.2I35809135N4360l6895j06991l3974Q3088J30892J53780J41204R6738J25170
3501.6I36416507J29521J5616o1512q1837Q106R5666K9385K1040N8890k4856j06155
3524I36500371O4492K81930K72453J78515K7061o1274O020m1008j65462r5069J23500
$$ y = [930053890, 929863632, 929732978, 929544449, 929284215, 929131508, 929109097, 928981006, 928819716, 928831518, 929003417, 929274857, 929536879, 929782629, 930162013, 930562377, 930817425, 931076407, 931427717, 931801021, 932173252, 932544887, 932894051, 933249772, 933611214, 933837354, 933908641, 933989286, 934102893, 934161186, 934296429, 934595525, 934828997, 934937537, 934983253, 934927404, 934896767, 934973896, 935060024, 935103714, 935151875, 935225368, 935221612, 935121119, 935074687, 935150087, 935298741, 935493827, 935636222, 935659349, 935676694, 935736954, 935809135, 935863495, 935826600, 935719609, 935685635, 935768723, 935899615, 936053395, 936194599, 936291337, 936416507, 936546028, 936561644, 936500132, 936418295, 936426401, 936522067, 936551452, 936572492, 936631382, 936606526, 936500371, 936564863, 936846793, 937119246, 937297761, 937324822, 937263548, 937269568, 937228560, 937063098, 936968029, 937091529]
3546.4I37091529K53380J46806m5478o3062j2755L57J19984J72913p8797j44303L27528
3568.9I37768102M79817J50383q7977q0287n3943j5139N6744Q881p4208m5240k8670
3591.3I38078463N3883J83701Q9228j14202j15097r238l8505P0214L51906J82927j18673
3613.7I38614607n6327J24336M08411M35352O8367j90974k16424K6762K36810J13844
3634.1I39564764n9068k6881K9504l278n484q285k0087L5525M6551L1948P4208J01864
3658.6I39761281N4836l9518q4757m2141K6047L9220m8876j4901J95325J98841r120
3681I40036237j59800j31070k2352L3915M8935J04010J22190L7372k5690L2902l1948
3703.5I40044701j23680p5578r6441o1810J0670j15335j31071J16766K61306N6684
$$ y = [937091529, 937344909, 937491715, 937446237, 937383175, 937370420, 937370777, 937490761, 937663674, 937584877, 937440574, 937768102, 938247919, 938398302, 938310325, 938230038, 938176095, 938160956, 938217700, 938226581, 938152373, 938107133, 938078463, 938132346, 938316047, 938405275, 938291073, 938175976, 938166738, 938128233, 938198447, 938550353, 938733280, 938614607, 938558280, 938682616, 939091027, 939526379, 939594746, 939403772, 939187348, 939214110, 939450920, 939564764, 939505696, 939478815, 939508319, 939505041, 939499557, 939491272, 939471185, 939506710, 939553261, 939585209, 939659417, 939761281, 939816117, 939776599, 939691842, 939649701, 939675748, 939714968, 939666092, 939651191, 939846516, 940045357, 940036237, 939876437, 939745367, 939723015, 939756930, 939805865, 939909875, 940032065, 940069437, 940043747, 940076649, 940044701, 939921021, 939845443, 939749002, 939687192, 939697862, 939582527, 939451456, 939568222, 939829528, 939886212]
3723.9I39886212l9994J41739J47820p1287k48611j95563J907j5854j21594M9174K41697
3746.3I39775646J15514j5498j16467r9659l7968j2815J29699K21551J56104N8711
3766.7I40174818j23143j47462R4593Q0049j20223j28686m7327K5928P2063M4822O1393
3789.1I39986825R1553j0908j37508j03175M6253J30772L100j04428n4359P8559J51813
3811.6I40078497K7060k41458k53618K0206J15276L516m8637J5259J99556L09467J76072
3834I40401196l7133k03550k79784j98484j1801J26957M2737p2241j1682o9082j41442
3856.4I39545691q94J30415J54018L6598j17600n3168J29581k2590p5818J51456L5882
3878.9I39913571k26200k5511K37644J44482l8326j13845n4657N9783P2122Q5175L4392
$$ y = [939886212, 939846218, 939987957, 940135777, 940064490, 939815879, 939620316, 939622223, 939606369, 939484775, 939533949, 939775646, 939891160, 939875662, 939759195, 939659536, 939621568, 939608753, 939738452, 939960003, 940116107, 940174818, 940051675, 939904213, 939998806, 940078855, 939958632, 939829946, 939782619, 939808547, 939880610, 939925432, 939986825, 940078378, 940067470, 939929962, 939826787, 939873040, 940003812, 940006912, 939902484, 939848125, 939926684, 940078497, 940105557, 939864099, 939610481, 939630687, 939745963, 939749479, 939700842, 939716101, 939915657, 940225124, 940401196, 940364063, 940160513, 939880729, 939682245, 939670444, 939797401, 939840138, 939767897, 939756215, 939687133, 939545691, 939544797, 939675212, 939829230, 939865828, 939748228, 939695060, 939824641, 939802051, 939726233, 939877689, 939913571, 939687371, 939661860, 939899504, 940043986, 940005660, 939891815, 939837158, 939896941, 939969063, 940054238, 940088630]
3901.3I40088630k70546k62677J44422K45690J10865j192j31310q5890O3479O0678
3921.7I39962149P3015O0022o3598j81377j99020m8935R8526J76907J91331P152j45912
3944.1I39930260p5817J8239J12951J11878k9862l9935J21712J83046J28925Q1122
3964.5I40542519r9003k63334k10523p7665R7871J74284R0420k384q226N2572j4603
3986.9I40281928j35541q5414l3796M5300J94549
3997.1I40267026
$$ y = [940088630, 939818084, 939555407, 939699829, 939945519, 940056384, 940055192, 939923882, 939837992, 939901471, 939962149, 940035164, 940095186, 940031588, 939850211, 939651191, 939602256, 939700782, 939877689, 940069020, 940076172, 939930260, 939854443, 939872682, 939985633, 940097511, 940067649, 940027714, 940149426, 940332472, 940461397, 940542519, 940443516, 940180182, 939969659, 939891994, 939989865, 940164149, 940254569, 940252185, 940243959, 940296531, 940281928, 940146387, 940060973, 940027177, 940072477, 940267026]
##END=$$ End of the data block
