##TITLE=$$ Begin of the data block
##JCAMP-DX=5.00 $$ ACD/SpecManager v 10.08
##SPECTROMETER/DATA SYSTEM=MB Serie
##DATE=02 Mar 2010 08:37:32
##DATA TYPE=INFRARED SPECTRUM
##DATA CLASS=XYDATA
##ORIGIN=
##OWNER=
##NPOINTS=3734
##FIRSTX=400.19995117
##LASTX=4000.07055664
##MAXX=4000.07055664
##MINX=400.19995117
##MAXY=84.49696350
##MINY=8.46003628
##XFACTOR=1.0000000000
##YFACTOR=0.000000100000000
##FIRSTY=74.70996857
##DELTAX=0.96433717
##XUNITS=1/CM
##YUNITS=TRANSMITTANCE
##XYDATA=(X++(Y..Y))
400.2G47099686k600632m557953M519959M330444k271500L420105O678696k8992k481155
$$ 747099686 744499054 739941101 744461060 748791504 746520004 749940109 756618805 756589813 754108658
408.9G54108658L23715M719391N442734j952133n523682K041321Q795852M107895p524872
$$ 754108658 754432373 759151764 764594498 762642365 757118683 759160004 767955856 772063751 764538879
417.6G64538879r814987J1408005J2052383l628769p775497K073898Q026581K458649
$$ 764538879 754723892 766131897 778184280 774555511 766780014 768853912 776880493 779339142
425.3G79339142j636582p24182N242234P084808k459107p211990J020813O599579J817245
$$ 779339142 777702560 776978378 782220612 789305420 786846313 779634323 780655136 787254715 789071960
434G89071960l822860k128449M754181M895325j785736m148255K479859Q064270J413727
$$ 789071960 785249100 783120651 787874832 792770157 790984421 786836166 789316025 797380295 798794022
442.6G98794022o082001p35550O340332L063507m861603n290985K375412Q117371K955475
$$ 798794022 792712021 791976471 798316803 801380310 796518707 791227722 793603134 801720505 804675980
451.3H04675980o150437n006561N667267O180801l374481q196487J800003J1099777
$$ 804675980 798525543 793518982 799186249 805367050 801992569 793796082 795596085 806695862
459H06695862J532821q162841k580796O283722L916931m076995p050095O16074P627334
$$ 806695862 808228683 800065842 797485046 803768768 807685699 803608704 796558609 797174683 804802017
467.7H04802017K117005o649475l335648N139007L161927l915329l762970J274338
$$ 804802017 806919022 800269547 796933899 802072906 805234833 801319504 797556534 798830872
475.4G98830872O591568J325225o966858k987518N495758N518799k298202p236863
$$ 798830872 805422440 806747665 799780807 796793289 802289047 807807846 805509644 798272781
483.1G98272781j59454O531525L75366o887589m420395M246064N335464k354431o803436
$$ 798272781 798113327 804644852 805020218 798132629 793712234 797958298 803293762 800939331 794135895
491.8G94135895r32465P037811J737442p897110m859619L786698M371872l190613p556610
$$ 794135895 793203430 800241241 801978683 794081573 789221954 793008652 797380524 794189911 786633301
500.5G86633301k603073N909118L355484m859161n508575Q2015L962937j061478p102356
$$ 786633301 784030228 789939346 793294830 788435669 782927094 783009109 786972046 785910568 778808212
509.2G78808212l356857N593872L879166n636673o351319P78351M119797j502838p021713
$$ 778808212 775451355 781045227 784924393 779287720 772936401 773714752 777834549 776331711 769309998
517.8G69309998l044053L127442K222595n046921o471939N09415L964767j855850p946777
$$ 769309998 766265945 769393387 771615982 766569061 760097122 760606537 764571304 762715454 754768677
526.5G54768677l816223L032379L878097l638992p827911k093201K739258m29764o605606
$$ 754768677 750952454 753984833 757862930 754223938 746396027 744302826 747042084 746612320 740006714
535.2G40006714n283814K987137M094925m186325q647919k941513L230744j94321o521378
$$ 740006714 734722900 737710037 741804962 737618637 728970718 726029205 729259949 729065628 722544250
543.9G22544250o257705l88870K701797k779999p282638l382874J610642l05329n848236
$$ 722544250 716286545 715897675 718599472 715819473 708536835 705153961 706764603 706459274 700611038
552.6G00611038n544510k21786J163101l494263p851715n406799M15115J066742m782944
$$ 700611038 695066528 694844742 696007843 692513580 684661865 679255066 679670181 680736923 675953979
561.2F75953979q154983k962799J690292k144394p490081o163559n02015O20041m518814
$$ 675953979 667798996 664836197 666526489 664382095 656892014 650728455 650226440 650846481 646327667
569.9F46327667p895584n038795q17948k092819o702919p900734m159241q64410l942566
$$ 646327667 638432083 633393288 632575340 630482521 623779602 615878868 611719627 610855217 606912651
578.6F06912651q093567o591644k150688k108345o983490q940850n539360k980232
$$ 606912651 598819084 592227440 590076752 587968407 580984917 572044067 566504707 563524475
586.3E63524475n492821r019889q429223m491615m059029r199676j1039467q220482
$$ 563524475 558031654 549011765 540582542 536090927 532031898 522832222 511792755 503572273
594E03572273n955887p029342j0516205j0968666p984314p900276j1919403j4329567
$$ 503572273 497616386 490587044 480070839 469102173 461117859 453217583 441298180 426968613
601.7D26968613j2887383j1100197j2644004j6036950j7659111j6713791j5364494
$$ 426968613 414081230 402981033 390337029 374300079 356640968 339927177 324562683
608.5C24562683j6669388j8854751j7125302j3784923j1813469j0237026p554226k265969
$$ 324562683 307893295 289038544 271913242 258128319 246314850 236077824 228523598 226257629
616.2B26257629L408051Q149300J1606788J3433285J5512028J7685280J8365840J5997754
$$ 226257629 229665680 237814980 249421768 262855053 278367081 296052361 314418201 330415955
623.9C30415955J3421211J3707886J3586654R263268L926162K623101J720123l090210
$$ 330415955 343837166 357545052 371131706 380394974 384321136 386944237 388664360 385574150
631.6C85574150r504318j2892685j1980438j0323143r010163n767135O30836Q438645
$$ 385574150 376069832 363177147 351196709 340873566 331863403 326096268 326727104 335165749
639.4C35165749J4644088J6177941J5424461J6381950J7850647J7029267J3580894
$$ 335165749 349809837 365987778 381412239 397794189 415644836 432674103 446254997
646.1D46254997J1139641J2987747J6694603J6137772J1019478R022407J2477989J3078614
$$ 446254997 457394638 470382385 487076988 503214760 514234238 523256645 535734634 548813248
653.8E48813248P879600M297676O423302J0604935J0379600M349022J899147P068405
$$ 548813248 556692848 560990524 567413826 578018761 588398361 592747383 594646530 601714935
661.5F01714935J0109597O233596J019059L218803P782936P001343K371597K155190
$$ 601714935 611824532 618058128 619077187 622295990 630078926 637080269 639451866 641607056
669.3F41607056O169967R026413O171799N75714M31824O637039R352112L727569j102981
$$ 641607056 647777023 656803436 662975235 663550949 663982773 670619812 679971924 683699493 682596512
677.9F82596512K428818P990417P080231J181717q66013M580307Q892899M918823j065979
$$ 682596512 685025330 693015747 700095978 701277695 700411682 704991989 713884888 718803711 717737732
686.6G17737732N82733P293396P941971O71539k940140K867127Q326569N906295n07354
$$ 717737732 718320465 725613861 733555832 734227371 731287231 734154358 742480927 748387222 747879868
695.3G47879868j983567M669495Q769989K892761l194046j60751P239227P141647j012954
$$ 747879868 745896301 750565796 759335785 762228546 759034500 758873749 766112976 773254623 772241669
704G72241669l390961L968124Q318329L309021k967224j526871N329895P009583L08075
$$ 772241669 768850708 772818832 781137161 784446182 781478958 779952087 785281982 792291565 792599640
712.6G92599640m080200J445388P867051N090637k890778l686142L949204P485504
$$ 792599640 788519440 789964828 797831879 802922516 800031738 796345596 800294800 807780304
720.4H07780304J797333l659668j130448N985718P442551n8212m656601R24453O835099
$$ 807780304 809577637 805917969 804787521 810773239 818215790 818157578 813500977 814425430 821260529
729H21260529L761825l207779k966766M053573O892624Q08640n074692j439361O099090
$$ 821260529 825022354 821814575 818847809 822901382 829794006 830602646 825527954 824088593 830187683
737.7H30187683N252457k595215m848328J297150O339874K479859m584732l562012
$$ 830187683 835440140 832844925 827996597 829293747 835633621 838113480 833528748 829966736
745.4H29966736M142303O100540j061096n582885n49393O000442L932801l660126m734573
$$ 829966736 834109039 840209579 839148483 833565598 833016205 839016647 842949448 839289322 834554749
754.1H34554749K334747O093979N17807m833374k031098L923798M409027k108231n808792
$$ 834554749 836889496 842983475 843501282 838667908 836636810 840560608 844969635 842861404 837052612
762.8H37052612m68597N333862K383957m427414m670029K023850N184479o92520o024476
$$ 837052612 836584015 841917877 844301834 839874420 835204391 837228241 842412720 841720200 835695724
771.5H35695724k641983M283600M336396k749024n310898O80542N303955J339951n321274
$$ 835695724 833053741 837337341 841673737 838924713 833613815 834294357 839598312 840938263 835616989
780.2H35616989m023132L235779M918670j003570n690003k235336M241028L275451
$$ 835616989 831593857 834829636 839748306 838744736 833054733 830819397 835060425 838335876
787.9H38335876l849182n458679P10449M846650P93380n076675l547363K942657L988876
$$ 838335876 834486694 829028015 829738464 834585114 835378494 830301819 826754456 829697113 833685989
796.5H33685989k183532n782013j234589M657211K638932m138871m676055J202774
$$ 833685989 831502457 825720444 824485855 829143066 831781998 827643127 822967072 824169846
804.3H24169846M102706j21917n507584l329697L514405L579178l230133n935975n02319
$$ 824169846 828272552 828150635 822643051 819313354 822827759 826406937 823176804 817240829 816738510
812.9H16738510M362335J092377n328598m765701J515503L497696j027527n182572
$$ 816738510 821100845 822193222 816864624 812098923 813614426 817112122 816084595 810902023
820.7H10902023k360763L264465K338638l745193n549927l68652M016723Q65403n237351
$$ 810902023 808541260 811805725 814144363 810399170 804849243 804480591 808497314 809362717 804125366
829.3H04125366m578705K112046L776168k364196o411362k406311L269882K210541
$$ 804125366 799546661 801658707 805434875 803070679 796659317 794253006 797522888 799733429
837G99733429m008560o112824p95593L548584j7395n339355l926239J398315K710876
$$ 799733429 795724869 789612045 788816452 792365036 792347641 787008286 783082047 784480362 787191238
845.7G87191238j982269n796661k650605K531586J225739m594040n746231n34897L048859
$$ 787191238 785208969 779412308 776761703 779293289 780519028 775924988 770178757 769643860 772692719
854.4G72692719n71824n322113l712463J709137K524795k759094o039886k515106K369155
$$ 772692719 772120895 766798782 763086319 764795456 767320251 764561157 758521271 756006165 758375320
863.1G58375320R78623m755936n349884J52512K515106j608353n380401l370972J134796
$$ 758375320 759353943 754598007 749248123 749400635 751915741 750307388 744926987 741556015 742690811
871.8G42690811J174164l635254n717621j785736K169418J81962m445496m200211N02549
$$ 742690811 743864975 740229721 734512100 732726364 734895782 735077744 730632248 726432037 726934586
880.4G26934586K346649j357270m852752k935791J537933J435394l296890n119324
$$ 726934586 729281235 727923965 723071213 720135422 721673355 723108749 719811859 714692535
888.2G14692535j217956K220001j34888m539108m435959P8507K126693j992263n539246
$$ 714692535 713474579 715694580 715559692 711020584 706584625 706663132 708789825 706797562 701258316
896.8G01258316k836533J461716P18689l761825m751511p01523J945572q27103m766006
$$ 701258316 698421783 699883499 700602188 696840363 692088852 691387329 693332901 692505798 687739792
905.5F87739792m013367L29132J483689k307816m939041k762680O72531N30472k847901
$$ 687739792 683726425 684055557 685539246 683231430 678292389 675529709 676202240 676732712 673884811
914.2F73884811m754333j825638J491928j114883n109940l694458K88544R79767k389221
$$ 673884811 669130478 667304840 668796768 667681885 662571945 658877487 659166031 660145798 657756577
922.9F57756577m674073k062072P67364m41666l458404m301987j458664J076889r21860
$$ 657756577 653082504 651020432 651787796 651346130 647887726 643585739 642127075 643203964 642282104
931.6F42282104m478836l646621J78070P08084k565918m763069k815514N52139M3526
$$ 642282104 637803268 634156647 634334717 635042801 632476883 627713814 624898300 625450439 625493965
940.2F25493965l516044m334755j352845P00913j237106m136048l698311p28721J53427
$$ 625493965 621977921 617643166 616290321 616991234 615754128 611618080 607919769 607191048 607344475
948.9F07344475k396355m278488k530327J84898l77845l434525m276161j718559K36664
$$ 607344475 604948120 600669632 598139305 598324203 597946358 594511833 590235672 588517113 588753777
957.6E88753777j465226m219093l402672k47345J35994k918320m599456k355652j09863
$$ 588753777 587288551 583069458 579666786 579419441 579555435 576637115 572037659 569682007 569572144
966.3E69572144q42324l429260m269142j695900j8349k129974m536743l940049j070060
$$ 569572144 568729820 565300560 561031418 559335518 559317169 557187195 552650452 548710403 547640343
975E47640343M28428j823349l739509k143402l25585j365204l670616l964271j889382
$$ 547640343 548068771 546245422 542505913 540362511 540036926 538671722 535001106 531036835 529147453
983.6E29147453m50248k064095m149094l244018r90219q09059k723923l723946k214279
$$ 529147453 528697205 526633110 522484016 519239998 518249779 517440720 514716797 510992851 508778572
992.3E08778572n05257j367302l398284l441964j405105m45404k386322m294129l157196
$$ 508778572 508273315 506906013 503507729 500065765 498660660 498215256 495828934 491534805 488377609
1001D88377609r35631j077079l149529l855552k110482j005058k032623l528366l463479
$$ 488377609 487441978 486364899 483215370 479359818 477249336 476244278 474211655 470683289 467219810
1009.7D67219810j668396j102600k404632l679276l392448j661682j312981l169403
$$ 467219810 465551414 464448814 462044182 458364906 454972458 453310776 451997795 448828392
1017.4D48828392l908501k239074j252785k266617l666725l417778j756401j217880
$$ 448828392 444919891 442680817 441428032 439161415 435494690 432076912 430320511 429102631
1025.1D29102631k516785l874817l241196j709709j762619l298988l957024k706222
$$ 429102631 426585846 422711029 419469833 417760124 415997505 412698517 408741493 406035271
1032.8D06035271j565628k252007l755035l727036k254181j545410k737579m034157
$$ 406035271 404469643 402217636 398462601 394735565 392481384 390935974 388198395 384164238
1040.5C84164238l135643j629562k140656l572845l626480k898751k370949k650756
$$ 384164238 381028595 379399033 377258377 373685532 370059052 367160301 364789352 362138596
1048.2C62138596l672448l805198l023033k476845k961579l686790l224754k715607
$$ 362138596 358466148 354660950 351637917 349161072 346199493 342512703 339287949 336572342
1056C36572342l171158l635635l686371l206520k683640l175392m099502l886033k870903
$$ 336572342 333401184 329765549 326079178 322872658 320189018 317013626 312914124 309028091 306157188
1064.6C06157188k800827l697013m260560l830680l181820l263760l814697m182701
$$ 306157188 303356361 299659348 295398788 291568108 288386288 285122528 281307831 277125130
1072.4B77125130l987389l460102l748074m533176m457970m058189l894291m210720
$$ 277125130 273137741 269677639 265929565 261396389 256938419 252880230 248985939 244775219
1080.1B44775219m490547m095535l561650l549042m146194m528866m306259m141674
$$ 244775219 240284672 236189137 232627487 229078445 224932251 220403385 216097126 211955452
1087.8B11955452m538498m808884m682083m499397m382191m325886l991069l435536
$$ 211955452 207416954 202608070 197925987 193426590 189044399 184718513 180727444 177291908
1095.5A77291908l289852l470802l817902m235763m179755l615541l151712l067875
$$ 177291908 174002056 170531254 166713352 162477589 158297834 154682293 151530581 148462706
1103.2A48462706k873621k659026k496357k867803l734198l888330m060288m407987
$$ 148462706 145589085 142930059 140433702 137565899 133831701 129943371 125883083 121475096
1110.9A21475096m002400l792104l875580l371954l127070k982998k333326k093887
$$ 121475096 117472696 113680592 109805012 106433058 103305988 100322990 97989664 95895777
1118.6I5895777j925001j646004j508799j162090j009970j105461r16157n81169m86040
$$ 95895777 93970776 92324772 90815973 89653883 88643913 87538452 86622295 86041126 85555086
1127.3H5555086n46808m07915M5357N94663J112299J246777J568145K355433K764244
$$ 85555086 85008278 84600363 84645720 85240383 86352682 87599459 89167604 91523037 94287281
1136I4287281K957706L268700L603144L630800L471441L668709L849087L545694L256760
$$ 94287281 97244987 100513687 104116831 107747631 111219072 114887781 118736868 122282562 125539322
1144.7A25539322L348389L329925L022347K505655K076912K165727K377720K326832
$$ 125539322 128887711 132217636 135239983 137745638 139822550 141988277 144365997 146692829
1152.4A46692829J876726J507254J625662J873255J881532J496029J618843K371340
$$ 146692829 148569555 150076809 151702471 153575726 155457258 156953287 158572130 160943470
1160.1A60943470K385979K033710K272568K719784L115406L642864M040642M114380
$$ 160943470 163329449 165363159 167635727 170355511 173470917 177113781 181154423 185268803
1167.8A85268803M368877N016785N575638N856666O364536O964188P210922P068272
$$ 185268803 189637680 194654465 200230103 206086769 212451305 219415493 226626415 233694687
1175.5B33694687O844292O873092O999512O615906N712032N771332O573486O769028
$$ 233694687 240538979 247412071 254411583 261027489 266739521 272510853 279084339 285853367
1183.3B85853367O225433M832630L742085M064846M407768L532887K509956K217217
$$ 285853367 292078800 296911430 300653515 304718361 309126129 312659016 315168972 317386189
1191C17386189K414932K660618K199745J655082K207451L002510K965088K358589K299042
$$ 317386189 319801121 322461739 324661484 326316566 328524017 331526527 334491615 336850204 339149246
1199.6C39149246L051262L259239K725983K395973K520981K922745K947502K242927
$$ 339149246 342200508 345459747 348185730 350581703 353102684 356025429 358972931 361215858
1207.4C61215858J712761J977158K485657K244339J436805J458321K260246K442627
$$ 361215858 362928619 364905777 367391434 369635773 371072578 372530899 374791145 377233772
1215.1C77233772J720505J042900J144905K007408K376595J428490O72531J284523
$$ 377233772 378954277 379997177 381142082 383149490 385526085 386954575 387627106 388911629
1222.8C88911629K011032J724777R19075P03545J653022K292443J359062M78058Q55408
$$ 388911629 390922661 392647438 393566513 394270058 395923080 398215523 399574585 400052643 400908051
1231.5D00908051J619262J850662J000100K35405J016311J854248J392098N19752M96025
$$ 400908051 402527313 404377975 405378075 405613480 406629791 408484039 409876137 410395889 410891914
1240.2D10891914J515465J866913R23119J87683N82084J715966J802444P17201L74375
$$ 410891914 412407379 414274292 415197411 415385094 415967178 417683144 419485588 420202789 420577164
1248.8D20577164J144142J840172J377296M78134N67894J364289J639518R67179L34282
$$ 420577164 421721306 423561478 424938774 425416908 425984802 427349091 428988609 429955788 430290070
1257.5D30290070P02934J455803J520233N77965L2921R75227J604729Q94432J40686
$$ 430290070 430993004 432448807 433969040 434547005 434579926 435555153 437159882 438054314 438195000
1266.2D38195000M27742J504516J712418O68754m0550M57459J397056J547280P07550
$$ 438195000 438622742 440127258 441839676 442508430 442467880 442925339 444322395 445869675 446577225
1274.9D46577225O8893O65894J589546J354027K99110K98195J310959J502228Q37631
$$ 446577225 446646118 447312012 448901558 450255585 450554695 450852890 452163849 453666077 454503708
1283.5D54503708L14789O17027J369705J462097O68946l5324N51986J441193J074028
$$ 454503708 454818497 455435524 456805229 458267326 458936272 458900948 459452934 460894127 461968155
1292.2D61968155K46849K61192J105805J530761P57103R7161N14030J141548J035042
$$ 461968155 462215004 462476196 463582001 465112762 465869865 465967026 466481056 467622604 468657646
1300.9D68657646M63486K07329N74379J221389J163369K63214j73836P52182J531754
$$ 468657646 469121132 469328461 469902840 471124229 472287598 472550812 472376976 473129158 474660912
1309.6D74660912Q77265j22528k555J101226J419678P23229M1770L80326J219406J001472
$$ 474660912 475538177 475415649 475413094 476514320 477933998 478657227 478698997 479079323 480298729 481300201
1319.2D81300201K24991R1515Q12187J346474P59468L776K73819J149483J328888M03442
$$ 481300201 481525192 481616707 482428894 483775368 484534836 484538612 484812431 485961914 487290802 487694244
1328.9D87694244l86428K91252J431846J179352J1826j74446N21431J085472Q06579
$$ 487694244 487307816 487599068 489030914 490210266 490222092 490047646 490569077 491654549 492461128
1337.5D92461128k34871m90265P49588J654206Q12492J00784N04914J031914J055374
$$ 492461128 492226257 491735992 492485580 494139786 494952278 495053062 495557976 496589890 497645264
1346.2D97645264L46412j59797K75802J124497R06105k42043k12478Q83979J342202
$$ 497645264 497991676 497831879 498107681 499232178 500138283 499896240 499683762 500567741 501909943
1354.9E01909943N38139j86577K32582J167870J051330j91879n98183k73132Q96454
$$ 501909943 502448082 502261505 502494087 503661957 504713287 504521408 503923225 503650093 504546547
1363.6E04546547J449356K07291m349P36351P56874L69759j90163K78206J172638J67007
$$ 504546547 505995903 506203194 506198845 506935196 507692070 508061829 507871666 508149872 509322510 509489517
1373.2E09489517r92203l05328Q78868J234818N46570m43230r99870o32363q46214
$$ 509489517 508497314 508191986 509070854 510305672 510852242 510409012 509409142 508776779 507930565
1381.9E07930565k569885k709732N89256L701553K805176J178551J893692J876793
$$ 507930565 505360680 502650948 503240204 506941757 509746933 510925484 512819176 514695969
1389.6E14695969J519584J186600N70869l97834r58062R17778J547928J97106p04804
$$ 514695969 516215553 517402153 517973022 517575188 516617126 517534904 519082832 519279938 518575134
1398.3E18575134J27297J502914N32684j81045P79839O84967k65694l2883L73688P43942
$$ 518575134 518702431 520205345 520738029 520556984 521336823 522021790 521756096 521723213 522096901 522840843
1407.9E22840843R37271N67055p6332k8801Q26263J002770K21977n25741k97471J238633
$$ 522840843 523778114 524345169 524268837 524240036 525066299 526069069 526291046 525765305 525467834 526706467
1417.6E26706467O9084l000260Q69408K090263R97582n30434r76944O30379J236076
$$ 526706467 526775551 523775291 524644699 526734962 527732544 527202110 526225166 526855545 528091621
1426.3E28091621J107178L72505q96225m39834J594314P77169r61838n20935J066551
$$ 528091621 529198799 529571304 528675079 528235245 529829559 530606728 529644890 529123955 530190506
1434.9E30190506j37062k440529J631317J980438J273919Q87184j27335j72920N33638
$$ 530190506 530053444 527612915 529244232 531224670 532498589 533385773 533258438 533085518 533619156
1443.6E33619156Q53615R63440J27983j492806K5101J894798O98433n75714p4654J418267
$$ 533619156 534472771 535436211 535564194 534071388 534096489 535991287 536689720 536114006 536039352 537457619
1453.3E37457619J142120R9640j677551k706528R83963J848221J552887P19070P02629
$$ 537457619 538599739 538699379 537021828 534315300 535299263 537147484 538700371 539419441 540122070
1462E40122070J557694J30272k504692N20820K418556J274872K25945L40843L73535
$$ 540122070 541679764 541810036 539305344 539826164 542244720 543519592 543745537 544086380 544459915
1470.6E44459915q38699j323204J95656K036628P46079n29099J500588Q51669J49956
$$ 544459915 543621216 542298012 542493668 544530296 545276375 544747276 546247864 547099533 547249489
1479.3E47249489P48939O35529M24919J78185J94244R18961M27322j048470K58293
$$ 547249489 547998428 548633957 549058876 549237061 549431305 550350266 550777588 549729118 549987411
1488E49987411P53747j186219R9640J726113P94219J108361J458816j200103j281548
$$ 549987411 550741158 549554939 549654579 551380692 552174911 553283272 554742088 553541985 552260437
1496.7E52260437J514130j52054P65953J408958k29377K31399J713448J408958j190376
$$ 552260437 553774567 553622513 554388466 555797424 555568047 555799446 557512894 558921852 557731476
1505.3E57731476n292854j061287L175430J458053R75228J086655p0076Q82492J064758
$$ 557731476 552438622 551377335 554552765 556010818 556986046 558072701 558002625 558885117 559949875
1514E59949875m3984l67698j694260R87816K618980j02043k723160j095085J714630
$$ 559949875 559905891 559538193 557843933 558831749 561450729 561348686 558625526 557530441 559245071
1522.7E59245071K361336O2447q41141J332245j10169n20362J630897J481476M16069
$$ 559245071 561606407 561668854 560827713 562159958 562049789 561529427 563160324 564641800 565057869
1531.4E65057869o34956k435151K65122K451744J266937P12242o76040m270287j205520
$$ 565057869 564422913 561987762 562252884 564704628 565971565 566683807 566007767 561737480 560531960
1540.1E60531960K183303m32548J057243J916275m66499J39770J334649R48600M54560
$$ 560531960 562715263 562282715 563339958 565256233 564789734 564929504 566264153 567212753 567667313
1548.7E67667313j135826m58451J088410J015014o32019k178917J344033J311760j448098
$$ 567667313 566531487 566073036 567161446 568176460 567544441 565365524 566709557 568021317 566573219
1557.4E66573219l872871l391953J080323M483184K528267J045227o01806j205063
$$ 566573219 562700348 559308395 560388718 564871902 567400169 568445396 567843590 566638527
1565.1E66638527N60379J318588M65012k425499k362786K294770J499061N4894L13721
$$ 566638527 567198906 568517494 568982506 566557007 564194221 566488991 567988052 568042946 568356667
1573.8E68356667R9220l179665k336197K454033J024781J37214p4158m77676n60913
$$ 568356667 568455887 565276222 562940025 565394058 566418839 566556053 566481895 566004219 565443306
1582.5E65443306m15154j46904l8146m26865o76956o41022o29005l41721n70183q87489
$$ 565443306 565028152 564881248 564843102 564416237 563739281 563098259 562469254 562127533 561557350 560669861
1592.1E60669861m47350m76570j039390j165772o56662k44598m43917r90257j520462
$$ 560669861 560222511 559745941 558706551 557540779 556884117 556639519 556195602 555205345 553684883
1600.8E53684883j241646r59434j115113j064949j220550j408920j064721j178245
$$ 553684883 552443237 551483803 550368690 549303741 548083191 546674271 545609550 544431305
1608.5E44431305j638222r69925p30514j132546j322059j006852q68072l828964l514290
$$ 544431305 542793083 541823158 541092644 539960098 538638039 537631187 536763115 532934151 529419861
1617.2E29419861J403770J77307k77671M25148o6719k362900j787110J450158J379890
$$ 529419861 530823631 531000938 530723267 531148415 531081696 528718796 526931686 528381844 529761734
1625.9E29761734k02026j598282L22799J082497L04527J06736M90226J236496o89926
$$ 529761734 529559708 527961426 528284225 529366722 529671249 529777985 530268211 531504707 530814781
1634.6E30814781l584137J286812J380768J433143J830636J132469P23953J022987
$$ 530814781 527230644 528517456 529898224 531331367 533162003 534294472 535018425 536041412
1642.3E36041412K056961K310219K92702r73396Q03604J915893L532410L348541K317047
$$ 536041412 538098373 540408592 540701294 539727898 540531502 542447395 545979805 549328346 551645393
1651E51645393j07307n881043J333046N681191L924446K490730J945572J344147P52106
$$ 551645393 551538086 545657043 546990089 552671280 556595726 559086456 561032028 562376175 563128281
1659.6E63128281J425552J303215l76396R50165K164650J697883J903038J622582o91986
$$ 563128281 564553833 565857048 565480652 566430817 568595467 570293350 572196388 573818970 573126984
1668.3E73126984j653481J831970J136017J289597K624511O19469k582626J092834
$$ 573126984 571473503 573305473 574441490 575731087 578355598 578975067 576392441 577485275
1676E77485275K558327J023026O70738L3493J009254J783715m58184m710312k219543
$$ 577485275 580043602 581066628 581737366 581770859 582780113 584563828 584105644 579395332 577175789
1684.7E77175789N747261K775116K61078M77295Q41675K17590N04036O95572J402740
$$ 577175789 582923050 585698166 585959244 586436539 587278214 587495804 587999840 588695412 590098152
1693.4E90098152J075325l038711l285942L415451K815132K57911p097587J107979
$$ 590098152 591173477 588134766 584848824 588264275 591079407 591337318 584239731 585347710
1701.1E85347710N727348K163925m93736o95458l59916N63087K114983P17087q33474
$$ 585347710 591075058 593238983 592745247 592049789 591689873 592252960 594367943 595085030 594251556
1709.8E94251556K20070J561470R07746q19702k070923P91588J803817k476082k185554
$$ 594251556 594471626 596033096 596940842 596121140 594050217 594841805 596645622 594169540 591983986
1718.5E91983986K990684K472725J136475k93503j003418L26271J062126L18718j32217
$$ 591983986 594974670 597447395 598583870 598290367 597286949 597613220 598675346 598994064 598861847
1727.1E98861847L12042j40343p43522J075706J086884j121063m304200J87683L489113
$$ 598861847 599173889 599033546 598290024 599365730 600452614 599331551 595027351 595215034 598704147
1735.8E98704147J189003P60613L03650j943741K28310J792373J25885l36380O09665
$$ 598704147 599893150 600653763 600957413 599013672 599241982 601034355 601160240 600823860 601433525
1744.5F01433525K21062k10648J19744k18659L54462k73400j789398J596070J922988
$$ 601433525 601654587 601443939 601563683 601345024 601699486 601426086 599636688 601232758 603155746
1753.2F03155746L06321J76811m68025n92270P38792N30586M88015k18506j247940
$$ 603155746 603462067 603638878 603170853 602578583 603317375 603847961 604335976 604117470 602869530
1761.9F02869530O63299R47457L89824P32498M85191j425362r41963J773072P36389
$$ 602869530 603532829 604480286 604870110 605602608 606087799 604662437 603720474 605493546 606229935
1770.5F06229935j498795j994095J333771J759758K441M2534M33503L03421M54444
$$ 606229935 604731140 602737045 604070816 605830574 605833015 605875549 606309052 606612473 607066917
1779.2F07066917m24499m14124P59430Q74214J56746o52237j54151M26178P52220P46040
$$ 607066917 606642418 606228294 606987724 607861938 608018684 607366447 607212296 607638474 608390694 609136734
1788.9F09136734l60222r89914j163711p16248J867828J018181n75752K10838J264763
$$ 609136734 608776512 607786598 606622887 605906639 607774467 608792648 608216896 608427734 609692497
1797.5F09692497J25466j437607p0839P71103K28996L76968R9335J07956O50787K54059
$$ 609692497 609817963 608380356 608309517 609080620 609309616 609686584 609785919 609893875 610544662 610798721
1807.2F10798721p9918j25465n91354L0708N08041N8556L967L14713N99899p2975m71497
$$ 610798721 610718803 610593338 610001984 610032692 610540733 610599289 610603256 610917969 611517868 611444893 610973396
1817.8F10973396K61154O70128L32642l28026p0610M46053p93000r12246R53216R28688
$$ 610973396 611234550 611904678 612237320 611909294 611838684 612284737 611491737 610579491 611532707 612461395
1827.4F12461395J24169j242295p36732J113052Q74825N30166L47252K0256k91328
$$ 612461395 612585564 611343269 610606537 611719589 612594414 613124580 613471832 613492088 613200760
1836.1F13200760j99547N77202O17103j69944m53072N03044P09152j866188j294860
$$ 613200760 613001213 613578415 614195518 614025574 613572502 614075546 614784698 612918510 611623650
1844.8F11623650J968269Q95653k60697j27754n340L11584O81686K86484k56233j01166
$$ 611623650 613591919 614487572 614226875 614099121 614093781 614405365 615087051 615373535 615117302 615016136
1854.4F15016136K77710M71077J74561n85900l64914N16701N24979O6452j55564J53962
$$ 615016136 615293846 615764923 615939484 615353584 614988670 615505371 616030350 616096802 615941238 616095200
1864.1F16095200N99784Q7853p80029j070290p98645R53865J374474J25923j13259
$$ 616095200 616694984 616782837 616002808 614932518 614133873 615087738 616462212 616588135 616474876
1872.8F16474876L49160L56903K6321l08418j47324L82233K83546k01835k05765K34032
$$ 616474876 616824036 617180939 617207260 616898842 616751518 617133751 617417297 617215462 617009697 617243729
1882.4F17243729M92706J08147k57225j76087M08325M37813q81195o90689P56874P99637
$$ 617243729 617736435 617844582 617587357 617411270 617819595 618257408 617376213 616685524 617442398 618242035
1892.1F18242035M35676l34663q11195K47802Q97408J61095n77164l60527M50325O25343
$$ 618242035 618677711 618343048 617531853 617779655 618677063 618838158 618260994 617900467 618350792 618976135
1901.7F18976135J13564m72603j85165O69746K87018n30243l23181P5493L98025L23792
$$ 618976135 619089699 618617096 618431931 619101677 619388695 618858452 618535271 618610764 619008789 619332581
1911.3F19332581l06702j73340M98695P12510J96876j167908j184425J005096J041909
$$ 619332581 619025879 618852539 619351234 620063744 620260620 619092712 617908287 618913383 619955292
1920F19955292j22147r13162n07164R08813Q17643j69068l88183J84478M25797l8147
$$ 619955292 619833145 618919983 618412819 619321632 620139275 619970207 619582024 619766502 620192299 620154152
1929.7F20154152k70767Q3008K74314N7526j21994k24609J0948M25415J96266k93503
$$ 620154152 619883385 619966393 620240707 620298233 620176239 619951630 619962578 620387993 620584259 620290756
1939.3F20290756j9226J47858m82674m8828M03290k6207K12440M86031O7863m50019
$$ 620290756 620271530 620419388 619936714 619887886 620291176 620264969 620477409 620963440 621031303 620581284
1949F20581284j82229M37775L18260k12745l69721J53923O45905J29776n38025l66974
$$ 620581284 620399055 620836830 621155090 620942345 620572624 620726547 621372452 621502228 620964203 620597229
1958.6F20597229L35770O36787O1340m28466j84937K91519L46642l00560p07054M6882
$$ 620597229 620932999 621569786 621631126 621202660 621017723 621309242 621655884 621355324 620648270 620695152
1968.2F20695152O20346J57776k94304p820K68364J86386p8163l53851K1324M30222
$$ 620695152 621315498 621473274 621178970 621171150 621439514 621625900 621547737 621193886 621215210 621645432
1977.9F21645432K03590l4332l8529K01569L37410J20239j51710k50512R4071J44272
$$ 621645432 621849022 621814690 621776161 621977730 622315140 622435379 622283669 622033157 622127228 622271500
1987.5F22271500j56136J4992R4337k98996j74560N00450J60942j35269M76608L79906
$$ 622271500 622115364 622130356 622224693 621925697 621751137 622251587 622412529 622277260 622753868 623133774
1997.2F23133774k92206l05710P3738K11334J18027o0386J4495J72692J36833p2289
$$ 623133774 622841568 622535858 622609596 622820930 622938957 622878571 622893066 623065758 623202591 623130302
2006.8F23130302l60221R3002N47676K23961k78740l62625K20527M59519n1727n61409
$$ 623130302 622770081 622863083 623410759 623634720 623355980 622993355 623213882 623673401 623621674 623060265
2016.5F23060265k49825N12314O63795k060n07240P2327O65283K87323l60031k60086
$$ 623060265 622810440 623322754 623986549 623984489 623477249 623549576 624214859 624502182 624142151 623882065
2026.1F23882065K70195M07295N1994m20608j73683M33922M30946P1373l98483k02713
$$ 623882065 624152260 624559555 624611549 624190941 624017258 624451180 624882126 624953499 624555016 624352303
2035.7F24352303M73556J86691k61840o5232J60866M09279K62451m33273j70784O73103
$$ 624352303 624825859 625012550 624750710 624685478 624846344 625255623 625518074 625084801 624914017 625587120
2045.4F25587120N80750p3243k19879J18332J97563J79749l2082j18484K21557M54789
$$ 625587120 626167870 626094627 625874748 625993080 626190643 626370392 626338310 626219826 626441383 626896172
2055F26896172L52516k40402l76854J94397L52935J1521j83945J11122M40216K61536
$$ 626896172 627248688 627008286 626631432 626825829 627178764 627190285 627006340 627117462 627557678 627819214
2064.7F27819214j34545j57279K74581M37470J65787J754M4251L63197M67682O1722
$$ 627819214 627684669 627527390 627801971 628239441 628405228 628406982 628451233 628814430 629282112 629343834
2074.3F29343834l11623k57873K62031M12560j96495m31557L9482J22147m94652j037788
$$ 629343834 629032211 628774338 629036369 629448929 629252434 628820877 628860359 628982506 628487854 627450066
2084F27450066j115113j022033j144486j622772k362557k740821k601700k801132l104058
$$ 627450066 626334953 625312920 624168434 622545662 620183105 617442284 614840584 612039452 608935394
2092.6F08935394k675094j764527p26432o5613n6496Q8425M33387J57242l95355n54390
$$ 608935394 606260300 604495773 603769341 603703728 603647232 603735657 604169044 604326286 603930931 603376541
2102.3F03376541l68118j16844j14937m83284q79021o45561k92244o71539r93538m98810
$$ 603376541 603008423 602891579 602776642 602293358 601414337 600768776 600476532 599804993 598811455 598312645
2111.9E98312645K06108N92499Q04176Q25157Q18024J197357J471253R82208M39339
$$ 598312645 598518753 599111252 599915428 600740585 601558609 602755966 604227219 605209427 605648766
2120.6F05648766P73849J308365J067963N20820L85475O28472Q60405O11953K94686
$$ 605648766 606422615 607730980 608798943 609319763 609705238 610333710 611194115 611806068 612100754
2129.3F12100754L47214M20417N73006N67207J81198J72348L27988K30332J08337k73972
$$ 612100754 612447968 612868385 613441391 614008598 614189796 614362144 614690132 614920464 615028801 614754829
2138.9F14754829l73458R6855K27050k7694r0752O1417K78473K29530j42975j27525
$$ 614754829 614381371 614478226 614705276 614677582 614586830 614648247 614926720 615156250 615013275 614885750
2148.6F14885750L86772M24690l5591j50070J00136K84958K79388K73514o828k3499
$$ 614885750 615272522 615697212 615661621 615511551 615611687 615896645 616176033 616449547 616442719 616419220
2158.2F16419220N67512N86319J75209J81885M82140N68466J65482k52266j82762o33965
$$ 616419220 616986732 617573051 617748260 617930145 618412285 618980751 619146233 618893967 618711205 618077240
2167.9F18077240k226753j922226R55887J968841Q64296R4414l72887m76303o5002
$$ 618077240 615850487 613928261 614884148 616852989 617717285 617811699 617438812 616962509 616897507
2176.5F16897507J32522k52571p70569o17523K4223N2567m28925m99649j02195K34298
$$ 616897507 617030029 616777458 616006889 615389366 615413589 615466156 615037231 614537582 614435387 614669685
2186.2F14669685L68538P5531l4904M10538N84831O00281N88531Q00247J193886J072502
$$ 614669685 615038223 615113754 615078850 615489388 616074219 616674500 617263031 618063278 619257164 620329666
2195.8F20329666Q48084O83593N73235P64656N52101K0752J33553L54881J55868M2611
$$ 620329666 621177750 621861343 622434578 623199234 623751335 623772087 623905640 624260521 624416389 624459000
2205.5F24459000K784j20735p7133n951k86713n59120l98826k9869p2480n60264o35834
$$ 624459000 624461784 624341049 624263916 624257965 623971252 623412132 623013306 622983437 622910957 622350693 621714859
2216.1F21714859j13678L47099J21727l62739l97187k63175k88849k82898p5989R6359
$$ 621714859 621601181 621948280 622070007 621707268 621310081 621046906 620758057 620475159 620399170 620495529
2225.7F20495529R5024o8664m32015n85632p3052M54789J26114n51415l53622K30751
$$ 620495529 620590553 620521889 620089874 619504242 619431190 619885979 620012093 619460678 619107056 619337807
2235.4F19337807K33268m6463k34642N532K36969J72653p9918m91066k64282K16636
$$ 619337807 619571075 619524612 619289970 619295502 619532471 619705124 619625206 619134140 618869858 619086494
2245F19086494n1345l48816k33612L6010L58887M654n81169k99187L64914N66368K3880
$$ 619086494 619035149 618686333 618452721 618488731 618847618 618852272 618271103 617971916 618336830 618903198 618927078
2255.6F18927078n06782K7122O71234L83835k30484l07770K96631N38445K2735l17344
$$ 618927078 618420296 618447418 619118652 619502487 619272003 618964233 619260864 619799309 619822044 619504700
2265.3F19504700l4447M31061L81889k6092O7176K76947K08970J72271o9771j35574
$$ 619504700 619470253 619901314 620283203 620257111 620324287 620601234 620810204 620982475 620912704 620777130
2274.9F20777130L12653N42831R9831k70539j29890K3422Q8845Q0871q8997j87187
$$ 620777130 621089783 621632614 621732445 621461906 621332016 621355438 621444283 621525154 621436157 621248970
2284.5F21248970K0294K18201j00937m70047j53351K20108l8681n15327n72472m8523
$$ 621248970 621269264 621487465 621386528 620916481 620763130 620983238 620944557 620429230 619856758 619808235
2294.2F19808235K40097J04561K1820j98746m9438K11868J53046q9188l1242K08282
$$ 619808235 620048332 620152893 620174713 619975967 619926529 620138397 620291443 620202255 620171013 620379295
2303.8F20379295P4730Q6823J86500L15667L21922L59268L7079j08528J80397J97067
$$ 620379295 620454025 620540848 620727348 621043015 621364937 621724205 621761284 621652756 621833153 622030220
2313.5F22030220q4038j92947K34222O07415K47459l33519K0142N79338J65329n53551
$$ 622030220 621946182 621753235 621987457 622594872 622842331 622508812 622528954 623108292 623273621 622720070
2323.1F22720070l81317J07689P22389O81419j17874l16963K34032L79371R5864K04162
$$ 622720070 622338753 622446442 623168831 623850250 623732376 623415413 623649445 624028816 624124680 624328842
2332.8F24328842J40419J17951L10707J6823l52288l3111L09372k13547q44689m73289
$$ 624328842 624469261 624587212 624897919 624914742 624562454 624529343 624838715 624625168 623780479 623307190
2342.4F23307190J20163K06642M61311L06740K7542P20139R21936K16446k39144j16806
$$ 623307190 623427353 623633995 624095306 624402046 624429588 625149727 626071663 626288109 626048965 625932159
2352.1F25932159q5678J44806N79224J51596m20570q4458L33023q3313o14624j7051
$$ 625932159 625846481 625991287 626570511 626722107 626301537 626217079 626550102 626466789 625852165 625835114
2361.7F25835114N84602J23405p9460Q9798M35410N45883j44348k48566J7433J73989
$$ 625835114 626419716 626543121 626463661 626553459 626988869 627534752 627390404 627141838 627159271 627333260
2371.3F27333260L42979j28021r5978M02298M13246J66435r5329k03590K42576P25937
$$ 627333260 627676239 627548218 627452240 627854538 628267784 628434219 628338890 628135300 628377876 629103813
2381F29103813K87094k48146j32560L51638M77486M5929k00234P7515M77524L80516
$$ 629103813 629390907 629142761 629010201 629361839 629839325 629885254 629685020 629762535 630240059 630620575
2390.6F30620575k61688o05469k23808L09486L20892k33039j91193L74870L73459J3275
$$ 630620575 630358887 629753418 629529610 629839096 630159988 629926949 629735756 630110626 630484085 630497360
2400.3F30497360l23868k47840J65443J63155j04828M4899L19290K58064o0539l47023
$$ 630497360 630173492 629925652 630091095 630254250 630149422 630194321 630513611 630771675 630711136 630364113
2409.9F30364113j21155K64320J40191k87323l24097J47018M46511K13432l12729k50626
$$ 630364113 630242958 630507278 630647469 630360146 630036049 630183067 630629578 630843010 630530281 630279655
2419.6F30279655M17138M13856k37617m84887j54953M03557M01345k83814n54809p0916
$$ 630279655 630696793 631110649 630873032 630388145 630233192 630636749 631038094 630754280 630199471 630128555
2429.2F30128555N26161M71650j07575m87671o9618N61180K07558n95741m68750M09965
$$ 630128555 630654716 631126366 631018791 630531120 630461502 631022682 631230240 630634499 630165749 630575714
2438.8F30575714O32897K098m36135n0964N31120L98522k80037l34778J08642J24436
$$ 630575714 631208611 631210709 630774574 630723610 631254730 631653252 631373215 631038437 631147079 631271515
2448.5F31271515j41144l28712O637L59650J64413j90811l41377P3204O50291M43154
$$ 631271515 631130371 630801659 630808296 631167946 631332359 631141548 630800171 630873375 631523666 631966820
2458.1F31966820k52953n71556n1346N34706J04027l33786j74560N1689N5542j62964
$$ 631966820 631713867 631142311 631090965 631625671 631729698 631395912 631221352 631273041 631328583 631165619
2467.8F31165619j81198J46217M37546J14403l23067k01912N5199K61573J40305k75040
$$ 631165619 630984421 631130638 631568184 631682587 631359520 631157608 631212807 631474380 631614685 631339645
2477.4F31339645j71318J17417J92680J78413k82783k82326L92380K89345l61443m31709
$$ 631339645 631168327 631285744 631478424 631656837 631374054 631091728 631484108 631773453 631412010 630980301
2487.1F30980301J30768L31344q888j29509n8594K36512L88374j34926n35850k34070
$$ 630980301 631111069 631442413 631433525 631304016 631245422 631481934 631870308 631735382 631199532 630965462
2496.7F30965462L61328N90248J07841l34243j06087J19476q3275k92358k09045Q6898
$$ 630965462 631326790 631917038 632024879 631690636 631584549 631704025 631620750 631328392 631119347 631206245
2506.3F31206245K90261J87568l14407m15993J74446L19367n0202j10473J22375K57531
$$ 631206245 631496506 631684074 631369667 630953674 631128120 631447487 631397285 631286812 631409187 631666718
2516F31666718K59208K5025k18811n0393K19765o5689l10860j79252q0986J63269K00271
$$ 631666718 631925926 631950951 631732140 631681747 631901512 631835823 631524963 631345711 631264725 631427994 631628265
2526.6F31628265k02331j02539M09279J60141l21160j06544J18103O7406J29585k57035
$$ 631628265 631425934 631323395 631732674 631892815 631571655 631465111 631583214 631650620 631780205 631523170
2536.2F31523170l55796K46429J94512q0987J18676K13623R384j09100q5259r4490
$$ 631523170 631167374 631413803 631608315 631527328 631646004 631859627 631869011 631759911 631674652 631580162
2545.9F31580162P5150K30560o0959k68097j21193r6245P6523J35956j67007j41373
$$ 631580162 631655312 631885872 631824913 631556816 631435623 631339378 631415901 631551857 631384850 631243477
2555.5F31243477K23884K14692j40801j76468R613L24288L47137o8970m41665k41585
$$ 631243477 631467361 631682053 631541252 631364784 631374397 631698685 632045822 631976852 631535187 631293602
2565.2F31293602K35367n3559k85606Q6708K79770K21405o5842m04358k02445L83949
$$ 631293602 631528969 631475410 631189804 631276512 631556282 631777687 631711845 631307487 631105042 631488991
2574.8F31488991M90761j63460l64304J91536J60484j00097j37444o6032K78358J97220
$$ 631488991 631979752 631816292 631451988 631643524 631804008 631703911 631566467 631500435 631778793 631976013
2584.5F31976013m8256j15204j37329J8883L5057k06070k39906K51884L88298j21688
$$ 631976013 631927757 631812553 631675224 631694107 631729164 631523094 631283188 631535072 631923370 631801682
2594.1F31801682l38059j04141J24435K01378P2785l06397l57323K72179N11780l4485
$$ 631801682 631463623 631359482 631483917 631685295 631758080 631451683 631094360 631366539 631878319 631843834
2603.7F31843834l64571J4992K70729j29890k56501p2059J76735L56941M9095m04625
$$ 631843834 631479263 631494255 631764984 631635094 631378593 631306534 631483269 631840210 631889305 631484680
2613.4F31484680l08494L44009K70386l25012k50321J55335L16124n4589l32985o2942
$$ 631484680 631176186 631520195 631790581 631465569 631215248 631370583 631686707 631632118 631299133 631236191
2623F31236191K3155m5929N2147p019o5994R5253R9258j42059k96593l2501L29246
$$ 631236191 631259346 631213417 631265564 631258545 631192551 631287804 631387062 631245003 630948410 630915909 631245155
2633.6F31245155K19345k14538k73209J52397K84157r9945k84157K976K60391Q8654
$$ 631245155 631464500 631249962 630976753 631129150 631413307 631313362 631029205 631032181 631292572 631381226
2643.3F31381226k24266j43395K13318K90909l4256k07138k15760j33590K25944K95754
$$ 631381226 631156960 631013565 631226883 631517792 631483536 631276398 631060638 630927048 631152992 631448746
2652.9F31448746j58959m58183k9411L07998N455r1667j4496M8371j1292o3591k0447
$$ 631448746 631289787 630831604 630802193 631110191 631115646 631023979 631009483 631057854 631046562 630982971 630962524
2663.5F30962524p1945K7199N7678k67k1210N112J53275K75993j39275n41114j30501
$$ 630962524 630890579 630917778 630975456 630975189 630953979 630959091 631112366 631388359 631249084 630707970 630577469
2674.1F30577469K81677Q4076j88827k3957J38817n8708j11809J77689J92604k10533
$$ 630577469 630859146 630943222 630754395 630730438 630869255 630810547 630698738 630876427 631069031 630858498
2683.8F30858498k90909J03149J74942O0082O8702k50358k21214J35765Q1977J7090
$$ 630858498 630567589 630670738 630845680 630905762 630974464 630724106 630502892 630638657 630720634 630737724
2693.4F30737724J02883K5863j4724K30712J17836l14292l88260K1782K97775J26076
$$ 630737724 630840607 630866470 630851746 631082458 631200294 630886002 630497742 630519524 630817299 630943375
2703.1F30943375j94855k41013K55242J55296k81029k11830j07422m0512K00615K58865
$$ 630943375 630748520 630507507 630762749 630918045 630637016 630425186 630317764 630277252 630477867 630736732
2712.7F30736732j66206m8942L42521l3569m75273k55242J12763J66817L3836r8419
$$ 630736732 630570526 630521584 630864105 630830536 630355263 630100021 630212784 630379601 630413437 630315018
2722.4F30315018l7880L1929m730k2164j15242M8103K11907q6632k15034p6027J18789
$$ 630315018 630277138 630309067 630304337 630282173 630166931 630215034 630426941 630340309 630125275 630049248 630168037
2733F30168037K03591j21460j55831J26801N3635j1292j51443k83699j58692J35536
$$ 630168037 630371628 630250168 630094337 630221138 630274773 630263481 630112038 629828339 629669647 629805183
2742.6F29805183M81835J74980k85912q1405J38054r1820k71339p973J74026Q8730
$$ 629805183 630287018 630461998 630176086 630094681 630232735 630140915 629869576 629861603 630035629 630124359
2752.3F30124359o0310k92549j39656J53617J6709M921Q8157r3536j6594j1024k03896
$$ 630124359 630064049 629771500 629631844 629785461 629802170 629807091 629895248 629801712 629785118 629774094 629570198
2762.9F29570198J17073K47193o4431k52418j35803J94282J26915o4964j86310j0376
$$ 629570198 629687271 629934464 629870033 629617615 629481812 629676094 629803009 629738045 629551735 629541359
2772.5F29541359L94325J1864l13797n2261n5695m5586Q8959J2055o7864j20201p1106
$$ 629541359 629935684 629947548 629633751 629581490 629525795 629480209 629569168 629581223 629513359 629393158 629322052
2783.1F29322052J3542k14538l98674J10359O20575K04849k2087P0381k39639k86179
$$ 629322052 629335594 629121056 628722382 628832741 629453316 629658165 629636078 629706459 629466820 629180641
2792.8F29180641j28898j00747N3025M1732j84326j78299p3738J34888J50986k30561
$$ 629180641 629051743 628950996 629004021 629045753 628861427 628683128 628609390 628744278 628895264 628664703
2802.4F28664703k32315K5406K39372K82212O7444j71624j36451J38893l5668j62353
$$ 628664703 628432388 628457794 628697166 628979378 629046822 628875198 628738747 628877640 628841972 628679619
2812F28679619j32294j89323R5558K14310j14747j55296O6223M7684l8719J6403J25847
$$ 628679619 628547325 628358002 628453560 628667870 628553123 628397827 628464050 628511734 628473015 628489418 628615265
2822.7F28615265n6572k98500l25279j10855K52914K60277o1798j12725J09482R3231
$$ 628615265 628558693 628260193 627934914 627824059 628076973 628337250 628275452 628162727 628272209 628365440
2832.3F28365440l26347m16183N111O2752J20506Q7052l60565n03083j20582M13284
$$ 628365440 628039093 627622910 627628021 627690773 627811279 627898331 627537766 627034683 626914101 627327385
2841.9F27327385J26076m15840q3046J42479j07193k42653k28768j9722K3613l20663
$$ 627327385 627453461 627037621 626954575 627097054 626989861 626747208 626518440 626498718 626522331 626201668
2851.6F26201668m10996P5150L68004P9117j75667j04981K2583J26496l548j74522
$$ 626201668 625790672 625865822 626233826 626312943 626137276 626032295 626054878 626181374 626177826 626003304
2861.2F26003304l1052L9749Q6479O3019j07460m7798J58882K63214P6180k97394l92876
$$ 626003304 625972252 626012001 626098480 626161499 626054039 626006241 626165123 626428337 626504517 626207123 625814247
2871.8F25814247l6926K55127k2087k22512P4959J65215J6632j52321m15077N0468
$$ 625814247 625777321 626032448 626010361 625787849 625862808 626028023 626044655 625892334 625477257 625527725
2881.5F25527725M36974j66130m48952j58348K12288K99187K2392l20969l76015n3138
$$ 625527725 625964699 625798569 625349617 625191269 625403557 625702744 625725136 625404167 625028152 624975014
2891.1F24975014J12419l9978j59989j52053k5025K69432J20163l06549l8872J80397
$$ 624975014 625087433 625047455 624887466 624735413 624710388 624979820 625099983 624793434 624754562 624934959
2900.8F24934959k89535l06320P5493K5100P3777K4490k58675j18789j44387j34811
$$ 624934959 624645424 624339104 624414597 624439697 624513474 624537964 624279289 624160500 624016113 623881302
2910.4F23881302L0022r9946q1367q4457p4540j39122j23138j07765j97182l2082q7394
$$ 623881302 623911324 623811378 623730011 623645554 623571014 623431892 623308754 623200989 623003807 622971725 622884331
2921F22884331r5978N8632K38075L04031r6702l03307m3754L7727K01187K30561j11886
$$ 622884331 622788353 622846985 623085060 623389091 623292389 622989082 622945328 622983055 623184242 623414803 623302917
2931.6F23302917K6589J33400P8049J40609J25313O0578j45607r5025J49079P1716
$$ 623302917 623329506 623462906 623540955 623681564 623806877 623867455 623721848 623626823 623775902 623847618
2941.3F23847618r1591J26763K21366l5781P2784K4948l30391k46467J86767M01116
$$ 623847618 623756027 623882790 624104156 624068375 624141159 624166107 623835716 623589249 623776016 624177132
2950.9F24177132p8240m81071j41297K26441J79024m5128k20452p8201J78032Q2245
$$ 624177132 624098892 623617821 623476524 623702965 623881989 623836861 623616409 623538208 623716240 623798485
2960.6F23798485j52931n7717k9220m7760J76239J53465j29089p4578K18086r0103
$$ 623798485 623645554 623587837 623558617 623510857 623687096 623840561 623711472 623636894 623854980 623764877
2970.2F23764877l28102l3684J47667K36550J07612j71508j47171P2975J38130P6294
$$ 623764877 623436775 623403091 623550758 623787308 623894920 623723412 623576241 623649216 623787346 623863640
2979.8F23863640k2202j03378o0425k05116j73912K03819K73094j54380l85590R7999
$$ 623863640 623841438 623738060 623677635 623472519 623298607 623502426 623775520 623621140 623235550 623333549
2989.5F23333549L04604R6665J6479k00844m00238j65748J18675O103j27906K26821
$$ 623333549 623638153 623734818 623751297 623550453 623150215 622984467 623103142 623109245 622981339 623208160
2999.1F23208160K51542l65487m93888j97983J64947M10157j42861n29671J65825K44065
$$ 623208160 623459702 623094215 622600327 622402344 622567291 622977448 622834587 622304916 622470741 622714806
3008.8F22714806r4986R4299l02773l39546K16027J11160k39067k24724M1656j1901
$$ 622714806 622619820 622714119 622411346 622071800 622287827 622398987 622159920 621935196 621976852 621964951
3018.4F21964951L6239K47574k16255l45841P4425q0871q6174J53961J73149R7732
$$ 621964951 622001190 622248764 622032509 621686668 621761093 621680222 621594048 621748009 621921158 622018890
3028.1F22018890k33230m09813k49672R5863L10669o3591j87034p630o6299J01356
$$ 622018890 621785660 621375847 621126175 621222038 621532707 621469116 621282082 621274452 621208153 621309509
3037.7F21309509p0877m18281k97699j44272J55182L02963j36147l02200j13830k53678
$$ 621309509 621238632 620820351 620522652 620378380 620533562 620836525 620700378 620398178 620284348 620030670
3047.4F20030670k77557l9749j56060q5563L32184N3443o8016J9761m32816l68919
$$ 620030670 619753113 619713364 619557304 619471741 619803925 619857368 619789352 619809113 619376297 619007378
3057F19007378m4976p5798N493K12670k7886k62641N989N9127k43034m01497k90871
$$ 619007378 618962402 618886604 618892097 619104767 619076881 618814240 618820229 618879356 618636322 618234825 617943954
3067.6F17943954q5487J43890J41373j98479j80778L5477l57705l49998J85242J64985
$$ 617943954 617858467 618002357 618143730 617945251 617764473 617799950 617442245 617092247 617277489 617442474
3077.2F17442474p0305k99530k65731l4562j99546m06914j64452J50833P6561o2484
$$ 617442474 617372169 617072639 616806908 616772346 616572800 616165886 616001434 616152267 616228828 616166344
3086.9F16166344j40724l53623k89802r7275l3455P5912j11122l8261K71759j71395
$$ 616166344 616025620 615671997 615382195 615284920 615251465 615327377 615216255 615177994 615449753 615278358
3096.5F15278358n90667j96648J17302j82915l92723m4784J2664l58238j66473J51596
$$ 615278358 614687691 614491043 614608345 614425430 614032707 613987923 614000587 613642349 613475876 613627472
3106.2F13627472R7923o0806j80168l29819l09448j19095n3253m3869l14827l66287
$$ 613627472 613725395 613664589 613484421 613154602 612845154 612726059 612672806 612628937 612314110 611947823
3115.8F11947823j21003o179N0926o6910O943j64452m27475j09062j54152j86005J74523
$$ 611947823 611826820 611820641 611871567 611804657 611811600 611647148 611219673 611110611 610956459 610770454 610944977
3126.4F10944977j88103o21147m59023j08947J85012k86369n56030r804J21575j8006
$$ 610944977 610756874 610135727 609676704 609567757 609752769 609466400 608910370 608900566 609022141 609004135
3136.1F09004135j91460l83071k03400j33972l05252j85891j05438j28441n760j38206
$$ 609004135 608812675 608429604 608226204 608092232 607786980 607601089 607495651 607367210 607361450 607223244
3145.7F07223244m65508n04265P592K13203l63121p11670m29459N1346J97945k17972
$$ 607223244 606757736 606253471 606261063 606474266 606111145 605399475 604970016 605021362 605219307 605001335
3155.4F05001335m68521k95067l89480l37983j10168j60828j61705r3841l75748o07529
$$ 605001335 604532814 604237747 603848267 603510284 603400116 603239288 603077583 602983742 602607994 602000465
3165F02000465k98805j89934k66571j95160l86390m92630o9275p2899o56471m91791
$$ 602000465 601701660 601511726 601245155 601049995 600663605 600170975 600101700 600028801 599372330 598880539
3174.6E98880539J5984r0676n48897o77070k33574k9183j94168m76188n82009k35634
$$ 598880539 598896523 598805847 598256950 597579880 597346306 597317123 597122955 596646767 596064758 595829124
3184.3E95829124k71377m47655k21176k67715l80936k98386n68847r80187m23126K53258
$$ 595829124 595557747 595110092 594888916 594621201 594240265 593941879 593373032 592392845 591969719 592222977
3193.9E92222977k35176q58956q07609l63427q9645j43700m61959j020699q24547K9793
$$ 592222977 591987801 591128845 590321236 589957809 589868164 589724464 589262505 588241806 587417259 587447052
3203.6E87447052p133n53666m59289l5172j18942o69136o77414k28615m22210p78275
$$ 587447052 587439919 586886253 586426964 586391792 586272850 585603714 584926300 584697685 584275475 583497200
3213.2E83497200n11398m02603n55230m84695k99034o4888k84691n22995n77164p80220
$$ 583497200 582985802 582583199 582027969 581543274 581244240 581179352 580894661 580371666 579794502 579014282
3222.9E79014282m23927j61018k64473j70517m53034p26433m62761l49273m91944p95745
$$ 579014282 578590355 578429337 578164864 577994347 577541313 576814880 576352119 576002846 575510902 574715157
3232.5E74715157q49228l17498k31666k70004j76659n43594o56891m82827m81185m02108
$$ 574715157 573865929 573548431 573316765 573046761 572870102 572326508 571669617 571186790 570705605 570303497
3242.2E70303497k99568o85882q41637m05235q9455J76163j27182p22123o80007m05884
$$ 570303497 570003929 569318047 568476410 568071175 567981720 568157883 568030701 567308578 566628571 566222687
3251.8E66222687k35291l01971o98357o15883j04255j36071l43628o63375q05779j99509
$$ 566222687 565987396 565685425 564987068 564371185 564266930 564130859 563787231 563123856 562318077 562118568
3261.4E62118568O028l57705m81643m6272K10876l83987o73676j67427o1035p60956
$$ 562118568 562124596 561766891 561285248 561238976 561449852 561065865 560392189 560224762 560163727 559402771
3271.1E59402771o35147j91994l72734k81029m02069n25055k07252r2812k65922m07486
$$ 559402771 558767624 558575630 558202896 557921867 557519798 556994743 556787491 556694679 556428757 556021271
3280.7E56021271m16260n52902m22898j96151m21906n62134o64367l67050r7924n58929
$$ 556021271 555605011 555052109 554629211 554433060 554011154 553449020 552784653 552417603 552319679 551760750
3290.4E51760750n23339l60908m56200k49443l19977l60755m78478j040459j110801
$$ 551760750 551237411 550876503 550420303 550170860 549850883 549490128 549011650 547971191 546860390
3299E46860390m43421l06396p35130n26886o09932r48868r22890p31010k10381k99950
$$ 546860390 546416969 546110573 545375443 544848557 544238625 543289757 542366867 541635857 541425476 541125526
3308.7E41125526q09707r42993q03643q13217r35440m51927l02353j123390j334839
$$ 541125526 540315819 539372826 538569183 537755966 536820526 536368599 536066246 534942856 533608017
3317.4E33608017p25327o67381q20007o24275q29621j311798j063919o01654p18384
$$ 533608017 532882690 532215309 531395302 530771027 529941406 528629608 527565689 526964035 526245651
3326.1E26245651j024093j050187r27314j337929j473160q82225p11670j121559j155510
$$ 526245651 525221558 524171371 523244057 521906128 520432968 519550743 518839073 517717514 516562004
3334.7E16562004q25882j283226j546249p38488n49659j257859j504936r45434p37877
$$ 516562004 515736122 514452896 512906647 512168159 511618500 510360641 508855705 507910271 507172394
3343.4E07172394j386833j522904j126823j071358j005135j221771j621322j339493
$$ 507172394 505785561 504262657 503135834 502064476 501059341 499837570 498216248 496876755
3351.1D96876755j344147j421127j053314j262627j182518j051903j599464j627922
$$ 496876755 495532608 494111481 493058167 491795540 490613022 489561119 487961655 486333733
3358.8D86333733j195412j163178j518631j502609j271019j321831j166725j357040
$$ 486333733 485138321 483975143 482456512 480953903 479682884 478361053 477194328 475837288
3366.6D75837288j862373j561356j245804j491699j456528j019935o03943r05800j417732
$$ 475837288 473974915 472413559 471167755 469676056 468219528 467199593 466595650 465689850 464272118
3375.2D64272118j325531j502495j750145j207428o48651q26187r47419r24415j080780
$$ 464272118 462946587 461444092 459693947 458486519 457837868 457011681 456064262 455139847 454059067
3383.9D54059067j233559j402435j053696n77202o75811r17740o70205n79910r32579
$$ 454059067 452825508 451423073 450369377 449792175 449116364 448198624 447528419 446948509 446015930
3392.6D46015930r34105p86323r32770j080093o83747m65965p15752q89435q95538
$$ 446015930 445081825 444295502 443362732 442282639 441598892 441132927 440417175 439527740 438632202
3401.3D38632202m98581l26843q19473n75486j86576p95174r92813p58743l58582k62833
$$ 438632202 438133621 437806778 436987305 436411819 436225243 435430069 434437256 433678513 433319931 433057098
3410.9D33057098n91697o98281q40873n83039k10724j90124m89082p32575o94694l04413
$$ 433057098 432465401 431767120 430926247 430343208 430132484 429942360 429453278 428720703 428026009 427721596
3420.6D27721596O6108l92646o75278n84793k57034j23749m20380j37634k00691n94788
$$ 427721596 427787704 427395058 426719780 426134987 425877953 425754204 425333824 425196190 424995499 424400711
3430.2D24400711p2365N37644j450m25110R3117J56136p248Q3503l3912J1100J71128
$$ 424400711 424328346 424865990 424864540 424439430 424532547 424688683 424681435 424764938 424731026 424742126 424913254
3440.8D24913254O0425r4910l9406L31650L17459j83105m921N91316J027145N91316
$$ 424913254 424973679 424878769 424839363 425171013 425488472 425305367 425300446 425891762 426918907 427510223
3450.5D27510223k40440l6240J83373L61099O21376M58794K67296L03383N56488O64482
$$ 427510223 427269783 427233543 427416916 427778015 428399391 428858185 429125481 429428864 429985352 430649834
3460.1D30649834O07567M16297K06337K5483K65121R05457Q10585K80799M50020Q93593
$$ 430649834 431257401 431673698 431880035 431905518 432170639 433076096 433886681 434167480 434617500 435511093
3469.7D35511093Q83980P96471M70161J04713J91918M93088N55801L28827M69780P60651
$$ 435511093 436395073 437191544 437661705 437766418 437958336 438451424 439007225 439336052 439805832 440566483
3479.4D40566483Q83026O22940J96304M99420Q30345N30167N01900N30357N14031Q39118
$$ 440566483 441449509 442072449 442268753 442768173 443598518 444128685 444630585 445160942 445674973 446514091
3489D46514091N38178K72942O78062O76918N20439O99272M92516M18854R55810Q72765
$$ 446514091 447052269 447325211 448003273 448680191 449200630 449899902 450392418 450811272 451767082 452639847
3498.7D52639847O14433P40967M73823J36948O17027J210595R82131N26963N39741
$$ 452639847 453254280 453995247 454469070 454606018 455223045 456433640 457415771 457942734 458482475
3507.3D58482475P56340N12352O09284J160316R76219N19028N23491Q66432J054039
$$ 458482475 459238815 459751167 460360451 461520767 462496986 463016014 463539505 464405937 465459976
3516D65459976N34935J65520O29730Q37593N98107N12657N51262Q47778Q60405O91452
$$ 465459976 465994911 466160431 466790161 467627754 468225861 468738518 469289780 470137558 470997963 471689415
3525.7D71689415Q82301Q31070Q17147Q25843N43213P90367J126366R93881Q09212
$$ 471689415 472571716 473402786 474219933 475045776 475588989 476379356 477505722 478499603 479308815
3534.4D79308815N62096Q37097J058121N26390O39000J010704R93881Q65288O61964
$$ 479308815 479870911 480708008 481766129 482292519 482931519 483942223 484936104 485801392 486463356
3543D86463356R92699J199150K76413K13508J258850J129036R29032J039505L89862
$$ 486463356 487456055 488655205 488931618 489145126 490403976 491533012 492462044 493501549 493891411
3551.7D93891411M80690J146965J135864J148644J064910R64051Q43620Q53081R38377
$$ 493891411 494372101 495519066 496654930 497803574 498868484 499832535 500676155 501529236 502467613
3560.4E02467613P26395O80351R98345J634979Q99086Q7852M59557R2850J060943K060890
$$ 502467613 503194008 503874359 504872704 506507683 507406769 507494621 507954178 508047028 509107971 511168861
3570E11168861J801987J306191J087989R90296J100998R73701Q23517J428185J329727
$$ 511168861 512970848 514277039 515365028 516355324 517456322 518430023 519253540 520681725 522011452
3578.7E22011452R61837J142350R13849Q30078J036110J364669P90635k55127N75599
$$ 522011452 522973289 524115639 525029488 525859566 526895676 528260345 529050980 528795853 529371452
3587.4E29371452J379013K384606K293510J356888R02405Q70743J266441R04694J120948
$$ 529371452 530750465 533135071 535428581 536785469 537687874 538558617 539825058 540729752 541850700
3596.1E41850700J443253Q94813J134186J241989R18198J096764J514892K014313J677971
$$ 541850700 543293953 544188766 545322952 546564941 547483139 548579903 550094795 552109108 553787079
3604.7E53787079O61430L78494J595803R15527N18303K568283J106415p18041P86248
$$ 553787079 554448509 554827003 556422806 557338333 557856636 560424919 561531334 560813293 561599541
3613.4E61599541J745147K445336J592674q0643P7057K21977J509324K358894J564140
$$ 561599541 563344688 565790024 567382698 567302055 567379112 567601089 569110413 571469307 573033447
3622.1E73033447J053849R39788J107827J414604R92241p27768j532402J371498K310943
$$ 573033447 574087296 575027084 576134911 577549515 578541756 577813988 576281586 577653084 579964027
3630.8E79964027J604653O92711k69204P50123J991081J079521j3847O42242J036034
$$ 579964027 581568680 582261391 581992187 582742310 584733391 585812912 585799065 586441307 587477341
3639.5E87477341L88908K1973L68957J178818J051521L32756q61053p09725O84433
$$ 587477341 587866249 587888222 588257179 589435997 590487518 590820274 589959221 589249496 589933929
3648.1E89933929n82084j279144L18298L034553K654190J175309l02582j779137Q1253
$$ 589933929 589351845 588072701 588390999 591425552 594079742 595255051 594952469 593173332 593254585
3656.8E93254585J640663Q25997O49795M62799K61879N3597J2817M86832M15802J95656
$$ 593254585 594895248 595721245 596371040 596833839 597095718 597149315 597162132 597648964 598064766 598260422
3666.5E98260422n12047j029167o6872k10571Q76007J751823N94750j643143l954849
$$ 598260422 597748375 596719208 596652336 596441765 597317772 599069595 599664345 598021202 594066353
3675.1E94066353L36685K799950J007614n56107k40097J073075O21147K37617L01476
$$ 594066353 594403038 597202988 598210602 597654495 597414398 598487473 599108620 599346237 599647713
3683.8E99647713O80885J034584r4871k439728j481705K105026k05497l98026J672821
$$ 599647713 600328598 601363182 601268311 598828583 597346878 599451904 599246407 598848381 600521202
3692.5F00521202J266251L14521n6419J88713M02031L88680J60560k19726q23326L80935
$$ 600521202 601787453 602101974 602045555 602234268 602636299 603024979 603185539 602965813 602142487 602523422
3702.1F02523422J073113J90773M38728Q0452k21519P0152p31430J48697N16548j628533
$$ 602523422 603596535 603787308 604226036 604306488 604084969 604155121 603423691 603572388 604088936 602460403
3711.8F02460403m463J215096J39541O55404J037101J66931q46633k9068Q45260o06155
$$ 602460403 602455940 603671036 603810577 604465981 605503082 605670013 604823380 604794312 605639572 605033417
3721.4F05033417j061631L86849J29890k22587j44158M92134Q47092L56636L76587
$$ 605033417 603971786 604358635 604488525 604265938 604121780 604613914 605461006 605817642 606194229
3730.1F06194229r69658j779785J182556n39322k711181R0713J635513R49097P36809
$$ 606194229 605224571 603444786 604627342 604088020 601376839 601467552 603103065 604052162 604788971
3738.8F04788971Q06999J49727M91905J22528k911834l913651L953629J744232M46167
$$ 604788971 605595970 605745697 606237602 606360130 603448296 599534645 603488274 605232506 605678673
3747.5F05678673p88651k084388L70826p90291j345481K382583J575699K31590p11097
$$ 605678673 604890022 602805634 603176460 602386169 601040688 603423271 604998970 605230560 604519463
3756.2F04519463J56593P16171o88248l94668J288643M73900j76583N3559q78640n39360
$$ 604519463 604676056 605392227 604703979 604309311 605597954 606071854 605895271 605948830 605070190 604530830
3765.8F04530830J108055O60782o13136j766968j80740J338768O26602l59840j33210
$$ 604530830 605638885 606299667 605686531 603919563 603738823 605077591 605704193 605344353 605211143
3774.5F05211143M56734Q2970p9384m68101j181412L53546J053352J04523j84631o57425
$$ 605211143 605667877 605750847 605671463 605203362 604021950 604375496 605428848 605533371 605348740 604691315
3784.1F04691315n95436L95469P57523K69585k03782J83754K81144J99699l1395l31345
$$ 604691315 604095879 604491348 605248871 605518456 605314674 605498428 605779572 605979271 605947876 605616531
3793.8F05616531j58996j005058r42269R39560Q34427n19524j904449j303444J112595
$$ 605616531 605457535 604452477 603510208 604449768 605284195 604764671 602860222 601556778 602669373
3802.4F02669373J452064J545868J68915k075844j101685J660691M73213M8294O1836
$$ 602669373 604121437 605667305 605836220 603760376 602658691 604319382 604792595 604840889 604902725
3811.1F04902725j20773L71704M19922j284523k278137J544113J294288o71958j350365
$$ 604902725 604781952 605153656 605573578 604289055 602010918 603555031 604849319 604177361 602826996
3819.8F02826996k100907m29840K324334J145248J59531m56314q01087O09551P43599
$$ 602826996 600726089 600296249 602620583 603765831 603925362 603469048 602667961 603277512 604021111
3828.5F04021111J63269m44298j352768N86891J156693j159096m78516R91478j705246
$$ 604021111 604184380 603740082 602387314 602974205 604130898 602971802 602493286 603484764 601779518
3837.2F01779518j464844J709671J45951j3161J026001k14157o98395R36852O82602
$$ 601779518 600314674 602024345 602170296 602157135 603183136 602968979 602270584 603207436 603890038
3845.8F03890038O103L6469O0920N10941l23219k276040j799736j052398J837616K650299
$$ 603890038 603896141 603932610 603993530 604504471 604181252 601905212 600105476 599053078 600890694 603540993
3855.5F03540993p14608q29277Q22945Q31680l5438j098366j95236P25365j491433
$$ 603540993 602826385 601997108 602820053 603651733 603616295 602517929 602322693 603048058 601556625
3864.2F01556625j757049J435852J305847L91006j554603j795540J434937P67707j70211
$$ 601556625 599799576 601235428 602541275 602932281 601377678 599582138 601017075 601784782 601614571
3872.8F01614571j299477K25945J558036K68097J40839p324j073265r26781J044502
$$ 601614571 600315094 600541039 602099075 602367172 602508011 602500687 601427422 600500641 601545143
3881.5F01545143N32761M01230K82898j497117j91993J355705p7286o4010n09339j478042
$$ 601545143 602077904 602479134 602762032 601264915 601072922 602428627 602351341 602287331 601777992 600299950
3891.2F00299950O71920P60155j08528O55823P41348M7073r17015j653633K54822K58675
$$ 600299950 600971870 601732025 601623497 602279320 603020668 603067741 602150726 600497093 600751915 601010590
3900.8F01010590j236611M18396J50566m92096J94550R06486J148453r5138o562M65393
$$ 601010590 599773979 600192375 600342941 599850845 600045395 600951881 602100334 602005196 601998634 602464027
3910.5F02464027j98288j38816K73094M4937j12839p53517m78363O76994m6539m11110
$$ 602464027 602265739 602126923 602400017 602444954 602332115 601578598 601100235 601777229 601730690 601319580
3920.1F01319580K04735m5357o4659q2169o23436K83928N72129j81923m03862n8289
$$ 601319580 601524315 601478958 601414299 601332130 600708694 600992622 601564751 601382828 600978966 600920677
3929.7F00920677L35999k58103p00454k10038M81110O20041K12517k14997m49829L8872
$$ 600920677 601256676 600998573 600298119 600088081 600569191 601189232 601401749 601186752 600736923 600775795
3939.4F00775795N43098K67907n77469n92461K3422L91503N81894k35672o53115K01760
$$ 600775795 601318893 601586800 601009331 600416870 600440292 600831795 601413689 601178017 600524902 600726662
3949F00726662L29895o4583Q8501k46468n18875K62146K73705m36325j43814M24919
$$ 600726662 601056557 600991974 601080475 600834007 600315132 600577278 600850983 600414658 600270844 600695763
3958.7F00695763O43806M64630j65329l41339k41279j56327M9401K00042J34545j94893
$$ 600695763 601339569 601804199 601638870 601297531 601056252 600899925 600949326 601149368 601283913 601089020
3968.3F01089020M8446n8326o25954j39198L10669J67007j34659K48261K31132o55098
$$ 601089020 601137466 601079140 600453186 600313988 600624657 600791664 600657005 600905266 601136398 600481300
3978F00481300r0599O4926n31311j793J93291k47268k59705J25542M60510L73497K54936
$$ 600481300 600390701 600455627 599924316 599922523 600115814 599868546 599608841 599734383 600194893 600568390 600823326
3988.6F00823326M3488l12806q5220p3776m73023k62832K58713P16781M76456m27170
$$ 600823326 600866814 600554008 600468788 600395012 599921989 599659157 599917870 600634651 601111107 600683937
3998.2F00683937n72281J221
$$ 600683937 600111656 600112877
4000.1F00112877
$$ 600112877
##END=$$ End of the data block
