##TITLE=Sombrinha 4 $$ Begin of the data block
##JCAMP-DX=5.00 $$ ACD/SpecManager v 10.08
##SPECTROMETER/DATA SYSTEM=Alpha
##DATE=06 Mar 2015 12:54:54
##DATA TYPE=INFRARED SPECTRUM
##DATA CLASS=XYDATA
##ORIGIN=
##OWNER=
##NPOINTS=1667
##FIRSTX=599.57470703
##LASTX=3997.16503906
##MAXX=3997.16503906
##MINX=599.57470703
##MAXY=0.98428291
##MINY=0.81718636
##XFACTOR=1.0000000000
##YFACTOR=1.000000000000000e-9
##FIRSTY=0.90424949
##DELTAX=2.03937006
##XUNITS=1/CM
##YUNITS=ARBITRARY UNITS
##XYDATA=(X++(Y..Y))
599.6I04249489o88016O4790M20809J34706j79290n66483m40895R1016M7803j7762
620I03116167L58939K22385l74973p54297o12557J59562O89208L89040j64211l95358
640.4I02633905k57372j81437l59476m28319l36647l41773n55873p10845n74708n11944
660.8H98375511o22868n89252o85155j284957j334131j059353j100064j079499q34406
679.1H89785826q85665j196087j352071j702011k286494k698242k993703l453136l893077
697.5H69325340l797531l295899l162145l452778l694117l992379m623532n711913
713.8H37595046o943644p179081n276680j009285N442440J2630880J7688453J9774318
730.1H72722447K0236432J9442022J6780794J2239933O849110K164543o27935j687050
$$ y = [904249489, 903561473, 903626263, 904047072, 904181778, 904002488, 903436005, 902995110, 903086126, 903133929, 903116167, 903475106, 903697491, 903322518, 902568221, 901955664, 902115226, 902804434, 903193474, 903029263, 902633905, 902376533, 902195096, 901835620, 901407301, 901070654, 900728881, 900173008, 899462163, 898887455, 898375511, 897752643, 897163391, 896478236, 895193279, 893859148, 892799795, 891699731, 890620232, 889785826, 888900161, 887704074, 886352003, 884649992, 882363498, 879665256, 876671553, 873218417, 869325340, 865527809, 862231910, 859069765, 855616987, 851922870, 847930491, 843306959, 837595046, 830651402, 823472321, 818195641, 817186356, 822628796, 835259676, 852948129, 872722447, 892958879, 912400901, 929181695, 941421628, 948270738, 950435281, 949807346, 948120296]
746.4I48120296k038002k160966j836598j358390j275718j469493j498998j272976
762.7I35209155r99451r76979j150072j096308j055658j118124j063466j052320j188934
781.1I25507843j490116j695990j640082j421928p66218M89354J395882J062095J44779
799.4I21585619m12941m39763j62303m0948j99676j95205j34528m32730n88715m18365
819.8I18560445m63843p13170r74118r86696p63058r27210j297593j323104j280129
838.2I09831524j343668j235306o84559M48525J771807K522707K253175J318574N17011
856.5I15399790j27495r41634j769721k853871m580080n658567k604008M701436R312331
874.9I10878181P505298L856123J972854J152575L71217k10344m25995n29408n30005
$$ y = [948120296, 946082294, 943921328, 942084730, 940726340, 939450622, 937981129, 936482131, 935209155, 934209704, 933232725, 932082653, 930986345, 929930687, 928812563, 927749097, 926696777, 925507843, 924017727, 922321737, 920681655, 919259727, 918493509, 918982863, 920378745, 921440840, 921585619, 921172678, 920732915, 920570612, 920529664, 920329988, 920134783, 920000255, 919567525, 918978810, 918560445, 918096602, 917383432, 916409314, 915422618, 914659560, 913732350, 912434757, 911111653, 909831524, 908487856, 907252550, 906567991, 907016516, 908788323, 911311030, 913564205, 914882779, 915399790, 915272295, 914330661, 912560940, 909707069, 905126989, 899468422, 896864414, 901565850, 910878181, 918383479, 922239602, 924212456, 925365031, 925736248, 925525904, 925099909, 924570501, 924040496]
893.2I24040496m35650k94566l7789K47359M44531M13299J41918j06334l14474m83036
913.6I23615754n18501n29468n07295n15044o02722o10113o17683p72298q63492p29919
934I17349219o70194p61509p06971n85735o40213p86901q51631r27031j116693j246929
954.4I09055412j229406j190841j159668r98318o65128j59323N82397J503110K237021
972.8I07975256K268315J581669N64277l59774q79645j096726j178681j149595j148463
991.1I06576633j300811j567722j862943k114951k376259k695620l080308l647566
1007.4H87930453m405916m838943l565967L50475N491078R069979J0408699J0497272
1023.8I10937130Q067012K519965k473413m253209l948808l117859k386332j841843
$$ y = [924040496, 923604846, 923310280, 923272491, 923519850, 923964381, 924377680, 924519598, 924413264, 924098790, 923615754, 923097253, 922567785, 922060490, 921545446, 920942724, 920332611, 919714928, 918942630, 918079138, 917349219, 916679025, 915917516, 915210545, 914624810, 913984597, 913197696, 912346065, 911419034, 910302341, 909055412, 907826006, 906635165, 905475497, 904477179, 903812051, 903652728, 904235125, 905738235, 907975256, 910243571, 911825240, 912389517, 912029743, 911150098, 910053372, 908874691, 907725096, 906576633, 905275822, 903708100, 901845157, 899730206, 897353947, 894658327, 891578019, 887930453, 883524537, 878685594, 875119627, 875470102, 880961180, 890031159, 900439858, 910937130, 919004142, 921524107, 919050694, 914797485, 910848677, 907730818, 905344486, 903502643]
1040.1I03502643j355410r97304q91567r41932j005411j217067j656354k080261k357781
1058.4H90999556k515078k657592k913773l114343l058732k978205l091157l123641
1074.7H67547035k855718k410054j812935j019895k67625J38402L89934P48753J190663
1093.1H61648560J897871K869368L775477M449725M721999M621983M296839L517866
1109.4H91799688K321542J104355K91585M98832J794219L322124M401982N207896N989790
1127.8I16732013O559015O714880O408334N737066M856288L917993L073811K212048
1144.1I56211448J280427N59985J59145j14560m10498p73370j164913j397014j508951
1162.4I52841699j801848k244294k518773k474308k159119j716673j309216j132012
$$ y = [903502643, 902147233, 901149929, 900258362, 899316430, 898311019, 897093952, 895437598, 893357337, 890999556, 888484478, 885826886, 882913113, 879798770, 876740038, 873761833, 870670676, 867547035, 864691317, 862281263, 860468328, 859448433, 859180808, 859319210, 859709144, 860457897, 861648560, 863546431, 866415799, 870191276, 874641001, 879363000, 883984983, 888281822, 891799688, 894121230, 895225585, 895517170, 896016002, 897810221, 901132345, 905534327, 910742223, 916732013, 923291028, 930005908, 936414242, 942151308, 947007596, 950925589, 953999400, 956211448, 957491875, 958051860, 958211005, 958096445, 957685947, 956912577, 955747664, 954350650, 952841699, 951039851, 948795557, 946276784, 943802476, 941643357, 939926684, 938617468, 937485456]
1178.8I37485456j341044j756490k126872k484918k837181l044069l154456l289819
1195.1I17450607l306210l112853k894819k809047k781332k745211k807617k941132
1211.4H94052386l120720l341436l350974l063023k738177k647043k842307l161728
1227.7H69786978l328145l100276k328813j090050L11077J675487K915144L903627
1244H68745029M506946M672944M536808M176855L483355K712309K381683K712845L505648
1262.4I01434422M311621M887879N090236M888177M503489M071891L647685L322005
1278.7I36157405L063381K913833K900719K878845K846420K876818K991796L050863
1295I59680080K923847K704680K382040J860261J289546R58026Q76069P43329N05388
$$ y = [937485456, 936144412, 934387922, 932261050, 929776132, 926938951, 923894882, 920740426, 917450607, 914144397, 911031544, 908136725, 905327678, 902546346, 899801135, 896993518, 894052386, 890931666, 887590230, 884239256, 881176233, 878438056, 875791013, 872948706, 869786978, 866458833, 863358557, 861029744, 859939694, 860250771, 861926258, 864841402, 868745029, 873251975, 877924919, 882461727, 886638582, 890121937, 892834246, 895215929, 897928774, 901434422, 905746043, 910633922, 915724158, 920612335, 925115824, 929187715, 932835400, 936157405, 939220786, 942134619, 945035338, 947914183, 950760603, 953637421, 956629217, 959680080, 962603927, 965308607, 967690647, 969550908, 970840454, 971798480, 972674549, 973417878, 973923266]
1313.4I73923266K81572K2114j22905j63377n14268j276613k394020l929675n619705
1331.7I60206389o807386o627501m095196Q76248N639672P532895O968081N109787
1348I68802989L055691J490116M85659q7380n28694j051783j366258j133799q37684
1366.4I68828857o78480m11987l14474k07067Q3506L9041k90453m94182n82635n19515
1386.8I65452611q6486m0412p99358j639068j899302k098799k593636l374756l708779
1405.1I49212015j860142J622856N038678O569803N440950L428817K182543J161755
1421.5I72797275J18851l49104n81980r28700r39607q46148r67860n96583n7101r7037
1441.8I67552006l03209n64813o59645l56793j82808l63707o27816P9393R81987O01292
$$ y = [973923266, 974204838, 974226952, 974104047, 973940670, 973426402, 972149789, 969755769, 965826094, 960206389, 953399003, 946771502, 942676306, 943552554, 949192226, 956725121, 963693202, 968802989, 971858680, 973348796, 973834455, 973747075, 973218381, 972166598, 970800340, 969666541, 968828857, 968150377, 967738390, 967423916, 967216849, 967300355, 967339396, 967048943, 966554761, 965972126, 965452611, 965366125, 965325713, 964526355, 962887287, 960987985, 958889186, 956295550, 952920794, 949212015, 947351873, 948974729, 954013407, 960583210, 966024160, 969452977, 971635520, 972797275, 972916126, 972567022, 971985042, 971056342, 970116735, 969270587, 968302727, 967706144, 967649043, 967552006, 967248797, 966683984, 966024339, 965667546, 965484738, 965121031, 964493215, 964572608, 965554595, 966155887]
1462.2I66155887k20061p75695q90076p65681J41621J470923J744211J329541P92384
1480.6I68983054M34339R6500m57287q29220l24666J08004n26607j565278k149463
1499I63769376k248704j877546q66175J841843L602087K306998Q05199k80797n57721
1517.3I66494560l41177l29792j28329O6221K01106L41356L0040k54392m8459j76191
1537.7I65854943q32796q46684k16484K24650J83105q1181q6904j85430l82364p49230
1558.1I62881625l14653M38332R6023l00288n37932o42955m23312m83811n70953K26855
1578.5I60368931Q40545P35700L00825M6789r7692k35438k36809k87473k95878k64168
1598.9I60875332l88801m77671m70579n37157m49360k04503j18792k76268l26037p689
$$ y = [966155887, 965935826, 965160131, 964270055, 963504374, 963645995, 965116918, 966861129, 968190670, 968983054, 969417393, 969513893, 969056606, 968227386, 967902720, 968010724, 967484117, 965918839, 963769376, 961520672, 959643126, 958776951, 960618794, 964220881, 966527879, 967333078, 967052281, 966494560, 966153383, 965823591, 965695262, 965761483, 965962589, 966303945, 966333985, 966079593, 966031134, 965854943, 965022147, 964175463, 963958979, 964183629, 964366734, 964285553, 964198649, 964013219, 963630855, 962881625, 962566972, 963005304, 963101327, 962801039, 962263107, 961620152, 961196840, 960713029, 960142076, 960368931, 961209476, 961945176, 962246001, 962292790, 962195098, 961959660, 961722851, 961435378, 961139500, 960875332, 960486531, 960008860, 959538281, 959001124, 958551764, 958347261, 958228469, 957952201, 957626164, 957618475]
1619.3I57618475n8174l95358m73499l73900l47972l38614o03080j055956o01291j05143
1639.7I53265488l39389p61151j201630r38773k20954p97451j520931m69804l46482
1658I46668923r61959j504064j572013j352549j582861j845002j418829j451790j741171
1676.4I33238685j733363j755774j836180k057731j910448k157689k709269k876461
1692.7I16201770l808140m919649n019426n678475m589975l691435l491401k240181
1709H82763088r45032N38349K744079O486773Q715392P331669O763995O939530O605089
1727.4I27942932O391287O258845P401705Q186102O212174N453229N147994M067719
1743.7I77061987K970815J714408R26495Q99374O77347L2485l17037l62337m76539
$$ y = [957618475, 957560301, 957164943, 956691444, 956317544, 955969572, 955630958, 955027878, 953971922, 953370631, 953265488, 952926099, 952164948, 950963318, 950024545, 949803591, 949006140, 947485209, 947015405, 946668923, 945706964, 944202900, 942630887, 941278338, 939695477, 937850475, 936431646, 934979856, 933238685, 931505322, 929749548, 927913368, 925855637, 923945189, 921787500, 919078231, 916201770, 912393630, 907473981, 902454555, 896776080, 892186105, 888494670, 885003269, 882763088, 881818056, 882356405, 885100484, 891587257, 900302649, 907634318, 914398313, 921337843, 927942932, 934334219, 940593064, 947994769, 956180871, 962393045, 967846274, 972994268, 977061987, 980032802, 981747210, 982673705, 983573079, 984250426, 984282911, 983965874, 983603537, 983126998]
1762I83126998l96788n41687o71447m60624m05967k78652n3644j70827l67344l69727
1782.4I79410291l24011k03610k80439n94318n30899l8028O0380k88308n13434j41025
1802.8I76556599J44959j10507l39806k57194l7075l4391j15335o1810j06574l19480
1823.2I75319386l16203j19984j63496q106K05755N4002j7226L9757j79589m26769
1843.6I74387527k10822J40905K55049J35302n066q941l6061q0287n1439j45793m55499
1866I73924875n40316l7670L33965J66535n5551r6619o1214p0751j13666k21014l40939
1888.5I72887635j71363M4167k265o9737q5593q0287n1379p5818j86681k13623k6405
1910.9I71968651N7280j41561k81811j29521o6161j27912J610P1287L2663J2935r3639
$$ y = [983126998, 982730210, 982188523, 981517076, 981056452, 980650485, 980371833, 980318189, 980147362, 979780018, 979410291, 979086280, 978882670, 978602231, 978007913, 977477014, 977438986, 977499366, 977211058, 976697624, 976556599, 976701558, 976591051, 976251245, 975994051, 975956976, 975922585, 975807250, 975745440, 975638866, 975319386, 975003183, 974883199, 974719703, 974711597, 974917352, 974971354, 974954128, 974993885, 974814296, 974387527, 974176705, 974317610, 974572659, 974707961, 974702895, 974693954, 974657893, 974577606, 974526167, 974380374, 973924875, 973384559, 973346889, 973680854, 973847389, 973791838, 973695219, 973634005, 973563254, 973449588, 973228574, 972887635, 972716272, 972760439, 972758174, 972688437, 972602844, 972522557, 972471178, 972395360, 972208679, 971995056, 971968651, 972025931, 971884370, 971602559, 971473038, 971406877, 971278965, 971280575, 971351862, 971384525, 971397460, 971303821]
1933.3I71303821j98424j54078j53780k59459r6262J01507l0756j33693p2778Q35L3736
1955.8I70340669L6061R0480J20103J2934q5055k146J70529K22146J09315k7895o6161
1978.2I70920980l8564J3530J0788j32143k13325j15573O3955K14279J36018j7107
1998.6I70842838m351n424j07765j14679J6450P0751m4882j44720m7863R1255L5763
2021I70587373n6267n0664n1439n2333k920J9252r8705j93179o6876N7280L0100M77
2045.5I70122099M4763O2585j6332q6546r4950p8142n5074r2089k14339j89364L1412
2067.9I69434023Q9109k9206o0380j2338j2815m6969m351M6194j5497r5606p9870q703
2092.4I69203591K4379K7716M0591P8737P4327m530m4465k6822l874m4882q1063M053
$$ y = [971303821, 971105397, 970951319, 970797539, 970538080, 970441818, 970543325, 970512569, 970378876, 970306098, 970306933, 970340669, 970376730, 970467210, 970587313, 970600247, 970515192, 970513046, 970683575, 970905721, 971015036, 970987141, 970920980, 970882416, 970895946, 970906734, 970774591, 970561266, 970445693, 970509648, 970723927, 970859945, 970842838, 970838487, 970833063, 970725298, 970610619, 970627069, 970697820, 970652938, 970508218, 970460355, 970551610, 970587373, 970531106, 970480442, 970429003, 970376670, 970373750, 970393002, 970294297, 970101118, 970034242, 970091522, 970121622, 970122099, 970166862, 970229447, 970213115, 970126569, 970031619, 969953477, 969898403, 969806314, 969591975, 969402611, 969434023, 969523132, 969493926, 969433546, 969421208, 969408393, 969361424, 969357073, 969403267, 969387770, 969292164, 969212294, 969203591, 969227970, 969255686, 969296277, 969375014, 969449341, 969444811, 969400346, 969373524, 969369650, 969324768, 969243705, 969247758]
2116.9I69247758J04130J17898O3717k1994j27316j20163K7597Q6427K2888l338L5346
2139.3I69432950K0981n2333k7776N5850O1869L4452j0491o9975q9884o3896j1266
2161.8I69280481J8418P272n603j609K6881K2531l8981k5273J4723j5796j6033K0981
2186.2I69287992M5239J3233o1751o2763j8239r358J251K4379p391n6088j0014K2471
2210.7I69168961l3379n0902l5167J669L1650k980m530n603n3107m7088j7226Q285
2235.2I68960583R835l0220m1782o1036n8233J0430L6300M0888O2645j6928j60813
2257.6I68751669j19031Q7977J58906L5345o1810l6895J9431J1683q9526j21236j0848
2280I68625665K3246k0147N6327J22606R299p5639m8458p3135r4772m3511j5378l8266
$$ y = [969247758, 969351888, 969469786, 969533503, 969511509, 969384193, 969264030, 969291627, 969378054, 969400942, 969397604, 969432950, 969453931, 969401598, 969373822, 969429672, 969491541, 969525993, 969515502, 969445527, 969355643, 969291747, 969280481, 969298899, 969306171, 969300568, 969298959, 969325840, 969348371, 969309390, 969284117, 969298840, 969283044, 969267011, 969287992, 969333231, 969346464, 969284713, 969221950, 969203711, 969194353, 969195604, 969219983, 969212592, 969156504, 969146490, 969168961, 969135582, 969084680, 969049513, 969051182, 969082832, 969079852, 969075322, 969069719, 969016612, 968969524, 968952298, 968960583, 968970418, 968940198, 968898416, 968837380, 968779147, 968789577, 968825877, 968866765, 968929410, 968912482, 968751669, 968632638, 968720615, 968879521, 968914866, 968853056, 968816161, 968835592, 968847275, 968757749, 968636513, 968625665, 968648911, 968628764, 968685091, 968807697, 968816996, 968741357, 968692899, 968619764, 968524992, 968481481, 968466103, 968427837]
2304.5I68427837n2571m3571P391J04248J32263O2287J2695R1494K38239K40803J38462
2326.9I69359577J21116J86861L12626L71993K03192K5869q5116l39210n85437m61578
2347.3I69109893m7088L36409M82261M52638M41253K56657j48236m82381n24401m17114
2367.7I69459891l59535l71814l60548k72393j91868j07884K205J37091K65241K08914
2388.1I68409300r596j07825n9247J6689J09613J42753N5850p2539p6354N9188J24573
2410.6I68592405N2393J1503K1637J490j4543n0605o3598J3709N3525k4021q6903m5002
2435I68461990L7790P3850J0788p1108q4758n1498k146O0141J15693N4359r0063o5207
2459.5I68449831J00613R8586m4048r9540m5240k980p629Q523j5318m8697K0861L6717
$$ y = [968427837, 968375266, 968331695, 968339086, 968443334, 968575597, 968637884, 968650579, 968742073, 968980312, 969221115, 969359577, 969480693, 969667554, 969980180, 970352173, 970555365, 970581234, 970496118, 970156908, 969571471, 969109893, 969062805, 969399214, 969881475, 970334113, 970775366, 971032023, 970883787, 970401406, 969877005, 969459891, 969100356, 968728542, 968367994, 968095601, 967903733, 967795849, 967798054, 967935145, 968200386, 968409300, 968399704, 968291879, 968232632, 968249321, 968358934, 968501687, 968557537, 968484998, 968408644, 968467832, 968592405, 968644798, 968656301, 968677938, 968679428, 968664885, 968614280, 968550682, 968564391, 968617916, 968593895, 968506992, 968461990, 968499780, 968573630, 968584418, 968513310, 968428552, 968377054, 968374908, 968435049, 968550742, 968605101, 968515038, 968449831, 968550444, 968649030, 968604982, 968505442, 968460202, 968457222, 968449593, 968458116, 968442798, 968394101, 968414962, 968451679]
2484I68451679l4809r001M0770J2934l3498m9472m8339o0379l4690J5378N2154Q3327
2508.4I68386054J02043P2479k5034j24156j22368L3199J39893M9054p3850r3877m4585
2530.9I68298852p808K8074K9862p15j2577o5148n9306M7266Q9049N6982l0279r7692
2555.3I68276560L0041J66237R5606l2484n9903j2040l0577o8724l4988k2412j0669
2577.8I68296647N9068P0215k7061o5863P391P0691P3731N0843L2425l7313j65403
2600.2I68365371j49190l994L2783M8756R3997L6240m1128o1094o6400j8060N8412
2622.6I68295693O1274L8743K1935j0491p510K8372N5670P7785J4901j06573l5882
2645.1I68433917J03712M2855q106J8180k5273p1466p2121J6331O2764p987P927O9142
$$ y = [968451679, 968416870, 968407869, 968448639, 968461573, 968428075, 968378603, 968330264, 968269885, 968235195, 968250573, 968302727, 968386054, 968488097, 968560576, 968535542, 968411386, 968289018, 968322217, 968462110, 968511164, 968437314, 968343437, 968298852, 968291044, 968319118, 968348980, 968348265, 968335688, 968270540, 968211234, 968258500, 968347549, 968404531, 968374252, 968276560, 968306601, 968472838, 968568444, 968535960, 968476057, 968464017, 968433440, 968364716, 968329728, 968307316, 968296647, 968355715, 968425930, 968398869, 968333006, 968340397, 968411088, 968484819, 968535662, 968568087, 968530774, 968365371, 968216181, 968212187, 968244970, 968293726, 968387723, 968423963, 968382835, 968321741, 968255341, 968237281, 968295693, 968356967, 968395710, 968417645, 968407154, 968399644, 968428016, 968483686, 968561471, 968576372, 968469799, 968433917, 968537629, 968580484, 968572378, 968590558, 968565285, 968493819, 968421698, 968438029, 968500793, 968492806, 968500733, 968569875]
2669.5I68569875N2213j4424o5863p4804l5703O2644R1792j2160j38759j69039n4717
2692I68211055R3341R4831l6538j11341n0068N3048N1439j2756l2365k1637L9518R0957
2716.4I68369484M3452j2756j8537o7711q9168r179Q702L099M2141M0114k6465p6949
2740.9I68206227j490P0572N1081Q4817J13547l6597j48058p6711o8248p9810J2994
2763.4I68128324N1200O258j4722K4378N2691k5034j04606k1339J08719M7505n8651
2785.8I68194723o8843j21951r5487J5199j1921n8710j6451l1710j1802O1334j8716
2808.2I67835665q2016l2068L9042J21891R7632m8995j46865j26243q6308r8884q8453
2830.7I67384398K9445Q0824p0095k20061k23994j92702k61545l37064k15769L1054
$$ y = [968569875, 968622088, 968607664, 968541801, 968466997, 968431294, 968493938, 968585730, 968573570, 968434811, 968265772, 968211055, 968304396, 968399227, 968362689, 968251348, 968201280, 968254328, 968305767, 968293011, 968260646, 968239009, 968278527, 968369484, 968412936, 968400180, 968381643, 968313932, 968224764, 968215585, 968224287, 968227386, 968269527, 968309641, 968283176, 968206227, 968204737, 968275309, 968326390, 968411207, 968524754, 968488157, 968340099, 968263388, 968195140, 968115330, 968128324, 968179524, 968185782, 968171060, 968195438, 968248129, 968223095, 968118489, 968097150, 968205869, 968253374, 968194723, 968125880, 968003929, 967908442, 967923641, 967911720, 967853010, 967836559, 967804849, 967793047, 967854381, 967835665, 967753649, 967721581, 967760623, 967882514, 967980146, 967931151, 967784286, 967658043, 967571735, 967472851, 967384398, 967413843, 967494667, 967424572, 967204511, 966980517, 966787815, 966526270, 966189206, 965973437, 966004491]
2851I66004491K01106K50161K03967J21414J20283J57117J9908j28388o4790n663m6968
2873.5I66832638o6161l3200O318K8491Q5235J25825K9802o9081r9540j87636j91807
2895.9I66460884j11699k04742l23415k16127j5437R1195Q6248O0558O3598L0697m3512
2918.3I65878248j8179J29044K21550K40624J83761M8697J0252K7240n3168p2062L2485
2940.8I66628492K0563o3776r3759j44124j87337j66535j12474p8261j2100K3305p2717
2963.2I65741277q9646O1095K35379M34339N83887N59032M41253K96652K18571K38478
2983.6I68720317J88231N8771j967L0040K2829l3498n8591r0480r9301j6630J39177
3006I68858898K38537J75477N3942l100J5676P1466J11699J10329Q1598O5983M4465
$$ y = [966004491, 966205597, 966455758, 966659725, 966781139, 966901422, 967058539, 967078447, 966950059, 966885269, 966879606, 966832638, 966766477, 966733277, 966739595, 966768086, 966853321, 966979146, 967008948, 966939867, 966840327, 966652691, 966460884, 966349185, 966144443, 965821028, 965604901, 965589464, 965680659, 965766907, 965827465, 965891063, 965921760, 965878248, 965860069, 965989113, 966210663, 966451287, 966635048, 966683745, 966693997, 966721237, 966668069, 966596007, 966628492, 966649055, 966585279, 966491520, 966347396, 966160059, 965993524, 965881050, 965802789, 965790689, 965813994, 965741277, 965651631, 965712726, 965948105, 966382444, 966966331, 967525363, 967966616, 968263268, 968481839, 968720317, 968908548, 968967319, 968965352, 968995392, 969018221, 968984723, 968926132, 968835652, 968736351, 968719721, 968858898, 969097435, 969272912, 969326854, 969323754, 969339430, 969410896, 969522595, 969632924, 969714522, 969780505, 969824970]
3028.5I69824970l5465o7949o855j5497o7234j12951j29402m5418j3233k5808l9697
3050.9I69265461r4652n3346K1338J7405k1875N960R2805Q2135K8431N603O199L3975
3075.4I69389439M5538k5094r2089m471N6923N4181J01387L1769r4950n1856K8133
3097.8I69438910k801m291L4868N3108P5817O0856J2935j6332j4484k2471k9921M6968
3122.3I69633162J47760R4831j02699j92702n4419Q5891R8824M4942j3709N1618J24156
3144.7I69917655L099j43170m0591J19686P749j72198k08914n9128J54197J21534J312
3167.1I69701231K1040j5914j39475j19806R3103K18272J16765L9042k0445j11997
3187.5I69781816p7605L457R298k980l100q5890j10447N1200J84655J40787K145n0366
$$ y = [969824970, 969789505, 969721556, 969714701, 969699204, 969631970, 969519019, 969389617, 969344199, 969330966, 969305158, 969265461, 969170809, 969117463, 969138801, 969156206, 969134331, 969140291, 969233096, 969315231, 969343662, 969349265, 969355464, 969389439, 969434977, 969409883, 969317794, 969313323, 969370246, 969424427, 969525814, 969557583, 969462633, 969410777, 969438910, 969436109, 969431818, 969466686, 969519794, 969595611, 969656467, 969669402, 969653070, 969638586, 969616115, 969586194, 969633162, 969780922, 969875753, 969773054, 969580352, 969525933, 969611824, 969710648, 969755590, 969741881, 969793499, 969917655, 969920754, 969777584, 969736993, 969856679, 969864428, 969692230, 969483316, 969424188, 969578385, 969699919, 969701231, 969722271, 969706357, 969566882, 969447076, 969540179, 969758451, 969875216, 969914258, 969893813, 969781816, 969704211, 969707668, 969716966, 969713986, 969710886, 969624996, 969514549, 969565749, 969750404, 969891191, 969893336, 969842970]
3212I69842970o0439r2387j14143q6486K3544M8697m1187l2246Q9228J40190J00434
3234.4I69818175n4181j91331p4982P1048J32919J82867J15275l8147j52647j61112
3254.8I69647884j03175j9908J64985K66493P4208o8784O8128J08182q9049k13563
3275.2I69835401j25766N9485O6638j06633j80959m8518J48236J10746J8894N2393
3295.6I69829917j3590j04129M053J44362m3690k10404m947Q4579k1458K0027J16944
3318I69801664J17958O4373N3883N5670n8531j44303m3392Q7499M3690o8009m8756
3340.5I69861746L4213R5904R6142J4246j3471P3433O4194L338J2398m6850o4015n3048
3364.9I70078230j20819p5638O7830O5267m9412o5088r776n0067j23144k6166J33991
$$ y = [969842970, 969782531, 969690144, 969576001, 969489515, 969513059, 969561756, 969520569, 969488323, 969577551, 969717741, 969818175, 969763994, 969572663, 969497681, 969568729, 969701648, 969884515, 969999790, 969961643, 969808996, 969647884, 969544709, 969524801, 969689786, 969956279, 970030487, 969961703, 970029831, 970138013, 970048964, 969835401, 969709635, 969769120, 969835758, 969729125, 969548166, 969499648, 969647884, 969758630, 969777524, 969829917, 969816327, 969712198, 969716251, 969860613, 969816923, 969606519, 969601572, 969686151, 969664693, 969684720, 969801664, 969919622, 969983995, 970037878, 970093548, 970035017, 969890714, 969847322, 969934821, 969978511, 969910502, 969861746, 969895959, 969991863, 970088005, 970102251, 970088780, 970162213, 970226407, 970229745, 970242143, 970195293, 970131278, 970078230, 969957411, 969881773, 969949603, 970014870, 969965458, 969900370, 969890594, 969840527, 969717383, 969691217, 969825208]
3387.4I69825208J21713j2517o0558k504N3108M7803j1921L1412K01702J72615j00911
3409.8I70265150j46747K9684J8537r9779r7274j02342j68919o5208Q0288Q2433R8646
3432.2I69894469K25842K94149Q3744j36375m7088P2718m77l0816O5744J58668J74343
3454.7I70754921J15753J4543j35541j44958P3135K24411J91510P3254p4685q3983
3475.1I71008360n0544j91748k05219n007L2544l0994M1186Q5175K6763M2140Q6070
3497.5I70838726m8101k77043j22010L05473K51174j17004j45912N5909J40429O7949
3517.9I70949590q3566k17378k58445j28568R7573K26259K37287J15156o2049K265
3538.3I70878124O0797k74301n43117j85847L43978L50773J65344K07483Q1480k55048
$$ y = [969825208, 969946921, 969934404, 969873846, 969871342, 969924450, 969972253, 969960332, 969991744, 970193446, 970366061, 970265150, 970118403, 970148087, 970166624, 970066845, 969969571, 969867229, 969698310, 969633102, 969713390, 969795823, 969894469, 970120311, 970414460, 970498204, 970361829, 970314741, 970387459, 970386982, 970356166, 970421910, 970580578, 970754921, 970870674, 970885217, 970749676, 970604718, 970677853, 970902264, 971093774, 971167028, 971092343, 971008360, 970957816, 970766068, 970560849, 970555842, 970588386, 970557392, 970598578, 970683753, 970710516, 970752656, 970838726, 970790625, 970513582, 970391572, 970697045, 970948219, 970831215, 970685303, 970741212, 970881641, 970949590, 970866024, 970648646, 970390201, 970261633, 970359206, 970585465, 970822752, 970937908, 970875859, 970878124, 970938921, 970664620, 970121503, 969935656, 970279634, 970630407, 970795751, 971003234, 971084714, 970829666]
3558.7I70829666k38419j45376n39600n68510M16696Q51930M52160K33055K11775j0788
3579.1I71492589j58608j45674l84867m38631K47002M80771j6272k58625o3777L0458
3599.5I70784366J12057K10643J609k50041j78695j12772j04964p7486j78874J42158
3619.9I70348001N67138L98636k6823n09858l31819K74539M42088M03464K36749R895
3640.3I71812010j68264l49701o61015p57873J15752R74655P17998Q1479m2081J08898
3660.6I71831858J15335M0412j35600l95954r2447L34084j71542l57151K27451L78132
3681I71774578K75195J35362k30074n11825K8074M55439K67267Q2254n602l2783Q8632
3703.5I72326517J33813l6359l44575l94523N0783L06070J79052j12950l77357l23654
$$ y = [970829666, 970591247, 970445871, 969906271, 969337761, 969754457, 970606387, 971058547, 971291602, 971503377, 971492589, 971333981, 971188307, 970803440, 970364809, 970611811, 971092582, 971076310, 970817685, 970753908, 970784366, 970896423, 971107066, 971108675, 970858634, 970679939, 970567167, 970462203, 970384717, 970205843, 970348001, 970915139, 971313775, 971286952, 970777094, 970445275, 970719814, 971161902, 971565366, 971802115, 971812010, 971643746, 971294045, 970633030, 969875157, 969990909, 970965564, 971683562, 971765041, 971722960, 971831858, 971947193, 971987605, 971852005, 971456051, 971363604, 971697688, 971526146, 971168995, 971396446, 971774578, 972049773, 972185135, 971955061, 971443236, 971471310, 971926749, 972194016, 972276270, 972270668, 972237885, 972326517, 972460330, 972423971, 972079396, 971684873, 971735656, 972041726, 972220778, 972107828, 971730471, 971406817]
3723.9I71406817L9995M19259L94702l24964j109660o15716N23627P20739J16229m22597
3744.3I71148431P9573M28617k01524m29213J62482L04521O9618J86980L85880J18434
3764.7I72253799j88350k04623O4373L81410K94924n2095k45153m6373J00374l2782
3785I72325504O0260K63631J83642k324j88351k74002k02477k32637p272K82168J74523
3807.5I72382665J20818K08974P8976j78575j15514j67429k65062J07348J25765K0028
3827.9I72317994O1690l8743n6088j96099o13868m62711J02818M39227N71727L99828
3848.3I72525775j54137r42528o91593N23209O89865K56300j00196o2942j2458k34306
3868.7I71796989j05679K34962K63631K41161q5771k96832j4364K3663R7513P7426
$$ y = [971406817, 971446812, 971866071, 972260773, 971935809, 970826149, 970210433, 970734060, 971454799, 971571028, 971148431, 971228004, 971656621, 971455097, 971025884, 971188366, 971492887, 971562505, 971749485, 972135365, 972253799, 972065449, 971860826, 971925199, 972306609, 972601533, 972549438, 972304285, 972257912, 972358286, 972325504, 972385764, 972649395, 972833037, 972830713, 972642362, 972368360, 972165883, 971933246, 971925974, 972208142, 972382665, 972503483, 972712457, 972791433, 972612858, 972497344, 972329915, 972064853, 972172201, 972297966, 972317994, 972379684, 972340941, 972284853, 972088754, 971474886, 971012175, 971114993, 971554220, 972125947, 972525775, 972371638, 971429110, 970737517, 971260726, 971950591, 972206891, 972106695, 972043753, 972031295, 971796989, 971691310, 971926272, 972189903, 972431064, 972345293, 972048461, 972034097, 972057760, 972155273, 972232699]
3889.1I72232699j94847P331J96278j92225o22868n75483M6253P56860Q10981M36067
3909.4I72901046J58847j13249l41356j17958J37806l2901k24293k6881K25007m5597
3929.8I72520471k48552J42038K77221m3511j19448l7253p9751M18K24888K45213Q4222
3952.3I72965956N8889n4061j65046l3736J19984Q2136q3745J848L9518j46807j0788
3974.7I72774148J67608J03593J05381P8976l4451q8334r537J48118R9182n9486p689
3997.1I73277509
$$ y = [972232699, 972037852, 972045183, 972241461, 972049236, 971426368, 970850885, 970897138, 971653998, 972464979, 972901046, 973059893, 972946644, 972605288, 972487330, 972625136, 972592235, 972367942, 972341061, 972566068, 972520471, 972271919, 972413957, 972691178, 972647667, 972528219, 972490966, 972411215, 972411633, 972636521, 972881734, 972965956, 973024845, 972970784, 972805738, 972772002, 972891986, 972974122, 972890377, 972892225, 972931743, 972784936, 972774148, 972941756, 973045349, 973150730, 973229706, 973195255, 973106921, 973097384, 973245502, 973344684, 973285198, 973277509]
##END=$$ End of the data block
