##TITLE=Sombrinha 3 $$ Begin of the data block
##JCAMP-DX=5.00 $$ ACD/SpecManager v 10.08
##SPECTROMETER/DATA SYSTEM=Alpha
##DATE=06 Mar 2015 12:54:54
##DATA TYPE=INFRARED SPECTRUM
##DATA CLASS=XYDATA
##ORIGIN=
##OWNER=
##NPOINTS=1667
##FIRSTX=599.57470703
##LASTX=3997.16503906
##MAXX=3997.16503906
##MINX=599.57470703
##MAXY=0.98932040
##MINY=0.88297945
##XFACTOR=1.0000000000
##YFACTOR=1.000000000000000e-9
##FIRSTY=0.94010127
##DELTAX=2.03937006
##XUNITS=1/CM
##YUNITS=ARBITRARY UNITS
##XYDATA=(X++(Y..Y))
599.6I40101266n21660M46141P29441M42625J17182k00510l40283J15097P03454N73635
$$ 940101266 939579606 940025747 940755188 941197813 941314995 941114485 940774202 940889299 941592753 942166388
620I42166388P6890l56376m69566l28242k65539J24156N65231J92345l38614l92557
$$ 942166388 942243278 941886902 941417336 941089094 940823555 940947711 941512942 941705287 941366673 940974116
640.4I40974116l48806l53217m19319m42684l63230l53694n89133q46207n77509J3113
$$ 940974116 940625310 940272093 939852774 939410090 939046860 938693166 938104033 937257826 936680317 936693430
660.8I36693430l4690m90904n55336m82083m40657m49955o70374o96301m34399m29690
$$ 936693430 936658740 936167836 935612500 935130417 934689760 934239805 933569431 932873130 932438731 932009041
681.1I32009041o24716p34687r58085j170516j241743j489044j911163k212584k182841
$$ 932009041 931384325 930649638 929691553 928521037 927279294 925790250 923879087 921666503 919483662
699.5I19483662j789928j572430j878798k450168l128409l685058m198908m989088
$$ 919483662 917693734 916121304 914242506 911792338 908663929 904978871 900779963 895790875
715.8H95790875n562425m846751k402246J763105P099926J1384309J3163507J3421058
$$ 895790875 890228450 885381699 882979453 884742558 891842484 903226793 916390300 929811358
732.1I29811358J2711704J0676921P589399M132033J270771j90675p66576j077294
$$ 929811358 942523062 953199983 960789382 964921415 966192186 966001511 965234935 964157641
748.4I64157641j050413q08119o12021o04868p97510q75890p52092o76930p08997q10087
$$ 964157641 963107228 962299109 961687088 961082220 960284710 959408820 958656728 957979798 957270801 956460714
768.8I56460714q58843r60767j038373p58648n92172r69052j371622j280427j046062
$$ 956460714 955601871 954641104 953602731 952844083 952251911 951282859 949911237 948630810 947584748
787.2I47584748j006484n00500M96089R18806M99070j18017m17710l15010q5354l4273
$$ 947584748 946578264 946077764 946573853 947492659 947991729 947873712 947456002 947140992 947055638 947021365
807.6I47021365l9279R5308K80678K50637n1558k71320k22802j31011k66433m18305
$$ 947021365 946982086 947077394 947358072 947608709 947557151 947285831 947063029 946932018 946665585 946247280
828I46247280m16458m99070n39779m61877o25789q75592q27611n83112L5226J035333
$$ 946247280 945830822 945331752 944791973 944330096 943704307 942828715 942001104 941417992 941453218 942488551
848.4I42488551J669228J563907J074314O18637J27971m69327r23515j468181k567172
$$ 942488551 944157779 945721686 946796000 947414637 947542608 947073281 946149766 944681585 942114413
866.7I42114413l576040k152384K219439N323410M479050K383233J332283P10606M0770
$$ 942114413 938538373 936385989 938605428 943928838 948407888 950791121 952123404 952834010 952874780
885.1I52874780l55900m75824m65214m44114m26769l84391l02076j11401M9114O0857
$$ 952874780 952518880 952043056 951577842 951133728 950706959 950322568 950020492 949909091 949958205 950019062
905.5I50019062n1141k70069m21464m10796m16338l86417k44558j96278k46584k83003
$$ 950019062 949967921 949697852 949276388 948865592 948449254 948062837 947818279 947622001 947375417 947092414
925.9I47092414k95401k64406j81317p3731j5557k7418k8849q6605k20120l34502n18560
$$ 947092414 946797013 946532607 946351290 946277559 946262002 946234584 946205735 946119130 945899010 945564508 945045948
948.3I45045948p42674q48889r29952j118898j235962j140237q58068m04239R9659
$$ 945045948 944303274 943454385 942524433 941405535 940169573 939029336 938171268 937767029 937866688
966.7I37866688P03275J434803J886308J743436J121759K96116m74929j053930j380563
$$ 937866688 938569963 940004766 941891074 943634510 944756269 945052385 944577456 943523526 942142963
985I42142963j367747j079440q23677q43883j032948j130283j046658r10520r54747
$$ 942142963 940775216 939695776 938872099 938028216 936995268 935864985 934818327 933907807 932953060
1003.4I32953060j414836k362370l445506l692329k246619N46217L457368N372226
$$ 932953060 931538224 929175854 925730348 922038019 919791400 920337617 923794985 929167211
1019.7I29167211O430745P064998N865634K252817j324058k983152l036499k272606
$$ 929167211 935597956 942662954 948528588 950781405 949457347 946474195 943437696 941165090
1036I41165090j460731j019895p38442m73500m22477n82993p52152j006066j525641
$$ 941165090 939704359 938684464 937946022 937472522 937050045 936467052 935714900 934708834 933183193
1054.4I33183193k072751k190769j917601j618802j354158j117826j196384j612604
$$ 933183193 931110442 928919673 927002072 925383270 924029112 922911286 921714902 920102298
1070.7I20102298k009034k144158j919985j488864j012862m79579o6399J17600L22938
$$ 920102298 918093264 915949106 914029121 912540257 911527395 911047816 910981417 911099017 911421955
1089I11421955N96165P89941J169920J836776K413273K735615K905607K914012K583086
$$ 911421955 912018120 912808061 913977981 915814757 918228030 920963645 923869252 926783264 929366350
1107.4I29366350K003610J522839J043499N21183M29749J003504J989126K854348L361761
$$ 929366350 931369960 932892799 933936298 934457481 934887230 935890734 937879860 940734208 944095969
1125.7I44095969L724158M037857M194498L977656L447772K969086K515077J853288
$$ 944095969 947820127 951857984 956052482 960030138 963477910 966446996 968962073 970815361
1142.1I70815361J073360M07100k9087k87295m14550m24326n43117q42154r87709r28998
$$ 970815361 971888721 972295821 972266734 971979439 971564889 971140563 970597446 969755292 968767583 967838585
1162.4I67838585r71257j186431j365661j309216j081169q33750o02066n49734q57115
$$ 967838585 966867328 965680897 964315236 963006020 961924851 961091101 960489035 959939301 959082186
1180.8I59082186j333713j629830j758337j823902j704216j548052j654863j894414
$$ 959082186 957748473 956118643 954360306 952536404 950832188 949284136 947629273 945734859
1197.1I45734859k077818k273918k344191k031564j611412j449764j457512j688361
$$ 945734859 943657041 941383123 939038932 937007368 935395956 933946192 932488680 930800319
1213.4I30800319k095163k175748j818598j466512j395584j500427j645506j688003
$$ 930800319 928705156 926529408 924710810 923244298 921848714 920348287 918702781 917014778
1229.7I17014778j482189j047313n01693J75119R99331J809061K485275K924979L051102
$$ 917014778 915532589 914485276 913983583 914158702 915158033 916967094 919452369 922377348 925428450
1248.1I25428450K918303K636016K223908J780212J508832J578391K077877K721429
$$ 925428450 928346753 930982769 933206677 934986889 936495721 938074112 940151989 942873418
1264.4I42873418L114283L169477L012360K705216K346992K131939K009750J867771
$$ 942873418 945987701 949157178 952169538 954874754 957221746 959353685 961363435 963231206
1280.7I63231206J792669J793146J778365J703620J611948J624286J637399J525342
$$ 963231206 965023875 966817021 968595386 970299006 971910954 973535240 975172639 976697981
1297I76697981J425863J310229R92000O03795M15146L64602K74241J44720L994j57297
$$ 976697981 978123844 979434073 980426073 981029868 981445014 981809616 982083857 982228577 982232571 982075274
1317.4I82075274k28047k20478m26471r24468j593471k486169l563464m379511m232168
$$ 982075274 981847227 981626749 981200278 980275810 978682339 976196170 972632706 968253195 964021027
1335.8I64021027k422511J004934L986776M833460M287421L158391J943528R74715
$$ 964021027 961598516 962603450 966590226 971423686 975711107 978869498 980813026 981787741
1352.1I81787741K49505k10643m73618p23124q81791o60717l84808k72155j56104k36750
$$ 981787741 982037246 981826603 981352985 980629861 979748070 979087353 978702545 978430390 978274286 978037536
1372.5I78037536k30253O3062Q5414j87278l94285m83751m30584p3075N9723m14908
$$ 978037536 977807283 977870345 977955759 977768481 977374196 976890445 976459861 976386786 976446509 976031601
1392.9I76031601j011252j129031j079559j286984j818895k067864r66192R59099K780318
$$ 976031601 975020349 973891318 972811759 971524775 969705880 967638016 966671824 967630923 970411241
1411.3I70411241L653824L059566J938343J328171P81536P9989k27928l52144n57125
$$ 970411241 974065065 977124631 979062974 980391145 981172681 981252670 981024742 980672598 980115473
1429.6I80115473n33342m87149o26147l89754J7225J7584j69635m40419m99189j96159
$$ 980115473 979582131 979094982 978468835 978079081 978096306 978113890 977944255 977503836 977004647 976808488
1450I76808488n0425k66314n91039q3328O68645L65317k75731o08325n63681m12345
$$ 976808488 976758063 976491749 975900710 975817382 976486027 976851344 976575613 975967288 975403607 974991262
1470.4I74991262J99616R60112J021444P88391M80771K27511l4988m53830o50286k02895
$$ 974991262 975190878 976150990 977172434 977960825 978441596 978669107 978634119 978180289 977530003 977327108
1490.8I77327108R4295l72887j114189j352072j177311r28521m86434Q55446J996219
$$ 977327108 977421403 977048516 975934327 974582255 973404944 972476423 971989989 972845435 974841654
1509.1I74841654J379133M03642k37524l04282k31206j99676M6968O259L4630K72930
$$ 974841654 976220787 976624429 976386905 976082623 975851417 975651741 975698709 975704968 975739598 976012528
1529.5I76012528N5849j77919L457j41681n97059l94345L3558J75595P2420j07229
$$ 976012528 976068377 975890458 975893915 975752234 975155175 974760830 974794388 974969983 975042403 974935174
1549.9I74935174l6955L7432J0848k29716k15829J25587l815j46091k10702k93493
$$ 974935174 974898219 974935651 974946499 974716783 974500954 974626541 974622726 974476635 974265933 973972440
1570.3I73972440k44975l54708m87744L9577N41687N77986K62261j26958k58923j93238
$$ 973972440 973727465 973372757 972885013 972924590 973466277 974044263 974306524 974179566 973920643 973727405
1590.7I73727405j90675k31266k13444j87219j66714j71065k72095m03524k70128o6638
$$ 973727405 973536730 973305464 973092020 972904801 972738087 972567022 972294927 971891403 971621275 971554637
1611.1I71554637n6684j18136j83881m6074J1325j47164k47836k25008j73032j68979
$$ 971554637 971497953 971379817 971195936 971149862 971161187 971014023 970766187 970541179 970368147 970199168
1631.5I70199168m07398o70731k94268m6611k83003n23448o55532l75211L3796m02451
$$ 970199168 969791770 969121039 968826771 968780160 968497157 967973709 967318177 966942966 966976762 966574311
1651.9I66574311q96513j13428k6166n32806q45731p99119p91788j016021j138687
$$ 966574311 965677798 965564370 965538204 965005398 964159667 963360548 962568760 961552739 960414052
1670.3I60414052q63791q48054j047969j120150j109839j071095j137018j154840j316667
$$ 960414052 959550261 958702207 957654238 956534088 955424249 954353154 953216136 952061296 950744629
1688.6I50744629j545787j702189k324641k918720k831102k965510k430975k144396
$$ 950744629 949198842 947496653 945172012 942253292 939422190 936456680 934025705 931881309
1704.9I31881309k027154j256347o01232J78695J586020M043817N451560M511654M123688
$$ 931881309 929854155 928597808 927996576 928175271 929761291 933805108 939256668 943768322 947892010
1723.3I47892010M264355M045188L834665L710389M502595N101204L819406L248751
$$ 947892010 952156365 956201553 960036218 963746607 968249202 973350406 977169812 980418563
1739.6I80418563K959132K236843J603842Q57055L83437M83334L78191j11222l34501
$$ 980418563 983377695 985614538 987218380 988075435 988458872 988942206 989320397 989209175 988874674
1758I88874674l20375l60012k62082m05550n14865l24368l20852l08275j55866j61291
$$ 988874674 988554299 988194287 987932205 987526655 987011790 986687422 986366570 986058295 985902429 985741138
1778.4I85741138k19404k19405j67549l8743j55508m56035m00782o2644n2989k89202
$$ 985741138 985521734 985302329 985134780 985096037 984940529 984484494 984083712 984021068 983968079 983678877
1798.7I83678877l39031m9949R9063k1219j49846k17915r9539n424n3227o2585r2745
$$ 983678877 983339846 983289897 983388960 983367741 983217895 982999980 982900441 982895017 982841790 982779205 982686460
1821.2I82686460k18213k33054q9109p0810N0247J71661k4259j12236N8115j1206k64525
$$ 982686460 982468247 982235193 982146084 982075274 982125521 982297182 982272923 982160687 982218802 982207596 981943071
1843.6I81943071j54495J50501K11954P6235j9312p4267j43767p4625j430j48058l72470
$$ 981943071 981788576 981939077 982151031 982227266 982207954 982133687 981989920 981915295 981913865 981765807 981393337
1866I81393337l71694l3439J76371L2782j08063o0856K9683j6570j25349j98066k52545
$$ 981393337 981021643 980988204 981164575 981197357 981089294 981028438 981058121 981041551 980916202 980718136 980465591
1888.5I80465591j18494M9472L397n3704k1696j3768p8738j31428j51396r1553P9096
$$ 980465591 980347097 980396569 980399966 980346262 980324566 980310798 980232060 980100632 979949236 979857683 979936779
1910.9I79936779J08540q0288k27570j53006q1896o7592N7519J26242J03712M0591
$$ 979936779 980045319 979965031 979737461 979584455 979502559 979434967 979492486 979618728 979722440 979763031
1931.3I79763031n3585q7082j26541k37405j99139R1195J79529p331l4690L1292l516
$$ 979763031 979709446 979622364 979495823 979258418 979059279 979150474 979330003 979322672 979287982 979319274 979315758
1953.7I79315758j5915K0743M7862L4750Q225L3856P0035P7486M3035l0935m2260L4750
$$ 979315758 979299843 979320586 979368448 979403198 979411423 979445279 979515314 979592800 979635835 979604900 979562640 979597390
1978.2I79597390P2777K2352p5698j81377j95861j32322k0325R1612N2333j2875o616
$$ 979597390 979670167 979692519 979616821 979435444 979239583 979107261 979086936 979178548 979230881 979218006 979211390
2000.6I79211390k8193p2777p2062l2008l2365p7009j30475p1943Q7559Q8930l7968
$$ 979211390 979183197 979110420 979038358 979006350 978973985 978896976 978766501 978694558 978782117 978871047 978833079
2023.1I78833079o8366J2457N9903R656n6565q0168q2016n3287M9293J12415L1352
$$ 978833079 978764713 978777170 978837073 978846729 978790164 978709996 978627980 978574693 978623986 978736401 978767753
2045.5I78767753l2485J1027M9949J5735m0769l2783j371o8426j81317j07467Q3088
$$ 978767753 978735268 978746295 978796244 978811979 978771210 978738427 978737056 978668630 978487313 978379846 978462934
2067.9I78462934J13965O914o3658k3723K8849O378k5869P034M5895j4722j14501j45077
$$ 978462934 978576899 978583813 978520155 978496432 978525281 978531659 978505790 978512824 978558719 978543997 978429496 978284419
2092.4I78284419j07766l8504O0677J31727O4611l7968k4080j2041k6226J3769J8895
$$ 978284419 978176653 978138149 978198826 978330553 978395164 978357196 978333116 978321075 978294849 978308618 978327513
2114.9I78327513k0325l0697j5497K086j0371q1062j03236j4066K8014J0907J1325
$$ 978327513 978307188 978276491 978260994 978263080 978252709 978171647 978068411 978054345 978082359 978093266 978104591
2137.3I78104591m0173q1539j7166O0319K6465o0856m1128K7478N5432M3035j7583
$$ 978104591 978064418 977982879 977965713 978026032 978052497 977991641 977950513 977977991 978033423 978076458 978058875
2159.7I78058875m8936l8028J431P4327N8830o259j1444k7120N901N4181L755j1802
$$ 978058875 978009939 977971911 977973342 978047669 978106499 978100240 978088796 978061676 978067577 978121758 978125513 978113711
2184.2I78113711J9431L3915O5982L7253o2048q3506j4186M6372N4837j5617p1943
$$ 978113711 978133142 978167057 978233039 978270292 978208244 978124738 978110552 978156924 978211761 978196144 978124201
2206.6I78124201J6332R0539J0014m0710l3915m0770J2815O7413L4869m9889q0884
$$ 978124201 978140533 978231072 978241086 978200376 978166461 978125691 978138506 978205919 978240788 978190899 978110015
2229.1I78110015n8293m8995n2869p4506m0650J1503k3365m2021j8776j8656O0o616
$$ 978110015 978051722 978002727 977949858 977875352 977834702 977846205 977822840 977780819 977762043 977743387 977743447 977736831
2253.5I77736831j06395j13964M4227J00851P153o4969l2008Q2135O7234p8320j41144
$$ 977736831 977630436 977516472 977560699 977661550 977668703 977603734 977571726 977653861 977721095 977642775 977501631
2276I77501631r5487K5869J17003O7473k38J9967L3379m709n7340q7499n6148k8729
$$ 977501631 977406144 977432013 977549016 977616489 977616251 977636218 977669597 977664888 977607548 977520049 977463901 977435172
2300.4I77435172n8294n4359L7193R1553Q3089R8228P8380M0710R3460J85788J24693
$$ 977435172 977376878 977322519 977359712 977451265 977534354 977632582 977710962 977751672 977845132 978030920 978155613
2322.9I78155613p8678q2433K46524M46737K85924J62065J67966J76906K4557l29852
$$ 978155613 978076935 977994502 978241026 978687763 978973687 979135752 979303718 979480624 979505181 979175329
2343.3I79175329n69939l76225P2479L74019L53277K08438K44796K13325j78278m40776
$$ 979175329 978605390 978229165 978301644 978675663 979028940 979237378 979482174 979695499 979517221 979076445
2363.6I79076445k29001r6977k63095m34279m90427l93093j73390n3525o6876J0431
$$ 979076445 978847444 978750467 978487372 978053093 977562666 977169573 976996183 976942658 976875782 976886213
2384I76886213J71244K19703J01626l8028o3479q464K6405L7312K7121m1008m4108
$$ 976886213 977057457 977277160 977378786 977340758 977277279 977268815 977295220 977332532 977359653 977318645 977274537
2406.5I77274537L0875O1155M7981M7148P7486N3644l3677o3777l2305l517M5717L9875
$$ 977274537 977305412 977366567 977414548 977461696 977539182 977592826 977559149 977495372 977463067 977459550 977505267 977545142
2430.9I77545142n1379r7930k0743P7427N8293K5093m410p2122o9737J0073Q4102M6313
$$ 977545142 977493763 977395833 977375090 977452517 977510810 977535903 977531493 977459371 977389634 977399707 977483809 977530122
2455.4I77530122m4227M232R6083O0916m8816j16706n365J05798j132q0109m2855n9724
$$ 977530122 977485895 977490127 977586210 977647126 977598310 977481604 977476239 977582037 977580905 977500796 977457941 977398217
2479.9I77398217r3460r7037p2956L8326Q6069m530k4855R596k9564l8445j490m3809
$$ 977398217 977304757 977207720 977134764 977173090 977259159 977254629 977229774 977239370 977209806 977171361 977169871 977126062
2504.4I77126062q5712l5345P1466J14560M7803k5869q1062p1227L9875J03831J6928
$$ 977126062 977040350 977005005 977076471 977191031 977238834 977212965 977131903 977060676 977100551 977204382 977221310
2526.8I77221310p4208l3259M0948K0504n602L6060M5717M4286L0756l5047n2452k6226
$$ 977221310 977147102 977113843 977154791 977175295 977169693 977205753 977251470 977295756 977326512 977291465 977239013 977212787
2551.3I77212787n3406m4465J08063J68443K4140l9518J3470J252l1471K622K6465
$$ 977212787 977159381 977114916 977222979 977391422 977415562 977376044 977389514 977390766 977359295 977361917 977388382
2573.7I77388382o914J013P8142O3419m9293TL6717N3942J0490l3438k9087k9624r6142
$$ 977388382 977381468 977382481 977460623 977524042 977474749 977425456 977462173 977516115 977526605 977493167 977464080 977434456 977338314
2600.2I77338314j16467m8817J3531P7307Q3566r835m8995n2810j06513o8963O0141
$$ 977338314 977221847 977173030 977186561 977263868 977347434 977337599 977288604 977235794 977129281 977060318 977120459
2622.6I77120459P7546n365l7014k4200J5676N3168j4365r2626n7637J2338R5427J55389
$$ 977120459 977198005 977192640 977155626 977131426 977147102 977200270 977185905 977093279 977035642 977047980 977143407 977298796
2647.1I77298796Q6367j2517q5234j67430j27554J7584J11222O4731k6823N961Q6606
$$ 977298796 977385163 977372646 977287412 977119982 976992428 977010012 977121234 977185965 977159142 977165103 977251709
2669.5I77251709O6578m2737n7280R299q941J9371J23322R5368q2433j85013n7042
$$ 977251709 977318287 977275550 977218270 977227569 977218628 977237999 977361321 977456689 977374256 977189243 977132201
2692I77132201P3254M2975K9326M7505Q404l0279J5020J19746J14500n2571j89245
$$ 977132201 977205455 977248430 977277756 977325261 977333665 977303386 977318406 977438152 977552652 977500081 977310836
2714.4I77310836q2016P9155J8359k7776j1921r3758r4652j4246N8174P6115j8120
$$ 977310836 977228820 977307975 977326334 977298558 977286637 977192879 977098227 977083981 977142155 977218270 977200150
2736.8I77200150o9320l8922q523r775m9234j2099Q0883K0623o5326K3365L0219j10984
$$ 977200150 977130830 977091908 977083385 977073610 977024376 977012277 977093160 977113783 977048457 977071822 977102041 976991057
2761.3I76991057r3698M4346O9737K4617j3471o2227r7334m2320R1672R3699p7546
$$ 976991057 976897359 976941705 977011442 977036059 977022588 976960361 976863027 976820707 976912379 977006078 976928532
2783.7I76928532j37567l8982q225k3485K9862M3214j8835l875L7134N067m054m0054
$$ 976928532 976790965 976751983 976743758 976720273 976750135 976793349 976774514 976770639 976807773 976812840 976808786 976768732
2808.2I76768732m1366P4208O3837j3590L5524K6286m5717o2704r3818m2915N6207
$$ 976768732 976727366 976801574 976865411 976851821 976887345 976913631 976867914 976805210 976711392 976668477 976724684
2830.7I76724684M2618q166m2081n0187l6657p3433j93358k74658j64747L8743J46806
$$ 976724684 976767302 976759136 976717055 976666868 976630211 976556778 976363420 976088762 975924015 975962758 976109564
2853.1I76109564J25587P9990O7353M4763K98o5505j01865o0498L933M0412J9372j9133
$$ 976109564 976235151 976315141 976382494 976427257 976427555 976362050 976260185 976199687 976203620 976244032 976263404 976244271
2877.6I76244271N364M8876L7909j4306p4386o3658n424m1008j26421j46807j34527
$$ 976244271 976249635 976298511 976336420 976322114 976247728 976184070 976178646 976137638 976011217 975864410 975729883
2900I75729883j62363j49370k7597O5387R5427Q6307L7790J9490o318K2352J86265
$$ 975729883 975567520 975418150 975390553 975455940 975551367 975637674 975675464 975694954 975688636 975710988 975897253
2922.4I75897253K44081P3015o3181l338J10507J27614p15j42575j03116j3709k9266
$$ 975897253 976141334 976214349 976151168 976147830 976258337 976385951 976385236 976242661 976139545 976125836 976096570
2944.9I76096570o8545r2327p0930k801J5080o8188j43111j16169m3691K1756O1035
$$ 976096570 976028025 975935698 975864768 975861967 975877047 975808859 975665748 975549579 975505888 975527644 975588679
2967.3I75588679J46628K93910L70384L53872L25918K96474K15113J03533J8001l7134
$$ 975588679 975735307 976029217 976399601 976753473 977079391 977375865 977590978 977694511 977712512 977675378
2987.7I77675378k8968O795k801j9193p6830q0228L6180L0458k9027j5974n365R596
$$ 977675378 977646410 977653205 977650404 977631211 977554381 977474153 977510333 977540791 977511764 977495790 977490425 977500021
3012.1I77500021k5093j0431J12355J15037M113k8968M0710J15633R3162M6253K801
$$ 977500021 977474928 977464497 977576852 977691889 977696002 977667034 977707744 977823377 977916539 977962792 977965593
3034.6I77965593j27077k14755j36555K1577R4116j6808j16647r3400l100J26899J05321
$$ 977965593 977838516 977623761 977487206 977508783 977602899 977586091 977469444 977376044 977372944 977499843 977605164
3057I77605164R656M232l1233q523J47462J65760m1723j32382J3053J54496J18136
$$ 977605164 977614820 977619052 977587819 977579296 977726758 977892518 977850795 977718413 977731466 977885962 978004098
3079.4I78004098L159L338L0160k3246o4790j4484K0623r119K0444j5438j37686o7354
$$ 978004098 978007257 978010595 978040755 978017509 977952719 977938235 977958858 977949739 977970183 977954745 977817059 977749705
3103.9I77749705R6262N2869n6088L338R4891Q1062M2260l7313j30176l0280P0572
$$ 977749705 977845967 977898836 977842748 977846086 977940977 978022039 978064299 978026986 977896810 977866530 977937102
3126.3I77937102k4974m4942K6286J31786K32398N7519j81675r4951M2201k0862l6657
$$ 977937102 977912128 977867186 977893472 978025258 978257656 978315175 978133500 978038549 978080750 978059888 978023231
3148.8I78023231K3663o974j7941P689j24216k43485q1062J60813J47581k7537q4996
$$ 978023231 978046894 978039920 978021979 978029668 977905452 977661967 977580905 977741718 977889299 977861762 977776766
3171.2I77776766p1407p5638j6987J12772J45972N5015Q583n663m9472n2750l934L1472
$$ 977776766 977705359 977629721 977612734 977725506 977871478 977926493 977935076 977929413 977879941 977827191 977823257 977854729
3195.7I77854729O4730J1862j01626o1751Q6129J92225J42455o9857j90019j31190
$$ 977854729 977919459 977931321 977829695 977767944 977854073 978046298 978188753 978118896 977928877 977797687
3216.1I77797687j13785l7253J56462K32816K13146J03176k3246J4722K8014j16765
$$ 977797687 977683902 977646649 977803111 978035927 978249073 978352249 978329003 978343725 978371739 978254974
3236.5I78254974j38164n9306j02043p570K07007J12652j43826j62541K1815J46925
$$ 978254974 978116810 978057504 977955461 977947891 978154898 978267550 978123724 977961183 977982998 978129923
3256.9I78129923R4653J609o1631o6579M0353J28328J54496L2007k55704l49283j99616
$$ 978129923 978224576 978226185 978164554 978097975 978138328 978266656 978421152 978453159 978197455 977848172 977648556
3279.3I77648556j06156j01208J0729K34305K97428K17497J44720l1829j40548m6909
$$ 977648556 977542400 977441192 977451921 977686226 977983654 978201151 978345871 978314042 978173494 978126585
3299.7I78126585J5259Q345q2195j99139r2149J2994o5088j3292J50382J26720o9022
$$ 978126585 978141844 978150189 978067994 977868855 977776706 977789700 977724612 977711320 977861702 977988422 977919400
3322.1I77919400j30713M8518J73271Q2254N2691R5009k9087q4281J9193K1935J728
$$ 977919400 977788687 977837205 978010476 978092730 978145421 978240430 978211343 978127062 978146255 978168190 978169918
3344.6I78169918n066q1599j5497J09434Q1241J18136Q7500j65880j67370O7234L4035
$$ 978169918 978164852 978083253 978067756 978177190 978258431 978376567 978464067 978298187 978130817 978198051 978232086
3367I78232086j39773j69993o4492J04487J10686Q762m5240n8293K2411O4075M5895
$$ 978232086 978092313 977922320 977857828 977962315 978073001 978081763 978036523 977978230 978000641 978064716 978110611
3389.4I78110611j847p0215q4936q6546k6405O0797J79052K12193L9816l2008j3411
$$ 978110611 978108764 978038549 977953613 977867067 977840662 977901459 978080511 978292704 978332520 978300512 978287101
3411.9I78287101j3054q344j05977j20223m7266k8491L6716K682j36077p5281J35064
$$ 978287101 978274047 978265703 978159726 978039503 977992237 977963746 978000462 978003144 977867067 977791786 977926850
3434.3I77926850J78993K5988j8776J37270J62124n543q2195l397J46925J69218L7670
$$ 977926850 978105843 978131831 978113055 978250325 978412449 978406906 978324711 978321314 978468239 978637457 978675127
3456.7I78675127k6047j09136j71721j9014J02103R9599R6261M3750P8202Q3684j35839
$$ 978675127 978649080 978539944 978368223 978349209 978451312 978550911 978647172 978690922 978769124 978852808 978716969
3479.1I78716969k42948j78576p6472J76847L26812R9063j86086j67906M1246n483
$$ 978716969 978474021 978295445 978218973 978395820 978722632 978821695 978635609 978467703 978508949 978503466
3499.5I78503466k83361j36554K67982J41442j68860n3107J90019J94073K4497j47044
$$ 978503466 978220105 978083551 978351533 978492975 978324115 978271008 978461027 978655100 978679597 978532553
3519.9I78532553j74880j06812r2923q6546l159J24037J03652n7459R120Q8751j79589
$$ 978532553 978357673 978250861 978157938 978071392 978068233 978192270 978295922 978238463 978247583 978336334 978156745
3542.4I78156745l93390j32919K98143L65317J96337J28568J1086j69933j05381j20878
$$ 978156745 977763355 977630436 977928579 978293896 978490233 978618801 978629887 978459954 978354573 978233695
3562.8I78233695n01573l98994M14610N66900J47879O5506J83522k5689k39194r2148
$$ 978233695 977732122 977333128 977747738 978314638 978462517 978528023 978711545 978685856 978446662 978354514
3583.2I78354514k8968n3227J67429J06037j63615j15335O0618j4186o1095P3314N37
$$ 978354514 978325546 978272319 978439748 978545785 978382170 978266835 978327453 978313267 978252172 978325486 978326023
3605.6I78326023j81497r3281N6148J28567L2783k92123q0585M90427M03166p4864
$$ 978326023 978144526 978051245 978107393 978235960 978268743 977976620 977896035 978386462 978789628 978714764
3626I78714764n37395l73662K11537M31299M41730K61963k3485j82032l04997n50568
$$ 978714764 978177369 977803707 978015244 978446543 978888273 979150236 979126751 978944719 978639722 978089154
3646.4I78089154n09382K30968O28651K17616j62661J00076L07978J46865Q8752N5313
$$ 978089154 977579772 977810740 978439391 978657007 978494346 978594422 978902400 979049265 979138017 979193330
3666.8I79193330j39833n1200Q3446l24249l81589J83046M32491L93927K13922j50323
$$ 979193330 979053497 979002297 979085743 978761494 978379905 978562951 978995442 979389369 979603291 979452968
3687.2I79452968m65095k19942O7950Q6128J27733O9618J6571J86860J09613k16961
$$ 979452968 978987873 978767931 978835881 978922009 979049742 979119360 979135931 979322791 979432404 979215443
3707.6I79215443l35812k26140k1875K03192K92122M8936l01481k11775J25945L05891
$$ 979215443 978879631 978653491 978631616 978834808 979126930 979175866 978874385 978662610 978788555 979094446
3727.9I79094446J43230l96431p60853l50654K42710M14967K84315N006P6354J59085
$$ 979094446 979237676 978841245 978080392 977729738 977972448 978387415 978671730 978676736 978753090 978912175
3748.3I78912175j17839m9650J37865j5914p4625K12669L10779j1564k77996j63197
$$ 978912175 978794336 978744686 978882551 978866637 978792012 979004681 979315460 979303896 979025900 978862703
3768.7I78862703K48134M57644J91987j55687k20359J8657J49667N4836O5148P0393
$$ 978862703 979110837 979568481 979760468 979604781 979384422 979403079 979552746 979607582 979672730 979743123
3789.1I79743123r6619j79946j60575j83642k31684j15394K77638L16203J6510N424
$$ 979743123 979646504 979466558 979305983 979122341 978890657 978775263 979052901 979369104 979385614 979391038
3809.5I79391038J68205N3882l37600m10259k69830q4997K83242K81930J75535J41740
$$ 979391038 979559243 979613125 979275525 978865266 978595436 978510439 978793681 979075611 979251146 979392886
3829.9I79392886J05441Q0764k14815n26846k97367l7074R9540L15249K29537k51532
$$ 979392886 979498327 979579091 979364276 978837430 978540063 978502989 978602529 978917778 979147315 978895783
3850.3I78895783q17239l22878O85930N22375P451j44601Q3506J19448q9467j02878
$$ 978895783 978078544 977755666 978441596 978963971 978971422 978826821 978910327 979029775 978940308 978837430
3870.7I78837430K8432K01404K80142l5465k95103j67846J2636K40445R2983k51293
$$ 978837430 978865862 979067266 979347408 979311943 979016840 978848994 978861630 979102075 979195058 978943765
3891.1I78943765n8830J57833n3346l37183m24802l5286N50687N26786J59085q524
$$ 978943765 978884935 979042768 978989422 978652239 978227437 978192151 978742838 979269624 979428709 979420185
3911.5I79420185r1851j06334L9339M4763p5996o1095R4295J54495n9307k16543R775
$$ 979420185 979328334 979222000 979261339 979306102 979230106 979169011 979263306 979417801 979358494 979141951 979151726
3933.9I79151726J46627n3823j18494M4346J18017P7486m1902j58310O2526L49640
$$ 979151726 979298353 979244530 979126036 979170382 979288399 979365885 979323983 979165673 979228199 979577839
3954.3I79577839J72794j14679j15633l7968k5153j3352J6868P034k3902J9848J17600
$$ 979577839 979750633 979635954 979520321 979482353 979457200 979443848 979460716 979467750 979443848 979463696 979581296
3976.7I79581296J93596J17720j31131j69873L6180P2241j9133k39J6749L6717
$$ 979581296 979774892 979892612 979761481 979591608 979627788 979700029 979680896 979680657 979697406 979734123
3997.1I79734123
$$ 979734123
##END=$$ End of the data block
