##TITLE=Sombrinha 2 $$ Begin of the data block
##JCAMP-DX=5.00 $$ ACD/SpecManager v 10.08
##SPECTROMETER/DATA SYSTEM=Alpha
##DATE=06 Mar 2015 12:54:54
##DATA TYPE=INFRARED SPECTRUM
##DATA CLASS=XYDATA
##ORIGIN=
##OWNER=
##NPOINTS=1667
##FIRSTX=599.57470703
##LASTX=3997.16503906
##MAXX=3997.16503906
##MINX=599.57470703
##MAXY=0.98598391
##MINY=0.83816856
##XFACTOR=1.0000000000
##YFACTOR=1.000000000000000e-9
##FIRSTY=0.92441905
##DELTAX=2.03937006
##XUNITS=1/CM
##YUNITS=ARBITRARY UNITS
##XYDATA=(X++(Y..Y))
599.6I24419045N4658K69532Q7679k42770k32756M112N90980Q14617J36078j50741
$$ 924419045 924473703 924743235 924830914 924588144 924355388 924359500 924950480 925765097 925901175 925750434
620I25750434K78175Q0169o45757j287222j161873J88767R56119L14176k87533l74854
$$ 925750434 926028609 926108778 925463021 924175799 923013926 923202693 924158812 924472988 924185455 923810601
640.4I23810601m23252n61297o82891n86092k48969l42786q16226p26998l51965l43562
$$ 923810601 923387349 922826052 922143161 921557069 921308100 920965314 920149088 919422090 919070125 918726563
660.8I18726563o80327j031637j149774j006901o82116o19232q07584j079618j113236
$$ 918726563 918046236 917014599 915864825 914857924 914175808 913556576 912748992 911669374 910556138
679.1I10556138r25184q74996j113534j661003k144098k459645k975762l615618m004061
$$ 910556138 909630954 908755958 907642424 905981421 903837323 901377678 898401916 894786298 890782237
697.5H90782237l721476l053307k923012l343165l799617m628778n899667o582022
$$ 890782237 887060761 884007454 881084442 877741277 873941660 869312882 863413215 856831193
713.8H56831193o253183n627215m714012k068222L457845J0469198J5806913J8119335
$$ 856831193 850578010 844950795 840236783 838168561 841626406 852095604 867902517 886021852
730.1H86021852J8507422J7431199J4638424J0523736O086469K456427K33948q21471
$$ 886021852 904529274 921960473 936598897 947122633 953209102 955665529 955899477 955078006
746.4I55078006j283825j445710j239717q08776p03454j073062j352370j288772j198828
$$ 955078006 953794181 952348471 951108754 950299978 949596524 948523462 947171092 945882320 944683492
764.8I44683492j244664j215816r69529r30249j133323j147866j096368j237273j440764
$$ 944683492 943438828 942223012 941253483 940323234 939189911 938042045 936945677 935708404 934267640
783.1I34267640j421332j290083j039326l28362O26742J106084P16686L4392k96712
$$ 934267640 932846308 931556225 930516899 930188537 930815279 931921363 932638049 932672441 932375729
801.5I32375729j83105J93655L68893K27392J48416L14891L54826J3054l75867m02391
$$ 932375729 932192624 932386279 932755172 932982564 933130980 933445871 933800697 933813751 933437884 933035493
821.9I33035493k25782k45750m19796o35445q65281r96649j028717j129508j406967
$$ 933035493 932809711 932563961 932144165 931508720 930643439 929646790 928618073 927488565 926081598
840.2I26081598j657725j349091k38955J287281K425313K362311J590729J097381O11186
$$ 926081598 924423873 923074782 922835827 924123108 926548421 928910732 930501461 931598842 932210028
858.6I32210028l13043j393140k606511m456878o133377l968001L007710Q093000O964326
$$ 932210028 931896985 930503845 927897334 923440456 917307079 913339078 916346788 924439788 931404114
876.9I31404114L649115J692713P45475P7426k88248m41670o05285o13809m00722k73645
$$ 931404114 935053229 936745942 937491417 937568843 937280595 936838925 936233640 935619831 935219109 934945464
897.3I34945464k16067M0412K64704J86682n901m7385N424q5354l18647l75628j73926
$$ 934945464 934729397 934769809 935034513 935221195 935215294 935167909 935173333 935087979 934769332 934393704 934219778
919.8I34219778o6162j28030j73152j91629k15292j48415j371P1525M0532j22071m38154
$$ 934219778 934153616 934025586 933852434 933660805 933445513 933297098 933295727 933367252 933407784 933285713 932847559
942.2I32847559p70628j044571j318574j615823j849651j841187j593948j325786j147628
$$ 932847559 932076931 931032360 929713786 928097963 926248312 924407125 922813177 921487391 920339763
960.5I20339763q14497k50995K66313R80258J975119K541423K227783J288712J35601
$$ 920339763 919525266 919274271 919540584 920520842 922495961 925037384 927265167 928553879 928689480
978.9I28689480q86262j428544j531601j368582j002968p35104p15852p63535p47025
$$ 928689480 927803218 926374674 924843073 923474491 922471523 921736419 921020567 920257032 919510007
997.3I19510007o41108o50286j291037k866924m722833n528629m813075k959848J54257
$$ 919510007 918868899 918218613 916927576 914060652 909337819 903809190 898996115 896036267 896190524
1015.6H96190524M142344P109761Q527160R330273P947027L173173j733065l816664
$$ 896190524 900332868 907442629 915969789 925300062 933247089 936420262 934687197 930870533
1031.9I30870533l616333k583027j653254j149476q93890p30574p61509j001180j320839
$$ 930870533 927254200 924671173 923017919 921868443 920974553 920243979 919482470 918481290 917160451
1050.3I17160451j817464k413333k639711k256572j593590j186728j184702j555443
$$ 917160451 915342987 912929654 910289943 908033371 906439781 905253053 904068351 902512908
1066.6I02512908k396643l387511l899097l640831k877235k194524j691401j059115
$$ 902512908 900116265 896728754 892829657 889188826 886311591 884117067 882425666 881366551
1082.9H81366551l44694Q4818K69055O02901J097858J705229K488554L214776L674150
$$ 881366551 881021857 881106675 881375730 881978631 883076489 884781718 887270272 890485048 894159198
1101.3H94159198L972709L967464L379166K613247K134740J527488O70076N03242J358628
$$ 894159198 898131907 902099371 905478537 908091784 910226524 911754012 912424088 912927330 914285958
1119.6I14285958K558112L541052M227281M842639N326331N454123N279541M874169
$$ 914285958 916844070 920385122 924612403 929455042 934781373 940235496 945515037 950389206
1135.9I50389206M249037L447890K589643J761854R26852K26080j13845k48312m43757
$$ 950389206 954638243 958086133 960675776 962437630 963364482 963590562 963476717 963228405 962784648
1154.3I62784648p35402j025438j158119j202285j382113j646995j821935j802922
$$ 962784648 962049246 961023808 959865689 958663404 957281291 955634296 953812361 952009439
1170.6I52009439j554310j227796j006007j040101j415551j805007j848162j720070
$$ 952009439 950455129 949227333 948221326 947181225 945765674 943960667 942112505 940392435
1186.9I40392435j620055j549720j774073k493560l281713l522277l085911k359867
$$ 940392435 938772380 937222660 935448587 932955027 929673314 926151037 923065126 920705259
1203.2I20705259j834452j691103j892507k416611l044963l280818k929390k393246
$$ 920705259 918870807 917179704 915287197 912870586 909825623 906544805 903615415 901222169
1219.5I01222169k113700k137601k315283k633810k929270k802193k056897r06229
$$ 901222169 899108469 896970868 894655585 892021775 889092505 886290312 884233415 883327186
1235.9H83327186K50220J332045K454698L380478L768026L704131L529131L304720
$$ 883327186 883577406 884909451 887364149 890744627 894512653 898216784 901745915 905050635
1252.2I05050635K811790K211749J901806K124190K855480L570676L924012M018783
$$ 905050635 907862425 910074174 911975980 914100170 916955650 920526326 924450338 928469121
1268.5I28469121L925860L588677L151059K888858K770663K644062K550959K539039
$$ 928469121 932394981 935983658 939134717 942023575 944794238 947438300 949989259 952528298
1284.8I52528298K524972K492308K489210K533316K543807K453029K280057J953840
$$ 952528298 955053270 957545578 960034788 962568104 965111911 967564940 969844997 971798837
1301.1I71798837J481831J049042Q18193P09653N10752K43247K8729j18554k24292
$$ 971798837 973280668 974329710 975147903 975857556 976368308 976611555 976640284 976521730 976297438
1319.5I76297438l68237o23107j118183k034545l292799m638851n617917n344331l091574
$$ 976297438 975929201 975306094 974187911 972153366 968860567 964221716 958603799 953259468 950167894
1337.8I50167894Q73208M498780O002426N736947M385233K701283J330256M63069O675
$$ 950167894 951041102 955539882 961542308 967279255 971664488 974365771 975696027 976159096 976165771
1356.2I76165771l87609q71777j168847j013756p24316n03301k79427k99096l15726
$$ 976165771 975778162 974906385 973737538 972723782 971999466 971496165 971216738 970917642 970601916
1374.5I70601916p2479m8041l39330n71012n63860l36766M3750K4080n42820j174867
$$ 970601916 970529437 970481396 970142066 969571054 969007194 968670428 968714178 968738258 968195438 967020571
1394.9I67020571j471996j722872k124906k711177k896070j372218J294672L901303
$$ 967020571 965548575 963825703 961700797 958989620 956093550 954721332 956016004 959917307
1411.3I59917307N254447M571855K999008J865745Q74281m5777m31716n37694p02619
$$ 959917307 965171754 969743609 972742617 974608362 975482643 975436866 975005150 974467456 973764837
1429.6I73764837p47204p36058p49528m80890k07842k33889l35812n08308n20111k24053
$$ 973764837 973017633 972281575 971532047 971051157 970843315 970609426 970273614 969765306 969245195 969021142
1450I69021142l5584j03772l28124q6605M34458K35081l71218q20637p83264m42923
$$ 969021142 968985558 968881786 968553662 968467057 968901515 969136596 968765378 967944741 967161477 966718554
1470.4I66718554M85778J458884J381576R37879N96881L79145J19150l27409n96463
$$ 966718554 967204332 968663216 970044792 970982671 971579552 971958697 972077847 971750438 971153975
1488.8I71153975k40207m0829n33939j252115j683354j789510j489043n28634J886368
$$ 971153975 970913768 970872939 970339000 969086885 967403531 965614021 964124978 963596344 965482712
1507.1I65482712K993881J613498M68612k33710n15163m18544k52902j28567j45674
$$ 965482712 968476593 970090091 970558703 970324993 969809830 969391286 969138384 969009817 968864143
1525.5I68864143m1485J33336n4360k33710o1094j06097m93407m65870j01387M9710
$$ 968864143 968822658 968955994 968901634 968667924 968606830 968500733 968007326 967541456 967440069 967489779
1545.9I67489779o6936k33412j47223r0182j51515m16756k69651K41697J34468r7812
$$ 967489779 967422843 967189431 967042208 966952026 966800511 966383755 966114104 966355801 966490269 966392457
1566.3I66392457l35156m91322l78966m15087m37140J69396O17504N39065K35319K3067
$$ 966392457 966057301 965565979 965187013 964771926 964334786 964504182 965121686 965660751 965896070 965919137
1586.6I65919137p5459j18435j38819k01583l07679l98278m32432m26591m27246m54187
$$ 965919137 965843678 965725243 965586424 965384841 965077162 964678884 964246452 963819861 963392615 962938428
1607I62938428l12865j24216n0485m4584j89782k20179j77920k72334l30865l13044
$$ 962938428 962625563 962501347 962450862 962406278 962216496 961996317 961818397 961546063 961215198 960902154
1627.4I60902154k99453k72453m40240o32823k92658j07229k83659m73797p00355n90920
$$ 960902154 960602701 960330248 959890008 959257185 958964527 958857298 958573639 958099842 957399487 956808567
1647.8I56808567j36673n03064j261234o60241m32014q73983j384079j509548j323163
$$ 956808567 956671894 956168830 954907596 954247355 953815341 952941358 951557279 950047731 948724568
1666.2I48724568j516879j817584j473784j486659j843155j835763j654446j525402
$$ 948724568 947207689 945390105 943916321 942429662 940586507 938750744 937096298 935570896
1682.5I35570896j802087k010584k249956k591908k543152l042221l787934l688991
$$ 935570896 933768809 931758225 929508269 926916361 924373209 921330988 917543054 913854063
1698.8I13854063l827274l057361k502084k351939j459301m42505R06825K911628N847156
$$ 913854063 910026789 906969428 904467344 902115405 900656104 900213599 901120424 904032052 909879208
1717.2I09879208P228851O013989N625487N771518N586802N533398N413472O343961
$$ 909879208 917108059 923122048 928747535 934519053 940105855 945639253 951052725 957396686
1733.5I57396686O823897M983485M323483M019797L069162K228796J334429P46668
$$ 957396686 964220583 969204068 973527551 977547348 980616510 982845306 984179735 984926403
1749.8I84926403O54280M03225j41382m13597l81410m26113l64364m68909n88835m53949
$$ 984926403 985580683 985983908 985842526 985428929 985047519 984621406 984257042 983788133 983199298 982745349
1770.2I82745349m15802l34143j76192k51352l60966l47674l00169j41263j57595m11510
$$ 982745349 982329547 981995404 981819212 981567860 981206894 980859220 980559051 980417788 980260193 979848683
1790.6I79848683m43876j19984L9518j13666k71321j58190j1027r298j18316k51352
$$ 979848683 979404807 979284823 979324341 979210675 978939354 978781164 978770137 978760839 978642523 978391171
1811I78391171j74881j12295j34825p7725j03891k40266j83165k027o9081l9638Q6606
$$ 978391171 978216290 978103995 977969170 977891445 977787554 977547288 977364123 977362096 977293015 977253377 977339983
1833.4I77339983m8697j18077J1265q9824k87115j18375R7215R5904k4557j73688k25544
$$ 977339983 977291286 977173209 977184474 977094650 976807535 976689160 976786375 976882279 976857722 976684034 976458490
1855.9I76458490j74403j00553o7592j04606k39194l52203j55390P1883m17n9366Q345
$$ 976458490 976284087 976183534 976115942 976011336 975772142 975419939 975264549 975336432 975336015 975276649 975284994
1878.3I75284994k444j10448j21772p4506j23322q8811K802P510k1696q2970n8949
$$ 975284994 975282550 975172102 975050330 974975824 974852502 974763691 974766493 974774003 974752307 974669337 974610388
1900.7I74610388O4194R5010q642o4075M589K8670o5386j26779n6029m2438o8784j550
$$ 974610388 974674582 974769592 974760950 974696875 974701464 974730134 974664748 974537969 974481940 974439502 974370718 974369168
1925.2I74369168J7643n066l3021q2851r6917j49548k96175l27349p8857O5744n9724
$$ 974369168 974386811 974381745 974348724 974265873 974168956 974019408 973723233 973395884 973317027 973382771 973323047
1947.6I73323047r5427p4208j05440o8248j609N0962M6551k8014m0352O0081J27852
$$ 973323047 973227620 973153412 973047972 972979724 972978115 973029077 973075628 973047614 973007262 973067343 973195195
1970.1I73195195O4314m1128p3492k7597o855k8848l7492q3148j18136q7679p629J11103
$$ 973195195 973259509 973218381 973144889 973117292 973110437 973081589 973044097 972960949 972842813 972755134 972747505 972858608
1994.5I72858608Q7142n2572o6638j1622k6882j0312P8023Q3029k1100j13130q6128
$$ 972858608 972945750 972893178 972826540 972814918 972788036 972777724 972855747 972938776 972917676 972804546 972718418
2017I72718418N3763J42455O6638o7592p1406o0O56M9412J04726L57m5895O4671Q8394
$$ 972718418 972772181 972914636 972981274 972913682 972842276 972842216 972842872 972892284 972997010 972997367 972951472 973016143 973104537
2043.5I73104537j6094j8835P9036O9439l0696q0824n1081n1260j32740k12371j68502
$$ 973104537 973088443 973069608 973148644 973218083 973187387 973106563 973055482 973004222 972871482 972659111 972490609
2065.9I72490609k8372K6107l9816r7692q3924r0599j12593j02401r9778k2888M7684
$$ 972490609 972462237 972488344 972448528 972350836 972266912 972176313 972063720 971961319 971861541 971838653 971886337
2088.3I71886337m8936j52886j25765j4365J00076J16348O140o2347l3378p2003o9797
$$ 971886337 971837401 971684515 971558750 971544385 971644461 971760809 971766949 971704602 971671224 971599221 971529424
2110.8I71529424L0697J9490n2333o914Q3030Q5592J6987o0439n2869N483J1325J1206
$$ 971529424 971560121 971579611 971527278 971520364 971603394 971688986 971705973 971645534 971592665 971598148 971609473 971620679
2135.2I71620679L9220Q8155J23918Q2254R299j5974r001M8995R6977N8949J1683j848
$$ 971620679 971659899 971748054 971871972 971954226 971963525 971947551 971938550 971987545 972084522 972143471 972155154 972153306
2159.7I72153306L9637O4492J788k0980L5941Q4698M7028n2869o1273j0670k4736m9471
$$ 972153306 972192943 972257435 972259223 972238243 972274184 972358882 972405910 972353041 972291768 972281098 972256362 972206891
2184.2I72206891l9280J967K7657k0266n8830q0585j18792j01507o5088l3498K1279
$$ 972206891 972167611 972169578 972197235 972176969 972118139 972037554 971918762 971817255 971752167 971718669 971739948
2206.6I71739948M9352K6703m7326j16110j02579q7738r9600m3451m709o9142j10387
$$ 971739948 971789300 971816003 971768677 971652567 971549988 971462250 971362650 971319199 971314490 971245348 971134961
2229.1I71134961m3214N6505P8857J6451k6464p332j9609q3447r0003j9133N2631Q2373
$$ 971134961 971091747 971148252 971227109 971243560 971217096 971209764 971190155 971106708 971016705 970997572 971050203 971132576
2253.5I71132576p15j33812n9247J55985J65045L0280L5107J14739Q7440j3292m8578
$$ 971132576 971131861 970998049 970938802 971094787 971259832 971290112 971325219 971439958 971527398 971514106 971465528
2276I71465528j79L7492Q4579J22845Q2016K7239j9550k7657k1398p4327o3181q34
$$ 971465528 971465349 971502841 971587420 971710265 971792281 971819520 971799970 971772313 971750915 971676588 971613407 971612573
2300.4I71612573k1935j06811j13964j5736J2994k4617N543M7744L218j4364N4240
$$ 971612573 971590638 971483827 971369863 971354127 971367121 971342504 971348047 971395791 971399009 971384645 971438885
2322.9I71438885O9380P2836J10507J24217J42157J62303J01388K5689j5139j84656
$$ 971438885 971508265 971581101 971691608 971815825 971957982 972120285 972221673 972247362 972232223 972047567
2343.3I72047567l74436l11613m0829L24964N04554L58820L21805J66416l15785n25832
$$ 972047567 971673131 971361518 971320689 971645653 972150207 972509027 972830832 972997248 972681463 972155631
2363.6I72155631l56794k80320l33250k16782m5896q2969k13504j80721k3723R9003
$$ 972155631 971798837 971518517 971185267 970968485 970922589 970839620 970626116 970445395 970421672 970520675
2384I70520675J67608J68205Q1956j6212m3154L4571J08182P9095J3054k6286M7684
$$ 970520675 970688283 970856488 970938444 970922232 970879078 970913649 971021831 971100926 971113980 971087694 971135378
2406.5I71135378J48713Q2553l6538j7106P2121J05679P8440q047q3863n1320J0133
$$ 971135378 971284091 971366644 971330106 971313000 971385121 971490800 971569240 971561193 971477330 971426010 971436143
2428.9I71436143k444o6995j34051r5904L2246O1810k8968j10984j20759j12235p9453
$$ 971436143 971433699 971366704 971232653 971136749 971168995 971230805 971201837 971090853 970970094 970857859 970778406
2451.3I70778406K6405P2717l8922j03473j0610L3319j1504n0544m6075o139j6391
$$ 970778406 970804811 970877528 970838606 970735133 970724523 970757842 970746338 970695794 970649719 970643580 970627189
2473.8I70627189k2710J2398m3869j07467m4882O139J6928L1888j4067j9014K4379
$$ 970627189 970604479 970616877 970573008 970465541 970420659 970426798 970443726 970475614 970461547 970442533 970466912
2496.2I70466912r775K3186P7605l0398p3672O4373J80424J47104O8247J8299m8280
$$ 970466912 970457137 970480323 970557928 970527530 970453858 970518231 970698655 970845759 970914006 970932305 970884025
2518.6I70884025l1948N1796N3704n305r119Q4758J23322K2113l1650M3631Q7261P272
$$ 970884025 970852077 970903873 970957577 970952272 970943153 971027911 971151233 971173346 971141696 971185327 971272588 971279860
2543.1I71279860r5547o8485L9517P7308J251q0227j1206N2035k5451m6850J0371j0430
$$ 971279860 971184313 971115828 971155345 971232653 971233904 971153677 971142471 971194506 971169055 971122205 971132576 971122146
2567.6I71122146p3910r6917j02937k7538R5666M2081j05203j09434n4300p8499p3731
$$ 971122146 971048236 970951319 970848382 970820844 970916510 970958591 970853388 970743954 970689654 970611155 970537424
2590I70537424K2471L0100k1398k2113r8705j56939r5666p748R6440Q9168m0173n0485
$$ 970537424 970559895 970589995 970568597 970546484 970447779 970290840 970195174 970187426 970283866 970373034 970332861 970282376
2614.5I70282376K7001J0967k325O5685O1094J8836Q4221J04844q463o3837J5974R5964
$$ 970282376 970309377 970320344 970318019 970383704 970444798 970463634 970547855 970652699 970644236 970580399 970596373 970692337
2639I70692337L7252o1869J3292J75297K10643J37627K4080o1333o0618J1504J10864
$$ 970692337 970729589 970667720 970681012 970856309 971066952 971204579 971228659 971167326 971106708 971118212 971229076
2661.4I71229076Q6427k8431l7492L4154N6743j1503r2745r1851q821P2419P0751k6464
$$ 971229076 971315503 971287072 971249580 971283734 971340477 971328974 971236229 971144378 971135557 971207976 971278727 971252263
2685.9I71252263j66953k30610j20819l0756q1718p1406j5200p152K3544P1227Q1897
$$ 971252263 971085310 970854700 970733881 970703125 970621407 970550001 970534801 970527649 970551193 970622420 970704317
2708.3I70704317J073j10567j59621j02639K682J19j2099K5510M292m0710p7963n9843
$$ 970704317 970705390 970594823 970435202 970332563 970335245 970335364 970323265 970348775 970353067 970312357 970234394 970174551
2732.8I70174551K6643M2379o1333q9288J6630O5565K9802N7340J12474M2081L3855
$$ 970174551 970201194 970243573 970182240 970092952 970109582 970175147 970204949 970262289 970374763 970416844 970450699
2755.2I70450699J10269L4869m9115k5332K444L9935J00911R4652J3769m1366j4066
$$ 970450699 970560968 970595837 970546722 970521390 970523834 970563769 970664680 970759332 970773101 970731735 970717669
2777.6I70717669N3584R4295P4982J0372k1458n6148j09017n5551L1829J7762J5557
$$ 970717669 970771253 970865548 970940530 970950902 970929444 970873296 970764279 970708728 970740557 970758319 970773876
2800.1I70773876L4153k8133p2539q7619r7871n7578n4717k4438O7651M113q6248r2327
$$ 970773876 970808029 970779896 970707357 970619738 970521867 970464289 970409572 970385134 970452785 970456898 970370650 970278323
2824.5I70278323j66655j58191o1273m6730k9922k7656j29581j67608q6725j40428
$$ 970278323 970111668 969953477 969892204 969845474 969815552 969787896 969658315 969490707 969403982 969263554
2844.9I69263554l05474k85387k2471K56061K86758J07706M291N9188R3877N7459J0073
$$ 969263554 968958080 968672693 968650222 968906283 969193041 969300747 969305038 969364226 969458103 969515562 969525635
2867.4I69525635o3061j19389p4029k0384m5717K6524J57773J48893O2585l0816n3823
$$ 969525635 969462574 969343185 969269156 969248772 969203055 969229579 969387352 969536245 969598830 969568014 969514191
2889.8I69514191n5075j69575j85311l993L3975j62781k52723j41025j7464O8545Q2493
$$ 969514191 969459116 969289541 969104230 969100237 969134212 968971431 968718708 968577683 968560219 968628764 968711257
2912.2I68711257O2585J29402J65224J38342J79887K26617K26974K00272J15514j5259
$$ 968711257 968773842 968903244 969068468 969206810 969386697 969613314 969840288 970040560 970156074 970140815
2932.6I70140815j35720j74463j08063l1412o2704j64926k29835j73629Q166Q6546
$$ 970140815 970005095 969830632 969722569 969691157 969628453 969463527 969233692 969060063 969068229 969154775
2953I69154775o6817k52247k39968o7651M0352J7941p272J46568L47078L39449L53217
$$ 969154775 969087958 968835711 968595743 968528092 968568444 968586385 968579113 968725681 969072759 969412208 969765425
2975.4I69765425M69506M01496K58506J63495J6511m5657J5199N1498N0724M4405l1411
$$ 969765425 970234931 970636427 970894933 971058428 971074939 971029282 971044481 971095979 971146703 971191108 971159697
2997.9I71159697j12236k0504O9261J7881O557N1140L2246k1278K2888J37686J63615
$$ 971159697 971047461 971026957 971096218 971114099 971120656 971171796 971204042 971182764 971205652 971343338 971506953
3020.3I71506953J13726J08421J14918L9279m7505m0412R716m7386j32322q5473o736
$$ 971506953 971620679 971729100 971844018 971883297 971835792 971795380 971805096 971757710 971625388 971539915 971533179
3042.7I71533179O199o8247r3162k2829L7849J32561J44005K5451q5890m8280J59263
$$ 971533179 971539378 971471131 971377969 971355140 971392989 971525550 971669555 971695006 971609116 971560836 971720099
3065.2I71720099K10762j847j78933j22250J7643P0811N0425J5319N9426O7651l3021
$$ 971720099 971930861 971929014 971750081 971627831 971645474 971716285 971766710 971782029 971841455 971909106 971876085
3087.6I71876085j07169j31548p9572R537L7610q046o9499n4241k6226k3603K5749
$$ 971876085 971768916 971637368 971557796 971567333 971604943 971596897 971527398 971473157 971446931 971423328 971449077
3110I71449077J252r7156k1755M0173m8220J1325J49131J53541o735j24335J78N9784
$$ 971449077 971450329 971353173 971331418 971371591 971323371 971334696 971483827 971637368 971630633 971506298 971506476 971566260
3134.5I71566260j0073O8307J29938P868q7798q0288k1159Q2791J10089L5584k4139
$$ 971566260 971556187 971624494 971754432 971762300 971674502 971594214 971573055 971655846 971765935 971801519 971777380
3156.9I71777380n0486q5592j00613M590J37985R0360q6426j21475n960P1049J09613
$$ 971777380 971726894 971641302 971540689 971545279 971683264 971773624 971687198 971565723 971559763 971630812 971740425
3179.4I71740425Q2492P0513O2167j788k1219m7147k0623J9788N3346N1618o6698p2300
$$ 971740425 971822917 971893430 971955597 971953809 971932590 971885443 971864820 971884608 971937954 971989572 971922874 971850574
3203.8I71850574K265o020K7776P0452k861m1067n8234r8586n8413M650O7591R3103
$$ 971850574 971852839 971846819 971874595 971945047 971942186 971901119 971842885 971744299 971685886 971690536 971758127 971851230
3228.3I71851230J847j25587j08301n9009l7134K6286m5061m2140J38044Q3983o9738
$$ 971851230 971853077 971727490 971619189 971560180 971523046 971549332 971504271 971462131 971600175 971684158 971614420
3250.7I71614420K0028J15990J3113o3181J5021P510j13785p9275R4712J65403P9751
$$ 971614420 971634448 971750438 971763551 971700370 971715391 971722901 971609116 971529841 971624553 971789956 971869707
3273.2I71869707m5299j24217p0154J1086l8206r3580j1742R6739J28150J46567R5368
$$ 971869707 971824408 971700191 971630037 971641123 971602917 971509337 971497595 971594334 971722484 971869051 971964419
3295.6I71964419n186n8055l4451M8041K9266n4181k0980j1027p4744m9770J8358Q9824
$$ 971964419 971959233 971901178 971866727 971914768 971944034 971889853 971868873 971857846 971783102 971733332 971751690 971841514
3320.1I71841514O7830l8743m0233n7161q6605Q6665K09629P4029j1861j1265n1856
$$ 971841514 971909344 971870601 971830368 971773207 971686602 971773267 971982896 972056925 972045064 972033799 971981943
3342.5I71981943k4915K1160K6404K6763J0371L3200O2168K7656J6987R895m4644n3644
$$ 971981943 971957028 971978188 972004592 972031355 972041726 972074926 972137094 972164750 972181737 972191632 972146988 972093344
3367I72093344K4736K6762j33395k19345p4983J50025J88708N9903k7299k9445m7564
$$ 972093344 972118080 972144842 972011447 971792102 971717119 971867144 972055852 972115755 972088456 972059011 972011447
3389.4I72011447j09732p0930J4246j1623m1962P2241K41816K66016Q1241j56343k47121
$$ 972011447 971901715 971830785 971845031 971833408 971791446 971863687 972105503 972371519 972452760 972296417 972049296
3411.9I72049296j41263J8656o080l0815R8348R5784M649o4611j53780j12176J39773
$$ 972049296 971908033 971926689 971920609 971889794 971988142 972083926 972088575 972023964 971870184 971758008 971897781
3434.3I71897781L30508J78635p8142j58906r5129Q2076J74284M9293m4525L5703J37985
$$ 971897781 972228289 972406924 972328782 972169876 972074747 972156823 972331107 972380400 972335875 972371578 972509563
3456.7I72509563R4652p3671j22190L9697J43886J35004L6836j49608j38581l6537
$$ 972509563 972604215 972530544 972408354 972448051 972591937 972726941 972763777 972614169 972475588 972439051
3477.1I72439051j21057j17004j610K0087J18911J45376p8738k36213j11818J23441
$$ 972439051 972317994 972200990 972199380 972219467 972338378 972483754 972405016 972168803 972056985 972180426
3497.5I72180426J20044j02341j00494J71602K07782N6028J2458k921n8055j45197
$$ 972180426 972300470 972198129 972097635 972269237 972477019 972533047 972545505 972542584 972484529 972339332
3517.9I72339332r2924O8844M1544o5386q822P4983N7042n2274j34825O616J15871
$$ 972339332 972246408 972315252 972356796 972291410 972282588 972357571 972414613 972362339 972227514 972234130 972350001
3540.3I72350001q8036k23160R3818L05951P3254l7968M1961l2186j52528p1705q344
$$ 972350001 972261965 972038805 972132623 972438574 972511828 972473860 972515821 972483635 972331107 972259402 972251058
3562.8I72251058k13325j81735L35157M48883J74045J11222R6023j18434j69694l100
$$ 972251058 972037733 971855998 972191155 972640038 972814083 972925305 973021328 972902894 972733200 972730100
3583.2I72730100p4506j81436J48773K71380J4961j59443j68860m6193J02818N1439
$$ 972730100 972655594 972474158 972622931 972894311 972909272 972749829 972580969 972534776 972637594 972689033
3603.5I72689033j16170j58012p3135K682Q6606R596j95205L7432L79205K08556j59859
$$ 972689033 972572863 972414851 972341716 972344398 972431004 972440600 972245395 972282827 972662032 972870588 972710729
3626I72710729m42684k20239K36630L44753K66016J31607K6524m8339k38478n08190
$$ 972710729 972268045 972047806 972284436 972629189 972895205 973026812 973053336 973004997 972766519 972258329
3646.4I72258329m17471K61724N97299K69353m9233O3836J93298J60515Q9646L993
$$ 972258329 971840858 972102582 972699881 972969234 972920001 972983837 973177135 973337650 973427296 973431289
3666.8I73431289k6524Q7261J27793k12193l99649o318K25961J68741R6679j21713
$$ 973431289 973404765 973492026 973619819 973407626 973007977 973001659 973227620 973396361 973493040 973371327
3687.2I73371327m23312l0160L80516J78814m9114l1054P4207J79053J49011r4473
$$ 973371327 972948015 972917855 973298371 973477185 973428071 973397017 973471224 973650277 973799288 973704815
3707.6I73704815k72930k01642l4511J03712J28030n841j30415p033J22428J08123
$$ 973704815 973431885 973230243 973195732 973299444 973427474 973421633 973291218 973284185 973406613 973514736
3727.9I73514736R238l69906p69854m59015K26915M33922K68817p16K1160J72198L3259
$$ 973514736 973523974 973154068 972384214 971925199 972152114 972586036 972854853 972854137 972875297 973047495 973080754
3750.4I73080754J4901Q3447q2493j11043J83701K54333j9789k27510k01166J24574
$$ 973080754 973095655 973179102 973096609 972985566 973169267 973423600 973403811 973176301 972975135 973099709
3770.8I73099709L92615K51711M4584L755O6579K5510r4115J2040J39475O8366k6405
$$ 973099709 973492324 973744035 973788619 973792374 973858953 973884463 973790348 973802388 973941863 974010229 973983824
3793.2I73983824j98483k53439r0540j33037l6299K49981K87533K25246J25468j62244
$$ 973983824 973785341 973531902 973441362 973308325 973272026 973522007 973809540 974034786 974160254 973998010
3813.6I73998010n27561m03642L636K28047L75032K13862l6717k3245k086j3531j03593
$$ 973998010 973470449 973066807 973070443 973298490 973673522 973887384 973850667 973827422 973825336 973811805 973708212
3836I73708212m30584l40223M8399J85311L12984K86341p7546n87285n55098J48833
$$ 973708212 973277628 972937405 972985804 973171115 973484099 973770440 973692894 973105609 972550511 972699344
3856.4I72699344L53754K06291O5267K3723r715j03772M1008K10702J02699J13547
$$ 972699344 973053098 973259389 973324656 973348379 973338664 973234892 973275900 973486602 973589301 973702848
3876.8I73702848K623k59579j84416N4419L34560J66297l68595k51293J56224Q1062
$$ 973702848 973705471 973445892 973261476 973315895 973650455 973816752 973448157 973196864 973353088 973434150
3897.2I73434150j59442l26872k39313L32058O47843L33964K861j68323k43902m8876
$$ 973434150 973274708 972947836 972708523 973040581 973688424 974022388 974025249 973856926 973613024 973564148
3917.6I73564148J30475L5047n9485P2002J82152m3333j16586J75654Q6189k58982
$$ 973564148 973694623 973729670 973670185 973742187 973924339 973881006 973764420 973940074 974026263 973767281
3938I73767281j96994N6088J33276J71006J24693J9252J05202J41442l6418j26958
$$ 973767281 973570287 973626375 973759651 973930657 974055350 974074602 974179804 974321246 974284828 974157870
3958.4I74157870r6917q8632j1147J35303K13206n663l16202j72138J03712J80184
$$ 974157870 974060953 973972321 973961174 974096477 974309683 974304020 973987818 973815680 973919392 974099576
3978.8I74099576J85371J5139j34468j05500j08957m2379J23322Q0168M411
$$ 974099576 974284947 974300086 974165618 974060118 973951161 973908782 974032104 974112272 974116683
3997.1I74116683
$$ 974116683
##END=$$ End of the data block
