##TITLE=Sombrinha 1 $$ Begin of the data block
##JCAMP-DX=5.00 $$ ACD/SpecManager v 10.08
##SPECTROMETER/DATA SYSTEM=Alpha
##DATE=06 Mar 2015 12:54:54
##DATA TYPE=INFRARED SPECTRUM
##DATA CLASS=XYDATA
##ORIGIN=
##OWNER=
##NPOINTS=540
##FIRSTX=650.55895996
##LASTX=1749.77941895
##MAXX=1749.77941895
##MINX=650.55895996
##MAXY=1.00000000
##MINY=0.83629572
##XFACTOR=1.0000000000
##YFACTOR=0.000000010000000
##FIRSTY=1.00000000
##DELTAX=2.03937006
##XUNITS=1/CM
##YUNITS=ARBITRARY UNITS
##XYDATA=(X++(Y..Y))
$$ plain form
650.6 100000000 99746758 99477029 99193865 98925453 98670411 98391062 98089081 97798240 97539067 97280067
671 97280067 96994418 96694845 96398276 96124059 95870781 95605469 95330793 95037848 94684273 94264376
691.3 94264376 93794882 93275553 92702204 92123663 91593558 91073549 90510958 89922518 89333212 88721955
711.7 88721955 87949938 86793119 85328162 84087050 83629572 84226602 85844338 88134527 90655953
730.1 90655953 93162537 95525271 97531855 98951769 99731237 99683565 99952197 99727386 99418330
748.4 99418330 99097562 98800486 98557317 98360354 98149467 97927636 97746420 97607595 97478467 97330594
768.8 97330594 97176421 97035086 96911794 96816033 96722531 96603018 96473992 96356589 96242571 96134508
789.2 96134508 96099585 96223605 96477437 96711111 96816278 96821433 96827960 96877718 96938539 96991599 97045332
$$ packed form
650.6A00000000k53242k69729k83164k68412k55042k79349l01981k90841k59173k59000
671I7280067k85649k99573k96569k74217k53278k65312k74676k92945l53575m19897
691.3I4264376m69494n19329n73349n78541n30105n20009n62591n88440n89306o11257
711.7H8721955p72017j156819j464957j241112m57478N97030J617736K290189K521426
730.1I0655953K506584K362734K006584J419914P79468m7672K68632k24811l09056
748.4I9418330l20768k97076k43169j96963k10887k21831j81216j38825j29128j47873
768.8I7330594j54173j41335j23292r5761r3502j19513j29026j17403j14018j08063
789.2I6134508l4923J24020K53832K33674J05167N155O527M9758O0821N3060N3733
$$ plain form
811.7 97045332 97100657 97149843 97191340 97208649 97199816 97191930 97178543 97147620 97097808 97013712 96906298 96794283
836.1 96794283 96667588 96525759 96383047 96293801 96375823 96681762 97114921 97520345 97811216 97992635
856.5 97992635 98070365 98036093 97887403 97568017 97001916 96291757 95993447 96674871 97948241 98958880
876.9 98958880 99507600 99812078 99967575 99913430 99945837 99840820 99728203 99632835 99561292 99514830 99492091
899.4 99492091 99498945 99519151 99522996 99508595 99486601 99447751 99378294 99291414 99218160 99157834 99080896 98985839
923.8 98985839 98897874 98830438 98766828 98703003 98650253 98590082 98524666 98482084 98440820 98363668 98264450 98168480
948.3 98168480 98062140 97924185 97761863 97577018 97359037 97121704 96907395 96758115 96697915 96767449
968.7 96767449 96994805 97314429 97609216 97807068 97880834 97838044 97718209 97547340 97355062 97175378
$$ packed form
811.7I7045332N5325M9186M1497J7309q833p886j3387l0923m9812q4096j07414j12015
836.1I6794283j26695j41829j42712q9246Q2022L05939M33159M05424K90871J81419
856.5I7992635P7730l4272j48690l19386n66101p10159k98310O81424J273370J010639
876.9I8958880N48720L04478J55497n4145L2407j05017j12617r5368p1543m6462k2739
899.4I9492091O854K0206L845j4401k1994l8850o9457q6880p3254o0326p6938r5057
923.8I8985839q7965o7436o3610o3825n2750o0171o5416m2582m1264p7152r9218r5970
948.3I8168480j06340j37955j62322j84845k17981k37333k14309j49280o0200O9534
968.7I6767449K27356L19624K94787J97852P3766m2790j19835j70869j92278j79684
$$ plain form
989.1 97175378 96999359 96794200 96542770 96249878 95928979 95585573 95220572 94833434 94379860 93779624
1009.5 93779624 93056542 92464429 92361569 92888570 93838090 94964409 96195900 97283196 97792971
1027.8 97792971 97668922 97230399 96753138 96355909 96045172 95793581 95604873 95470262 95352274 95226419
1048.2 95226419 95080727 94895399 94650096 94334823 93966502 93575507 93162835 92731643 92314637 91918355
1068.6 91918355 91514099 91086942 90644407 90211141 89831674 89550680 89387649 89324814 89319831 89345378
1089 89345378 89401549 89508837 89713961 90047532 90483648 90979367 91500443 92002577 92442954 92796576
1109.4 92796576 93051344 93187302 93206412 93210107 93339247 93641877 94087678 94654244 95330101 96088219
1129.8 96088219 96882224 97651327 98350215 98944074 99397331 99709994 99906534 99906534 99851090 99944502 99857771
$$ packed form
989.1I7175378j76019k05159k51430k92892l20899l43406l65001l87138m53574o00236
1009.5I3779624p23082n92113j02860N27001R49520J126319J231491J087296N09775
1027.8I7792971j24049m38523m77261l97229l10737k51591j88708j34611j17988j25855
1048.2I5226419j45692j85328k45303l15273l68321l90995m12672m31192m17006l96282
1068.6I1918355m04256m27157m42535m33266l79467k80994j63031o2835m983K5547
1089H9345378N6171J07288K05124L33571M36116M95719N21076N02134M40377L53622
1109.4I2796576K54768J35958J9110L695J29140L02630M45801N66566O75857P58118
1129.8I6088219P94005P69103O98888N93859M53257L12663J96540%n5444R3412q6731
$$ plain form
1152.2 99857771 99759781 99646682 99497610 99319720 99130785 98918235 98666978 98392236 98132408 97922045
1172.6 97922045 97770447 97661883 97562194 97431976 97257644 97045600 96781945 96460146 96104670 95722151
1193 95722151 95316857 94929999 94586962 94259953 93904233 93507272 93090802 92664725 92229265 91789496
1213.4 91789496 91345006 90906221 90490919 90102738 89722276 89316785 88872749 88426894 88052428 87808275
1233.8 87808275 87710083 87753236 87938827 88257545 88679868 89160711 89652252 90135109 90599656 91011244
1254.2 91011244 91355348 91661692 91984421 92379957 92862952 93410909 93988889 94557786 95085526 95560557
1274.6 95560557 95990694 96387410 96756363 97102332 97434407 97755861 98067909 98376417 98684746 98982346
1295 98982346 99252868 99491018 99691755 99843454 99943191 99943191 99943191 99943191 99943191 99914843 99971634 99918765 99848586 99740416 99557173
$$ packed form
1152.2I9857771r7990j13099j49072j77890j88935k12550k51257k74742k59828k10363
1172.6I7922045j51598j08564r9689j30218j74332k12044k63655l21799l55476l82519
1193I5722151m05294l86858l43037l27009l55720l96961m16470m26077m35460m39769
1213.4I1789496m44490m38785m15302l88181l80462m05491m44036m45855l74466k44153
1233.8H7808275r8192M3153J85591L18718M22323M80843M91541M82857M64547M11588
1254.2I1011244L44104L06344L22729L95536M82995N47957N77980N68897N27740M75031
1274.6I5560557M30137L96716L68953L45969L32075L21454L12048L08508L08329K97600
1295I8982346K70522K38150K00737J51699R9737%Vk8348N6791n2869p0179j08170j83243
$$ plain form
1325.6 99557173 99262947 98814344 98178566 97403860 96657175 96189719 96239501 96807688 97632998 98436117
1346 98436117 99028361 99367023 99509448 99531609 99491578 99414957 99301422 99145401 98976827 98835868 98736620
1368.4 98736620 98684615 98648894 98605597 98569220 98534065 98475057 98394603 98321158 98274153 98253912 98222739 98135459
1392.9 98135459 97975278 97759408 97484416 97150701 96771508 96391660 96215552 96426684 97014600 97756541
1413.3 97756541 98378539 98794556 99036127 99110949 99072784 98984885 98883921 98774958 98658127 98539376
1433.7 98539376 98418719 98316735 98253363 98201859 98139685 98064184 97989839 97940755 97920382 97914910 97914940 97931200
1458.2 97931200 97947252 97937220 97878438 97755730 97627187 97580445 97701991 97928613 98095709 98190963 98252237
1480.6 98252237 98294669 98309779 98289925 98245519 98207015 98165965 98081815 97917205 97672331 97402471 97191256
$$ packed form
1325.6I9557173k94226m48603o35778p74706p46685m67456M9782N68187Q25310Q03119
1346I8436117N92244L38662J42425K2161m0031p6621j13535j56021j68574j40959r9248
1368.4I8736620n2005l5721m3297l6377l5155n9008q0454p3445m7005k0241l1173q7280
1392.9I8135459j60181k15870k74992l33715l79193l79848j76108K11132N87916P41941
1413.3I7756541O21998M16017K41571P4822l8165q7899j00964j08963j16831j18751
1433.7I8539376j20657j01984o3372n1504o2174p5501p4345m9084k0373n472L0J6260
1458.2I7931200J6052j0032n8782j22708j28543m6742J21546K26622J67096R5254O1274
1480.6I8252237M2432J5110j9854m4406l8504m1050q4150j64610k44874k69860k11215
$$ plain form
1503 97191256 97169912 97510916 97883421 98027611 98057640 98035312 97992456 97948313 97907972 97870010 97837931
1525.5 97837931 97818983 97809720 97789955 97756582 97730935 97714478 97693825 97651285 97586405 97532409 97500002 97477961
1549.9 97477961 97459120 97431517 97397405 97355264 97314513 97290087 97256988 97210610 97152001 97074854 97002202 96942735
1574.4 96942735 96901208 96917933 96979082 97037607 97057295 97047293 97026527 96997255 96962601 96922386 96875280 96823835
1598.9 96823835 96770555 96715403 96657240 96591043 96528625 96480286 96445513 96429068 96415192 96384948 96343565 96287405
1623.4 96287405 96225846 96172011 96115106 96057838 95998609 95926195 95853126 95784646 95712137 95638770 95549911 95434469
1647.8 95434469 95345986 95262474 95135236 95020378 94918597 94797951 94643873 94472474 94318795 94166291
1668.2 94166291 93990308 93826491 93650365 93444902 93249303 93072343 92899507 92670280 92394584 92083329
$$ packed form
1503I7191256k1344L41004L72505J44190L0029k2328m2856m4143m0341l7962l2079
1525.5I7837931j8948r263j9765l3373k5647j6457k0653m2540o4880n3996l2407k2041
1549.9I7477961j8841k7603l4112m2141m0751k4426l3099m6378n8609p7147p2652n9467
1574.4I6942735m1527J6725O1149N8525J9688j0002k0766k9272l4654m0215m7106n1445
1598.9I6823835n3280n5152n8163o6197o2418m8339l4773j6445j3876l0244m1383n6160
1623.4I6287405o1559n3835n6905n7268n9229p2414p3069o8480p2509p3367q8859j15442
1647.8I5434469q8483q3512j27238j14858j01781j20646j54078j71399j53679j52504
1668.2I4166291j75983j63817j76126k05463j95599j76960j72836k29227k75696l11255
$$ plain form
1688.6 92083329 91705406 91313052 90861547 90318543 89769828 89158988 88666809 88307959 88015932 87876695
1709 87876695 87904012 88138771 88645154 89515936 90503991 91274416 91993117 92755908 93510991 94268572
1729.4 94268572 95019686 95910668 96851236 97533906 98162436 98776489 99254954 99609703 99846083 100000000
1749.8 100000000
$$ packed form
1688.6I2083329l77923l92354m51505n43004n48715o10840m92179l58850k92027j39237
1709H7876695K7317K34759N06383Q70782R88055P70425P18701P62791P55083P57581
1729.4I4268572P51114Q90982R40568O82670O28530O14053M78465L54749K36380J53917
1749.8A00000000
##END=$$ End of the data block
